{"text_format":"1","workbook":"xlsx","n_sheets":13,"sheets":["Instructions for use","Version","Licence","Site Data","Chlorophyll Data","Taxa_Data","Chl_PivotTable","Taxa_PivotTable","Taxon EQRs","Classification","Data for Export","UKOptima","LU"],"not_rendered":{"charts":2,"images":1,"macros":1,"external_links":1,"defined_names":4,"comments":3,"pivot_tables":2},"unopened":[],"bounds":{"document_bytes":16777216,"sheet_cells":100000,"rows_first":2000,"rows_last":500,"rows_between":2000,"halvings":0,"cell_chars":16384,"cell_head_chars":4096},"cells_cut":0,"cells_raw":0,"read":"whole","date_system":"1900"}

{"sheet":"Instructions for use","index":0,"n_rows":24,"n_cols":1,"rows_kept":24,"cut":false,"hidden":false,"merged":[]}
["PLUTO Single site calculator"]
["This spreadsheet enables the classification of phytoplankton in lakes using the procedure laid out in the following document:"]
["UKTAG Lake Assessment Method, Phytoplankton, PLUTO method statement"]
["Instructions for use"]
["This calculator spreadsheet enables the classification of one lake at a time."]
["1)  Sheet! Site Data"]
["Enter details of lake in green cells, B2:B7.  "]
["Mean alkalinity, mean depth and humic type must be entered as these are needed to determine reference values for metrics"]
["2)  Sheet! Chlorophyll Data"]
["Enter raw chlorophyll data into columns B14-D14.  Sample date,  qualifier (if it's a < value) and result are required, in that order.  Ensure that all previous data has been either copied over or deleted."]
["Column E14.  Change to \"TRUE\" only if there is a good reason to exclude a data point.  If you want to investigate the impacts of a high value on the overall classification, it is possible to include or exclude the value using column E.  Only finally exclude any value if there is good reason to assume it is an outlier."]
["Click the \"refresh pivot table\" button to update the pivot table which calculates the  values E2:E5.  if the calculations do not appear to have been updated as a result, check the filter (Sheet!Chl_PivotTable cell B1), which may need manually setting to the years of data you have entered."]
["If you only have pre-calculated summary data, enter these values into cells D2:D5"]
["D6  set this cell to \"1\" only if the chlorophyll data is not reasonably evenly spaced throughout the sampling period."]
["Columns K to M show the calculated values for the summary statistics, EQRs and boundary values for chlorophyll."]
["3) Sheet! Taxa_Data"]
["Enter raw species biovolume data into columns A - C.  Required information is date, species code (this is the Whitton Code and is needed to lookup the taxon optima), biovolume data, um3/mL.  Ensure that all previous data has been either copied over or deleted."]
["4) Sheet! Taxa_PivotTable"]
["Click the \"refresh pivot table\" button to update the pivot table which calculates total biovolume for each taxa."]
["Sheet! Taxon EQRs"]
["For each sample with species biovolume data, the observed and expected metric values are shown along with the calculated EQRs, normalised EQRs and status.  These values are all provider per sample."]
["Sheet! Classification"]
["This sheet shows the overall normalised EQR for each of chlorophyll, PTI and cyanobacteria, plus the combinations to calculate the overall lake ERQ and classification.  The overall face value status class for each metric and the combined metrics is given in column O.  Columns Q to U provide the statistical confidence of the EQR falling into each classification band, the \"Confidence of Class\"."]
["To calculate the confidence of being \"worse than good\", for each row, sum the values in columns S, T and U."]

{"sheet":"Version","index":1,"n_rows":36,"n_cols":3,"rows_kept":36,"cut":false,"hidden":false,"merged":[]}
[]
[]
[]
[]
[]
[]
[]
[]
[]
[]
[]
[]
[]
[]
["V2","2012-09-14","Modified confidence of class calculations to use student t distribution as sample sizes are small.  Modifed layout of spreadsheet"]
[null,"To get mEq/L alkalinity from mg/L divide mg/l by 50.045 (SGD)"]
["V2b","2013-03-19","Corrected formula in row 10 of sheet Calc_Taxon_EQRs to prevent -ve Cyan EQR"]
["V2c","2013-03-26","Corrected formula in colD of sheet Chlorophyll Data to calculate correct quarter (October was wrong)"]
[null,"2013-03-26","Added data rule to precent numbers being entered instead of text for taxon codes"]
["V2d","2013-05-24","Correced Site & Taxon sheet to ensure Marl lake type is identified and thus correct PTI normalisation  used"]
[]
["V4c","2013-09-09","Corrected LU table PTI normalisation parameters."]
[null,null,"Corrected equation used to determine ref Cyan in Taxon EQRs"]
[null,null,"Deleted % cyanobacteria from Taxon EQRs"]
[null,null,"Stopped auto run of Pivot Table on open to avoid errors"]
[null,null,"Updated VBA code to unprotect sheets needed when updating pivot tables"]
["V4c_SDamended","2013-09-09","Corrected formula for cyano EQRnorm calc, by referring formula to $B$8, not $B$10"]
[null,null,"Corrected class widths in LU table for HA cyano calcs, I3:I7"]
[null,"2013-09-11","Site data sheet, corrected formula in B9 so that MA lakes are picked up, changed <0.1 to <1"]
["V4d_Sdamended","2013-09-12","Inserted HADC lake type into LU table for PTI, assumed same as shallow lakes"]
[null,"2013-09-12","Changed MP EQR for LAD lakes from 0.15 to 0.17, in LU table cell Y32"]
["V4e_Sdamended","2013-09-24","Added instructions worksheet and edited instructions in \"site data\" and \"chlorophyll data\" worksheets"]
["V4f","2013-02-27","Sheet!TaxonEQRs, corrected formulae in row 12 to enable them to pick up blue-greens down to the end of the taxa list (row 300).  It was previously reading only to row 80"]
["V4g","2014-06-16","Sheet!TaxonEQRs, corrected formula in cell K10, so that it reads to row 300, rather than row 30, which was an error made when previously correcting formulae"]
["V4h","2014-06-26","Chlorophyll pivot table refresh issues resolved and taxon pivot table sort changed."]
[null,"2014-09-17","Instructions updated and licence text added."]

{"sheet":"Licence","index":2,"n_rows":0,"n_cols":0,"rows_kept":0,"cut":false,"hidden":false,"merged":[]}

{"sheet":"Site Data","index":3,"n_rows":12,"n_cols":9,"rows_kept":12,"cut":false,"hidden":false,"merged":[[0,0,0,1]]}
["Site Details"]
["UK Lake WBID",28986,null,null,null,null,null,"Humic Type"]
["Lake Name","Loweswater",null,null,null,null,null,"Clear","C"]
["Mean alkalinity (mEq/L)",0.19800000000000001,null,null,null,null,null,"Humic","H"]
["Mean depth (m)",8.3699999999999992]
["Humic Type (Clear, Humic)","C"]
["Marl Lake",null,null,null,null,null,null,"Marl"]
[]
["Geology Type (LA, MA, HA, Marl)",{"$f":"IF(B4=\"\",\"Enter Alkalinity\",IF(B7=\"Marl\",\"Marl\",IF(B4<0.2,\"LA\",IF(B4>1,\"HA\",\"MA\"))))","v":"LA"}]
["Depth Type (D, S, VS)",{"$f":"IF(B5=\"\",\"Enter mean depth\", IF(B5>15,\"D\",IF(B5<3,\"VS\",\"S\")))","v":"S"}]
["GIG Type",{"$f":"VLOOKUP(($B$9&$B$10&$B$6),LU!$A$29:$B$49,2,FALSE)","v":"L-N2a"}]
["Chl Boundary Type",{"$f":"VLOOKUP(($B$9&$B$10&$B$6),LU!$A$29:$D$49,3,FALSE)","v":4}]

{"sheet":"Chlorophyll Data","index":4,"n_rows":86,"n_cols":19,"rows_kept":86,"cut":false,"hidden":false,"merged":[[0,1,0,3],[5,1,5,2],[1,1,1,2],[2,1,2,2],[3,1,3,2],[4,1,4,2]]}
[null,"Enter Summary Data",null,null,"Calculate from data below",null,null,null,null,null,{"$f":"'Site Data'!B3 &\" (WB\"&'Site Data'!B2&\")\"","v":"Loweswater (WB28986)"}]
[null,"Mean Log10 Chl",null,null,{"$f":"Chl_PivotTable!B17","v":0.67968168515791305},null,null,null,null,null,"Reference Chlorophyll a (ug/l)",null,{"$f":"10^(0.223+0.166*LOG('Site Data'!B4)+0.684*SQRT(1/'Site Data'!B5))","v":2.2012603348627282}]
[null,"StDev Log10 Chl",null,null,{"$f":"Chl_PivotTable!B18","v":0.33088946549756265},null,null,null,null,null,"Min Reference allowed",null,{"$f":"VLOOKUP('Site Data'!$B$11,LU!$F$27:$J$35,4)","v":1.3271742831127644}]
[null,"Count Chl",null,null,{"$f":"Chl_PivotTable!B19","v":36},null,null,null,null,null,"Max Reference allowed",null,{"$f":"VLOOKUP('Site Data'!$B$11,LU!$F$27:$J$35,5)","v":2.211957138521274}]
[null,"Years of data",null,null,{"$f":"Chl_PivotTable!B20","v":3},null,null,null,null,null,"Reference used",null,{"$f":"IF(M2<M3,M3,IF(M2>M4,M4,M2))","v":2.2012603348627282}]
[null,"Set to 1 if chlorophyll samples are not at regular intervals",null,null,null,null,null,null,null,null,"Chlorophyll EQR","ChlEQR",{"$f":"M5/M15","v":0.4602456821654512}]
[null,null,null,null,null,null,null,null,null,null,"Normalised chlorophyll EQR","ChlEQRnorm",{"$f":"IF('Site Data'!$B12=1,((M6-VLOOKUP(M6,LU!$M$29:$O$34,1))/VLOOKUP(M6,LU!$M$29:$O$34,2)*0.2)+VLOOKUP(M6,LU!$M$29:$O$34,3),IF('Site Data'!$B12=2,((M6-VLOOKUP(M6,LU!$P$29:$R$34,1))/VLOOKUP(M6,LU!$P$29:$R$34,2)*0.2)+VLOOKUP(M6,LU!$P$29:$R$34,3),IF('Site Data'!$B12=3,((M6-VLOOKUP(M6,LU!$S$29:$U$34,1))/VLOOKUP(M6,LU!$S$29:$U$34,2)*0.2)+VLOOKUP(M6,LU!$S$29:$U$34,3),IF('Site Data'!$B12=4,((M6-VLOOKUP(M6,LU!$V$29:$X$34,1))/VLOOKUP(M6,LU!$V$29:$X$34,2)*0.2)+VLOOKUP(M6,LU!$V$29:$X$34,3),((M6-VLOOKUP(M6,LU!$Y$29:$AA$34,1))/VLOOKUP(M6,LU!$Y$29:$AA$34,2)*0.2)+VLOOKUP(M6,LU!$Y$29:$AA$34,3)))))","v":0.69728324695168642}]
[null,null,null,null,null,null,null,null,null,null,"Lower 95th confidence limit chlorophyll","L95CL",{"$f":"10^($M$18-TINV(0.05,($M$20-1))*$M$16)","v":4.1293011673299977}]
[null,null,null,null,null,null,null,null,null,null,"Upper 95th confidence limit chlorophyll EQR","U95EQR",{"$f":"M5/M8","v":0.53308301953816095}]
[null,null,null,null,null,null,null,null,null,null,"Upper 95th confidence limit normalised chlorophyll EQR","U95EQRnorm",{"$f":"IF('Site Data'!$B12=1,((M9-VLOOKUP(M9,LU!$M$29:$O$34,1))/VLOOKUP(M9,LU!$M$29:$O$34,2)*0.2)+VLOOKUP(M9,LU!$M$29:$O$34,3),IF('Site Data'!$B12=2,((M9-VLOOKUP(M9,LU!$P$29:$R$34,1))/VLOOKUP(M9,LU!$P$29:$R$34,2)*0.2)+VLOOKUP(M9,LU!$P$29:$R$34,3),IF('Site Data'!$B12=3,((M9-VLOOKUP(M9,LU!$S$29:$U$34,1))/VLOOKUP(M9,LU!$S$29:$U$34,2)*0.2)+VLOOKUP(M9,LU!$S$29:$U$34,3),IF('Site Data'!$B12=4,((M9-VLOOKUP(M9,LU!$V$29:$X$34,1))/VLOOKUP(M9,LU!$V$29:$X$34,2)*0.2)+VLOOKUP(M9,LU!$V$29:$X$34,3),((M9-VLOOKUP(M9,LU!$Y$29:$AA$34,1))/VLOOKUP(M9,LU!$Y$29:$AA$34,2)*0.2)+VLOOKUP(M9,LU!$Y$29:$AA$34,3)))))","v":0.73890458259323477}]
[null,null,null,null,null,null,null,null,null,null,"Upper 95th confidence limit chlorophyll","U95CL",{"$f":"10^($M$18+TINV(0.05,($M$20-1))*$M$16)","v":5.5397072071898732}]
[null,null,null,null,null,null,null,null,null,null,"Lower 95th confidence limit chlorophyll EQR","L95EQR",{"$f":"M5/M11","v":0.39736041139606754}]
[null,"SAMPLE_DATE","Qualifier","RESULT","Exclude","Month","Year","Chl used","Log10Chl",null,"Lower 95th confidence limit normalised chlorophyll EQR","L95EQRnorm",{"$f":"IF('Site Data'!$B12=1,((M12-VLOOKUP(M12,LU!$M$29:$O$34,1))/VLOOKUP(M12,LU!$M$29:$O$34,2)*0.2)+VLOOKUP(M12,LU!$M$29:$O$34,3),IF('Site Data'!$B12=2,((M12-VLOOKUP(M12,LU!$P$29:$R$34,1))/VLOOKUP(M12,LU!$P$29:$R$34,2)*0.2)+VLOOKUP(M12,LU!$P$29:$R$34,3),IF('Site Data'!$B12=3,((M12-VLOOKUP(M12,LU!$S$29:$U$34,1))/VLOOKUP(M12,LU!$S$29:$U$34,2)*0.2)+VLOOKUP(M12,LU!$S$29:$U$34,3),IF('Site Data'!$B12=4,((M12-VLOOKUP(M12,LU!$V$29:$X$34,1))/VLOOKUP(M12,LU!$V$29:$X$34,2)*0.2)+VLOOKUP(M12,LU!$V$29:$X$34,3),((M12-VLOOKUP(M12,LU!$Y$29:$AA$34,1))/VLOOKUP(M12,LU!$Y$29:$AA$34,2)*0.2)+VLOOKUP(M12,LU!$Y$29:$AA$34,3)))))","v":0.66134880651203853}]
[1,"2010-01-22","",2.7,false,{"$f":"IF(B14=\"\",\"\",IF(E14=TRUE,\"\",MONTH(B14)))","v":1},{"$f":"IF(B14=\"\",\"\",YEAR(B14))","v":2010},{"$f":"IF(B14=\"\",\"\",IF(E14=TRUE,\"\",IF(C14=\"<\",D14/2,D14)))","v":2.7},{"$f":"IF(H14=\"\",\"\",LOG(H14))","v":0.43136376415898736},null,"Standard error normalised chlorophyll EQR","SEEQRnorm",{"$f":"(M10-M13)/(2*TINV(0.05,(M20-1)))","v":1.9101392345193681E-2}]
[2,"2010-02-18","",8.5,false,2,{"$f":"IF(B15=\"\",\"\",YEAR(B15))","v":2010},{"$f":"IF(B15=\"\",\"\",IF(E15=TRUE,\"\",IF(C15=\"<\",D15/2,D15)))","v":8.5},{"$f":"IF(H15=\"\",\"\",LOG(H15))","v":0.92941892571429274},null,"Geometric mean chlorophyll concentration (ug/l)","GeoMean Chl",{"$f":"10^(M18)","v":4.7827941035879382}]
[3,"2010-03-24","",13.8,false,3,2010,13.8,1.1398790864012365,null,"Adjusted standard error log10 transformed chlorophyll","AdjSE Chl",{"$f":"IF(D6=1,M17,M17*1.0293*M21^-0.2379)","v":3.1429425654673132E-2}]
[4,"2010-04-29","",7.5,false,{"$f":"IF(B17=\"\",\"\",IF(E17=TRUE,\"\",MONTH(B17)))","v":4},2010,7.5,0.87506126339170009,null,"Standard error log10 transformed chlorophyll concentration","SE LogChl",{"$f":"M19/SQRT(M20)","v":5.5148244249593775E-2}]
[5,"2010-05-24","",2.6,false,{"$f":"IF(B18=\"\",\"\",IF(E18=TRUE,\"\",MONTH(B18)))","v":5},2010,2.6,0.41497334797081797,null,"Mean log10 transformed chlorophyll concentration","mean LogChl",{"$f":"IF(ISNUMBER(D2),D2,E2)","v":0.67968168515791305}]
[6,"2010-06-21","",2.2999999999999998,false,6,2010,2.2999999999999998,0.36172783601759284,null,"Standard deviation log10 transformed chlorophyll concentration","StDev LogChl",{"$f":"IF(ISNUMBER(D3),D3,E3)","v":0.33088946549756265}]
[7,"2010-07-07","",2.8,false,7,2010,2.8,0.44715803134221921,null,"Number of chlorophyll samples","N",{"$f":"IF(ISNUMBER(D4),D4,E4)","v":36}]
[8,"2010-08-12","",6.7,false,8,2010,6.7,0.82607480270082645,null,"Number of chlorophyll samples per year","N/yr",{"$f":"IF(ISNUMBER(D5),ROUND(M20/D5,0),ROUND(M20/E5,0))","v":12}]
[9,"2010-09-03","",7.7,false,9,2010,7.7,0.88649072517248184,null,"Site specific boundary values"]
[10,"2010-10-08","",10,false,10,2010,10,1,null,"HG Chlorophyll boundary (geometric mean)","ug/l",{"$f":"IF('Site Data'!B$12=1,'Chlorophyll Data'!M$5/LU!M33,IF('Site Data'!B$12=2,'Chlorophyll Data'!M$5/LU!P33,IF('Site Data'!B$12=3,'Chlorophyll Data'!M$5/LU!S33,IF('Site Data'!B$12=4,'Chlorophyll Data'!M$5/LU!V33,IF('Site Data'!B$12=5,'Chlorophyll Data'!M$5/LU!Y33)))))","v":3.4394692732230125}]
[11,"2010-11-03","",7.7,false,11,2010,7.7,0.88649072517248184,null,"GM Chlorophyll boundary (geometric mean)","ug/l",{"$f":"IF('Site Data'!B$12=1,'Chlorophyll Data'!M$5/LU!M32,IF('Site Data'!B$12=2,'Chlorophyll Data'!M$5/LU!P32,IF('Site Data'!B$12=3,'Chlorophyll Data'!M$5/LU!S32,IF('Site Data'!B$12=4,'Chlorophyll Data'!M$5/LU!V32,IF('Site Data'!B$12=5,'Chlorophyll Data'!M$5/LU!Y32)))))","v":7.590552878836994}]
[12,"2010-12-13","<",0.5,false,12,2010,0.25,-0.6020599913279624,null,"MP Chlorophyll boundary (geometric mean)","ug/l",{"$f":"IF('Site Data'!B$12=1,'Chlorophyll Data'!M$5/LU!M31,IF('Site Data'!B$12=2,'Chlorophyll Data'!M$5/LU!P31,IF('Site Data'!B$12=3,'Chlorophyll Data'!M$5/LU!S31,IF('Site Data'!B$12=4,'Chlorophyll Data'!M$5/LU!V31,IF('Site Data'!B$12=5,'Chlorophyll Data'!M$5/LU!Y31)))))","v":14.675068899084856}]
[13,"2011-01-31","",4.0999999999999996,false,1,2011,4.0999999999999996,0.61278385671973545,null,"PB Chlorophyll boundary (geometric mean)","ug/l",{"$f":"IF('Site Data'!B$12=1,'Chlorophyll Data'!M$5/LU!M30,IF('Site Data'!B$12=2,'Chlorophyll Data'!M$5/LU!P30,IF('Site Data'!B$12=3,'Chlorophyll Data'!M$5/LU!S30,IF('Site Data'!B$12=4,'Chlorophyll Data'!M$5/LU!V30,IF('Site Data'!B$12=5,'Chlorophyll Data'!M$5/LU!Y30)))))","v":44.025206697254561}]
[14,"2011-02-22","",1.9,false,2,2011,1.9,0.27875360095282892]
[15,"2011-03-22","",5.2,false,3,2011,5.2,0.71600334363479923]
[16,"2011-04-15","",8.6999999999999993,false,4,2011,8.6999999999999993,0.93951925261861846]
[17,"2011-05-10","",13.3,false,5,2011,13.3,1.1238516409670858]
[18,"2011-06-22","",7.2,false,6,2011,7.2,0.85733249643126852]
[19,"2011-07-22","",7.6,false,7,2011,7.6,0.88081359228079137]
[20,"2011-08-25","",5.9,false,8,2011,5.9,0.77085201164214423]
[21,"2011-09-27","",4.3,false,9,2011,4.3,0.63346845557958653]
[22,"2011-10-19","",6.1,false,10,2011,6.1,0.78532983501076703]
[23,"2011-11-15","",6.6,false,11,2011,6.6,0.81954393554186866]
[24,"2011-12-14","",3.1,false,12,2011,3.1,0.49136169383427269]
[25,"2012-01-17","",2.6,false,1,2012,2.6,0.41497334797081797]
[26,"2012-02-21","",4.2,false,2,2012,4.2,0.62324929039790045]
[27,"2012-03-23","",8.6,false,3,2012,8.6,0.93449845124356767]
[28,"2012-04-17","",11.2,false,4,2012,11.2,1.0492180226701815]
[29,"2012-05-30","",3.6,false,5,2012,3.6,0.55630250076728727]
[30,"2012-06-26","",7.3,false,6,2012,7.3,0.86332286012045589]
[31,"2012-07-24","",1.9,false,7,2012,1.9,0.27875360095282892]
[32,"2012-08-21","",13.3,false,8,2012,13.3,1.1238516409670858]
[33,"2012-09-26","",3.3,false,9,2012,3.3,0.51851393987788741,null,null,null,null,null,null,null,null,null,{"$f":"AVERAGE(Chl_PivotTable!B3:D14)","v":0.67968168515791305}]
[34,"2012-10-23","",4.5,false,10,2012,4.5,0.65321251377534373]
[35,"2012-11-27","",2.6,false,11,2012,2.6,0.41497334797081797]
[36,"2012-12-12","",3.4,false,12,2012,3.4,0.53147891704225514]
[37,null,null,null,null,"","","",""]
[38,null,null,null,null,"","","",""]
[39,null,null,null,null,"","","",""]
[40,null,null,null,null,"","","",""]
[41,null,null,null,null,"","","",""]
[42,null,null,null,null,"","","",""]
[43,null,null,null,null,"","","",""]
[44,null,null,null,null,"","","",""]
[45,null,null,null,null,"","","",""]
[46,null,null,null,null,"","","",""]
[47,null,null,null,null,"","","",""]
[48,null,null,null,null,"","","",""]
[49,null,null,null,null,"","","",""]
[50,null,null,null,null,"","","",""]
[51,null,null,null,null,"","","",""]
[52,null,null,null,null,"","","",""]
[53,null,null,null,null,"","","",""]
[54,null,null,null,null,"","","",""]
[55,null,null,null,null,"","","",""]
[56,null,null,null,null,"","","",""]
[57,null,null,null,null,"","","",""]
[58,null,null,null,null,"","","",""]
[59,null,null,null,null,"","","",""]
[60,null,null,null,null,"","","",""]
[61,null,null,null,null,"","","",""]
[62,null,null,null,null,"","","",""]
[63,null,null,null,null,"","","",""]
[64,null,null,null,null,"","","",""]
[65,null,null,null,null,"","","",""]
[66,null,null,null,null,"",{"$f":"IF(B79=\"\",\"\",YEAR(B79))","v":""},{"$f":"IF(B79=\"\",\"\",IF(E79=TRUE,\"\",IF(C79=\"<\",D79/2,D79)))","v":""},{"$f":"IF(H79=\"\",\"\",LOG(H79))","v":""}]
[67,null,null,null,null,"","","",""]
[68,null,null,null,null,"","","",""]
[69,null,null,null,null,{"$f":"IF(B82=\"\",\"\",IF(E82=TRUE,\"\",MONTH(B82)))","v":""},"","",""]
[70,null,null,null,null,"","","",""]
[71,null,null,null,null,"","","",""]
[72,null,null,null,null,"","","",""]
[73,null,null,null,null,"","","",""]

{"sheet":"Taxa_Data","index":5,"n_rows":327,"n_cols":5,"rows_kept":327,"cut":false,"hidden":false,"merged":[]}
["Date","SpeciesCode","BioVol",null,"Taxa Name"]
["2010-07-07","01020000",114004.89887719243,null,{"$f":"VLOOKUP(B2,UKOptima!A:D,4,FALSE)","v":"Anabaena"}]
["2010-07-07","01530000",214663.19901731593,null,{"$f":"VLOOKUP(B3,UKOptima!A:D,4,FALSE)","v":"Oscillatoria"}]
["2010-07-07","01780000",411637.1541384022,null,{"$f":"VLOOKUP(B4,UKOptima!A:D,4,FALSE)","v":"Woronichinia"}]
["2010-07-07","04100000",1160.907486544987,null,{"$f":"VLOOKUP(B5,UKOptima!A:D,4,FALSE)","v":"Trachelomonas"}]
["2010-07-07","05040001",330.21368506168517,null,{"$f":"VLOOKUP(B6,UKOptima!A:D,4,FALSE)","v":"Cryptomonas (small) Length <20 µm"}]
["2010-07-07","05040002",87263.589269141172,null,{"$f":"VLOOKUP(B7,UKOptima!A:D,4,FALSE)","v":"Cryptomonas (medium) Length 20-30 µm"}]
["2010-07-07","05040003",27813.021562644804,null,{"$f":"VLOOKUP(B8,UKOptima!A:D,4,FALSE)","v":"Cryptomonas (large) Length >30 µm"}]
["2010-07-07","05100012",29871.293980819581,null,{"$f":"VLOOKUP(B9,UKOptima!A:D,4,FALSE)","v":"Rhodomonas lacustris var. nannoplanctica"}]
["2010-07-07","06020040",399310.52505046898,null,{"$f":"VLOOKUP(B10,UKOptima!A:D,4,FALSE)","v":"Ceratium hirundinella"}]
["2010-07-07","06110050",76081.233038212275,null,{"$f":"VLOOKUP(B11,UKOptima!A:D,4,FALSE)","v":"Peridinium cinctum"}]
["2010-07-07","08010000",1088.2620443464207,null,{"$f":"VLOOKUP(B12,UKOptima!A:D,4,FALSE)","v":"Chrysochromulina"}]
["2010-07-07","09310000",13410.80328456769,null,{"$f":"VLOOKUP(B13,UKOptima!A:D,4,FALSE)","v":"Mallomonas"}]
["2010-07-07","17000000",1485.9615827775835,null,{"$f":"VLOOKUP(B14,UKOptima!A:D,4,FALSE)","v":"Chlorococcales"}]
["2010-07-07","17960030",3031.0399653979243,null,{"$f":"VLOOKUP(B15,UKOptima!A:D,4,FALSE)","v":"Tetraedron minimum"}]
["2010-07-07","25010000",136.21314508794515,null,{"$f":"VLOOKUP(B16,UKOptima!A:D,4,FALSE)","v":"Elakatothrix"}]
["2010-07-07","90000000",772.82453882279538,null,{"$f":"VLOOKUP(B17,UKOptima!A:D,4,FALSE)","v":"Picoplankton - unidentified single cells <2 µm diam."}]
["2010-08-12","01020000",31383.371039227128,null,{"$f":"VLOOKUP(B18,UKOptima!A:D,4,FALSE)","v":"Anabaena"}]
["2010-08-12","01530000",31349.661725543741,null,{"$f":"VLOOKUP(B19,UKOptima!A:D,4,FALSE)","v":"Oscillatoria"}]
["2010-08-12","01780000",842837.26213684736,null,{"$f":"VLOOKUP(B20,UKOptima!A:D,4,FALSE)","v":"Woronichinia"}]
["2010-08-12","05040001",8118.2260534090938,null,{"$f":"VLOOKUP(B21,UKOptima!A:D,4,FALSE)","v":"Cryptomonas (small) Length <20 µm"}]
["2010-08-12","05040002",75581.949946399007,null,{"$f":"VLOOKUP(B22,UKOptima!A:D,4,FALSE)","v":"Cryptomonas (medium) Length 20-30 µm"}]
["2010-08-12","05100012",26219.37898414777,null,{"$f":"VLOOKUP(B23,UKOptima!A:D,4,FALSE)","v":"Rhodomonas lacustris var. nannoplanctica"}]
["2010-08-12","06020040",463837.72134235204,null,{"$f":"VLOOKUP(B24,UKOptima!A:D,4,FALSE)","v":"Ceratium hirundinella"}]
["2010-08-12","06070000",648141.61518298567,null,{"$f":"VLOOKUP(B25,UKOptima!A:D,4,FALSE)","v":"Gymnodinium"}]
["2010-08-12","06110050",110294.81053648893,null,{"$f":"VLOOKUP(B26,UKOptima!A:D,4,FALSE)","v":"Peridinium cinctum"}]
["2010-08-12","08010000",2369.0058108221397,null,{"$f":"VLOOKUP(B27,UKOptima!A:D,4,FALSE)","v":"Chrysochromulina"}]
["2010-08-12","09230050",396.25642207402228,null,{"$f":"VLOOKUP(B28,UKOptima!A:D,4,FALSE)","v":"Dinobryon divergens"}]
["2010-08-12","09310000",27734.853791884107,null,{"$f":"VLOOKUP(B29,UKOptima!A:D,4,FALSE)","v":"Mallomonas"}]
["2010-08-12","17000000",26984.456813895937,null,{"$f":"VLOOKUP(B30,UKOptima!A:D,4,FALSE)","v":"Chlorococcales"}]
["2010-08-12","17000000",3379.8746556417914,null,{"$f":"VLOOKUP(B31,UKOptima!A:D,4,FALSE)","v":"Chlorococcales"}]
["2010-08-12","17080000",14747.824736478909,null,{"$f":"VLOOKUP(B32,UKOptima!A:D,4,FALSE)","v":"Botryococcus"}]
["2010-08-12","17960030",5880.9244809688589,null,{"$f":"VLOOKUP(B33,UKOptima!A:D,4,FALSE)","v":"Tetraedron minimum"}]
["2010-08-12","27360040",1434.2379051303142,null,{"$f":"VLOOKUP(B34,UKOptima!A:D,4,FALSE)","v":"Spondylosium planum"}]
["2010-08-12","27370000",1398.0562364130135,null,{"$f":"VLOOKUP(B35,UKOptima!A:D,4,FALSE)","v":"Staurastrum"}]
["2010-08-12","90000000",294.00549442184075,null,{"$f":"VLOOKUP(B36,UKOptima!A:D,4,FALSE)","v":"Picoplankton - unidentified single cells <2 µm diam."}]
["2010-08-12","90000003",19788.831355316201,null,{"$f":"VLOOKUP(B37,UKOptima!A:D,4,FALSE)","v":"Nanoplankton - unidentified single cells 2-20 µm diameter"}]
["2010-08-12","90000005",1184.5029054110698,null,{"$f":"VLOOKUP(B38,UKOptima!A:D,4,FALSE)","v":"Nanoplankton - unidentified flagellates 2-20 µm diameter"}]
["2010-09-13","01020000",52104.486160401029,null,{"$f":"VLOOKUP(B39,UKOptima!A:D,4,FALSE)","v":"Anabaena"}]
["2010-09-13","01020000",32201.022450949804,null,{"$f":"VLOOKUP(B40,UKOptima!A:D,4,FALSE)","v":"Anabaena"}]
["2010-09-13","01530000",30338.38231504233,null,{"$f":"VLOOKUP(B41,UKOptima!A:D,4,FALSE)","v":"Oscillatoria"}]
["2010-09-13","01780000",1347920.4882312252,null,{"$f":"VLOOKUP(B42,UKOptima!A:D,4,FALSE)","v":"Woronichinia"}]
["2010-09-13","04100000",45464.552924098345,null,{"$f":"VLOOKUP(B43,UKOptima!A:D,4,FALSE)","v":"Trachelomonas"}]
["2010-09-13","05040001",2256.804153843455,null,{"$f":"VLOOKUP(B44,UKOptima!A:D,4,FALSE)","v":"Cryptomonas (small) Length <20 µm"}]
["2010-09-13","05040002",110568.36505675544,null,{"$f":"VLOOKUP(B45,UKOptima!A:D,4,FALSE)","v":"Cryptomonas (medium) Length 20-30 µm"}]
["2010-09-13","05100012",20300.806630824485,null,{"$f":"VLOOKUP(B46,UKOptima!A:D,4,FALSE)","v":"Rhodomonas lacustris var. nannoplanctica"}]
["2010-09-13","06020040",278034.81252638716,null,{"$f":"VLOOKUP(B47,UKOptima!A:D,4,FALSE)","v":"Ceratium hirundinella"}]
["2010-09-13","06110050",51155.60337747274,null,{"$f":"VLOOKUP(B48,UKOptima!A:D,4,FALSE)","v":"Peridinium cinctum"}]
["2010-09-13","08010000",15901.739481950519,null,{"$f":"VLOOKUP(B49,UKOptima!A:D,4,FALSE)","v":"Chrysochromulina"}]
["2010-09-13","09230050",61609.948504068983,null,{"$f":"VLOOKUP(B50,UKOptima!A:D,4,FALSE)","v":"Dinobryon divergens"}]
["2010-09-13","09310000",4339.2142052637073,null,{"$f":"VLOOKUP(B51,UKOptima!A:D,4,FALSE)","v":"Mallomonas"}]
["2010-09-13","12000002",24485.895997794465,null,{"$f":"VLOOKUP(B52,UKOptima!A:D,4,FALSE)","v":"Medium centric diatom (10-20 µm diam.)"}]
["2010-09-13","12030000",5572.3559354159379,null,{"$f":"VLOOKUP(B53,UKOptima!A:D,4,FALSE)","v":"Aulacoseira"}]
["2010-09-13","13080010",2554.1798163520575,null,{"$f":"VLOOKUP(B54,UKOptima!A:D,4,FALSE)","v":"Asterionella formosa"}]
["2010-09-13","17000000",18952.046486577117,null,{"$f":"VLOOKUP(B55,UKOptima!A:D,4,FALSE)","v":"Chlorococcales"}]
["2010-09-13","17080000",67597.493112835829,null,{"$f":"VLOOKUP(B56,UKOptima!A:D,4,FALSE)","v":"Botryococcus"}]
["2010-09-13","17580020",249.85608161014756,null,{"$f":"VLOOKUP(B57,UKOptima!A:D,4,FALSE)","v":"Monoraphidium contortum"}]
["2010-09-13","17780000",201.99790265882774,null,{"$f":"VLOOKUP(B58,UKOptima!A:D,4,FALSE)","v":"Quadrigula"}]
["2010-09-13","17960030",1908.7598615916959,null,{"$f":"VLOOKUP(B59,UKOptima!A:D,4,FALSE)","v":"Tetraedron minimum"}]
["2010-09-13","24170000",2476.6026379626392,null,{"$f":"VLOOKUP(B60,UKOptima!A:D,4,FALSE)","v":"Gloeotila"}]
["2010-09-13","25010000",111.44711870831877,null,{"$f":"VLOOKUP(B61,UKOptima!A:D,4,FALSE)","v":"Elakatothrix"}]
["2010-09-13","27370000",1255.1666210738611,null,{"$f":"VLOOKUP(B62,UKOptima!A:D,4,FALSE)","v":"Staurastrum"}]
["2010-09-13","90000000",20299.144678191129,null,{"$f":"VLOOKUP(B63,UKOptima!A:D,4,FALSE)","v":"Picoplankton - unidentified single cells <2 µm diam."}]
["2010-09-13","90000005",2826.9759079023142,null,{"$f":"VLOOKUP(B64,UKOptima!A:D,4,FALSE)","v":"Nanoplankton - unidentified flagellates 2-20 µm diameter"}]
["2011-09-27","01020000",12104.144637025307,null,{"$f":"VLOOKUP(B65,UKOptima!A:D,4,FALSE)","v":"Anabaena"}]
["2011-09-27","01530000",16559.700346960606,null,{"$f":"VLOOKUP(B66,UKOptima!A:D,4,FALSE)","v":"Oscillatoria"}]
["2011-09-27","01780000",53698.797388726533,null,{"$f":"VLOOKUP(B67,UKOptima!A:D,4,FALSE)","v":"Woronichinia"}]
["2011-09-27","01780000",192430.4090932793,null,{"$f":"VLOOKUP(B68,UKOptima!A:D,4,FALSE)","v":"Woronichinia"}]
["2011-09-27","04100000",7163.9600994691154,null,{"$f":"VLOOKUP(B69,UKOptima!A:D,4,FALSE)","v":"Trachelomonas"}]
["2011-09-27","05040001",1104.495982013616,null,{"$f":"VLOOKUP(B70,UKOptima!A:D,4,FALSE)","v":"Cryptomonas (small) Length <20 µm"}]
["2011-09-27","05040002",21569.029566333182,null,{"$f":"VLOOKUP(B71,UKOptima!A:D,4,FALSE)","v":"Cryptomonas (medium) Length 20-30 µm"}]
["2011-09-27","05100000",6285.6016832796358,null,{"$f":"VLOOKUP(B72,UKOptima!A:D,4,FALSE)","v":"Rhodomonas"}]
["2011-09-27","06020040",37606.698762239757,null,{"$f":"VLOOKUP(B73,UKOptima!A:D,4,FALSE)","v":"Ceratium hirundinella"}]
["2011-09-27","06070110",22891.375771724117,null,{"$f":"VLOOKUP(B74,UKOptima!A:D,4,FALSE)","v":"Gymnodinium helveticum"}]
["2011-09-27","06110050",40468.031076898129,null,{"$f":"VLOOKUP(B75,UKOptima!A:D,4,FALSE)","v":"Peridinium cinctum"}]
["2011-09-27","12000002",83088.251850112283,null,{"$f":"VLOOKUP(B76,UKOptima!A:D,4,FALSE)","v":"Medium centric diatom (10-20 µm diam.)"}]
["2011-09-27","12000003",17242.107565495895,null,{"$f":"VLOOKUP(B77,UKOptima!A:D,4,FALSE)","v":"Large centric diatom (>20 µm diam.)"}]
["2011-09-27","12030000",15111.42956057952,null,{"$f":"VLOOKUP(B78,UKOptima!A:D,4,FALSE)","v":"Aulacoseira"}]
["2011-09-27","13370040",29357.301345972413,null,{"$f":"VLOOKUP(B79,UKOptima!A:D,4,FALSE)","v":"Fragilaria crotonensis"}]
["2011-09-27","13820020",1182.4906557185452,null,{"$f":"VLOOKUP(B80,UKOptima!A:D,4,FALSE)","v":"Tabellaria flocculosa"}]
["2011-09-27","17000000",11366.138231024586,null,{"$f":"VLOOKUP(B81,UKOptima!A:D,4,FALSE)","v":"Chlorococcales"}]
["2011-09-27","17000000",1408.9117229298568,null,{"$f":"VLOOKUP(B82,UKOptima!A:D,4,FALSE)","v":"Chlorococcales"}]
["2011-09-27","25010000",126.4099263126764,null,{"$f":"VLOOKUP(B83,UKOptima!A:D,4,FALSE)","v":"Elakatothrix"}]
["2011-09-27","27370000",3953.5518569829801,null,{"$f":"VLOOKUP(B84,UKOptima!A:D,4,FALSE)","v":"Staurastrum"}]
["2011-09-27","90000003",2385.260922292578,null,{"$f":"VLOOKUP(B85,UKOptima!A:D,4,FALSE)","v":"Nanoplankton - unidentified single cells 2-20 µm diameter"}]
["2011-09-27","90000005",819.93344203807374,null,{"$f":"VLOOKUP(B86,UKOptima!A:D,4,FALSE)","v":"Nanoplankton - unidentified flagellates 2-20 µm diameter"}]
["2012-07-24","01020000",1376.4602311627552,null,{"$f":"VLOOKUP(B87,UKOptima!A:D,4,FALSE)","v":"Anabaena"}]
["2012-07-24","01040020",27789.247255847957,null,{"$f":"VLOOKUP(B88,UKOptima!A:D,4,FALSE)","v":"Aphanizomenon flos-aquae"}]
["2012-07-24","01530000",445378.89684295387,null,{"$f":"VLOOKUP(B89,UKOptima!A:D,4,FALSE)","v":"Oscillatoria"}]
["2012-07-24","01780000",62783.44115609712,null,{"$f":"VLOOKUP(B90,UKOptima!A:D,4,FALSE)","v":"Woronichinia"}]
["2012-07-24","01780000",1096424.009679019,null,{"$f":"VLOOKUP(B91,UKOptima!A:D,4,FALSE)","v":"Woronichinia"}]
["2012-07-24","05040001",52305.718098675541,null,{"$f":"VLOOKUP(B92,UKOptima!A:D,4,FALSE)","v":"Cryptomonas (small) Length <20 µm"}]
["2012-07-24","05040002",55418.432997101721,null,{"$f":"VLOOKUP(B93,UKOptima!A:D,4,FALSE)","v":"Cryptomonas (medium) Length 20-30 µm"}]
["2012-07-24","05100012",26142.349279580259,null,{"$f":"VLOOKUP(B94,UKOptima!A:D,4,FALSE)","v":"Rhodomonas lacustris var. nannoplanctica"}]
["2012-07-24","06020040",196673.9705509143,null,{"$f":"VLOOKUP(B95,UKOptima!A:D,4,FALSE)","v":"Ceratium hirundinella"}]
["2012-07-24","06070110",111737.45967344586,null,{"$f":"VLOOKUP(B96,UKOptima!A:D,4,FALSE)","v":"Gymnodinium helveticum"}]
["2012-07-24","12000002",44974.094689826568,null,{"$f":"VLOOKUP(B97,UKOptima!A:D,4,FALSE)","v":"Medium centric diatom (10-20 µm diam.)"}]
["2012-07-24","12200010",15.478728130526614,null,{"$f":"VLOOKUP(B98,UKOptima!A:D,4,FALSE)","v":"Urosolenia eriensis"}]
["2012-07-24","13370040",84005.898830936902,null,{"$f":"VLOOKUP(B99,UKOptima!A:D,4,FALSE)","v":"Fragilaria crotonensis"}]
["2012-07-24","13820010",37839.607215342839,null,{"$f":"VLOOKUP(B100,UKOptima!A:D,4,FALSE)","v":"Tabellaria fenestrata"}]
["2012-07-24","13820020",11824.877254794637,null,{"$f":"VLOOKUP(B101,UKOptima!A:D,4,FALSE)","v":"Tabellaria flocculosa"}]
["2012-07-24","17000000",15616.005100634222,null,{"$f":"VLOOKUP(B102,UKOptima!A:D,4,FALSE)","v":"Chlorococcales"}]
["2012-07-24","17580020",185.0785789704797,null,{"$f":"VLOOKUP(B103,UKOptima!A:D,4,FALSE)","v":"Monoraphidium contortum"}]
["2012-07-24","17960030",4418.425605536333,null,{"$f":"VLOOKUP(B104,UKOptima!A:D,4,FALSE)","v":"Tetraedron minimum"}]
["2012-07-24","25010000",330.21286678456772,null,{"$f":"VLOOKUP(B105,UKOptima!A:D,4,FALSE)","v":"Elakatothrix"}]
["2012-07-24","27050000",8528.4352281839274,null,{"$f":"VLOOKUP(B106,UKOptima!A:D,4,FALSE)","v":"Cosmarium"}]
["2012-07-24","27370000",949.80544311043263,null,{"$f":"VLOOKUP(B107,UKOptima!A:D,4,FALSE)","v":"Staurastrum"}]
["2012-07-24","16490000",3146.1950000000002,null,{"$f":"VLOOKUP(B108,UKOptima!A:D,4,FALSE)","v":"Paulschulzia"}]
["2012-08-21","01020000",114966.91169971511,null,{"$f":"VLOOKUP(B109,UKOptima!A:D,4,FALSE)","v":"Anabaena"}]
["2012-08-21","01040020",61639.735133119313,null,{"$f":"VLOOKUP(B110,UKOptima!A:D,4,FALSE)","v":"Aphanizomenon flos-aquae"}]
["2012-08-21","01530000",490258.61600750999,null,{"$f":"VLOOKUP(B111,UKOptima!A:D,4,FALSE)","v":"Oscillatoria"}]
["2012-08-21","01780000",1744824.8977983445,null,{"$f":"VLOOKUP(B112,UKOptima!A:D,4,FALSE)","v":"Woronichinia"}]
["2012-08-21","04100000",2348.1803860235927,null,{"$f":"VLOOKUP(B113,UKOptima!A:D,4,FALSE)","v":"Trachelomonas"}]
["2012-08-21","05040001",52586.399035442402,null,{"$f":"VLOOKUP(B114,UKOptima!A:D,4,FALSE)","v":"Cryptomonas (small) Length <20 µm"}]
["2012-08-21","05040002",137887.3169960987,null,{"$f":"VLOOKUP(B115,UKOptima!A:D,4,FALSE)","v":"Cryptomonas (medium) Length 20-30 µm"}]
["2012-08-21","05100012",11845.029054110699,null,{"$f":"VLOOKUP(B116,UKOptima!A:D,4,FALSE)","v":"Rhodomonas lacustris var. nannoplanctica"}]
["2012-08-21","06020040",21040.043359908334,null,{"$f":"VLOOKUP(B117,UKOptima!A:D,4,FALSE)","v":"Ceratium hirundinella"}]
["2012-08-21","06070000",386486.64283243782,null,{"$f":"VLOOKUP(B118,UKOptima!A:D,4,FALSE)","v":"Gymnodinium"}]
["2012-08-21","06070110",46358.217464700152,null,{"$f":"VLOOKUP(B119,UKOptima!A:D,4,FALSE)","v":"Gymnodinium helveticum"}]
["2012-08-21","08010000",30124.277890414338,null,{"$f":"VLOOKUP(B120,UKOptima!A:D,4,FALSE)","v":"Chrysochromulina"}]
["2012-08-21","09230050",2749.022115981526,null,{"$f":"VLOOKUP(B121,UKOptima!A:D,4,FALSE)","v":"Dinobryon divergens"}]
["2012-08-21","12000003",7227.7061076153432,null,{"$f":"VLOOKUP(B122,UKOptima!A:D,4,FALSE)","v":"Large centric diatom (>20 µm diam.)"}]
["2012-08-21","17000000",18952.046486577117,null,{"$f":"VLOOKUP(B123,UKOptima!A:D,4,FALSE)","v":"Chlorococcales"}]
["2012-08-21","17580000",1998.8486528811804,null,{"$f":"VLOOKUP(B124,UKOptima!A:D,4,FALSE)","v":"Monoraphidium"}]
["2012-08-21","17960030",49701.279003460229,null,{"$f":"VLOOKUP(B125,UKOptima!A:D,4,FALSE)","v":"Tetraedron minimum"}]
["2012-08-21","27050000",24497.391877191134,null,{"$f":"VLOOKUP(B126,UKOptima!A:D,4,FALSE)","v":"Cosmarium"}]
["2012-08-21","27370000",5222.3659413176783,null,{"$f":"VLOOKUP(B127,UKOptima!A:D,4,FALSE)","v":"Staurastrum"}]
["2012-08-21","90000005",44144.054278859767,null,{"$f":"VLOOKUP(B128,UKOptima!A:D,4,FALSE)","v":"Nanoplankton - unidentified flagellates 2-20 µm diameter"}]
["2012-09-26","01020000",4045.1176420056436,null,{"$f":"VLOOKUP(B129,UKOptima!A:D,4,FALSE)","v":"Anabaena"}]
["2012-09-26","01040020",79723.26640226008,null,{"$f":"VLOOKUP(B130,UKOptima!A:D,4,FALSE)","v":"Aphanizomenon flos-aquae"}]
["2012-09-26","01530000",195166.81343266735,null,{"$f":"VLOOKUP(B131,UKOptima!A:D,4,FALSE)","v":"Oscillatoria"}]
["2012-09-26","01780000",142723.63810262136,null,{"$f":"VLOOKUP(B132,UKOptima!A:D,4,FALSE)","v":"Woronichinia"}]
["2012-09-26","01780000",425706.79069602239,null,{"$f":"VLOOKUP(B133,UKOptima!A:D,4,FALSE)","v":"Woronichinia"}]
["2012-09-26","05040001",9371.464382050628,null,{"$f":"VLOOKUP(B134,UKOptima!A:D,4,FALSE)","v":"Cryptomonas (small) Length <20 µm"}]
["2012-09-26","05040002",42069.2234768587,null,{"$f":"VLOOKUP(B135,UKOptima!A:D,4,FALSE)","v":"Cryptomonas (medium) Length 20-30 µm"}]
["2012-09-26","05100000",15820.220804670253,null,{"$f":"VLOOKUP(B136,UKOptima!A:D,4,FALSE)","v":"Rhodomonas"}]
["2012-09-26","06070110",29089.073873225621,null,{"$f":"VLOOKUP(B137,UKOptima!A:D,4,FALSE)","v":"Gymnodinium helveticum"}]
["2012-09-26","09230050",2655.5990936213889,null,{"$f":"VLOOKUP(B138,UKOptima!A:D,4,FALSE)","v":"Dinobryon divergens"}]
["2012-09-26","09310000",1934.8458109083119,null,{"$f":"VLOOKUP(B139,UKOptima!A:D,4,FALSE)","v":"Mallomonas"}]
["2012-09-26","12000002",35535.0871623321,null,{"$f":"VLOOKUP(B140,UKOptima!A:D,4,FALSE)","v":"Medium centric diatom (10-20 µm diam.)"}]
["2012-09-26","12200010",97.516228869778928,null,{"$f":"VLOOKUP(B141,UKOptima!A:D,4,FALSE)","v":"Urosolenia eriensis"}]
["2012-09-26","13370040",434460.31080633745,null,{"$f":"VLOOKUP(B142,UKOptima!A:D,4,FALSE)","v":"Fragilaria crotonensis"}]
["2012-09-26","13820010",64563.989802232572,null,{"$f":"VLOOKUP(B143,UKOptima!A:D,4,FALSE)","v":"Tabellaria fenestrata"}]
["2012-09-26","13820020",22204.546757381569,null,{"$f":"VLOOKUP(B144,UKOptima!A:D,4,FALSE)","v":"Tabellaria flocculosa"}]
["2012-09-26","17000000",3997.6973057623609,null,{"$f":"VLOOKUP(B145,UKOptima!A:D,4,FALSE)","v":"Chlorococcales"}]
["2012-09-26","17060000",60.539175594642288,null,{"$f":"VLOOKUP(B146,UKOptima!A:D,4,FALSE)","v":"Ankyra lanceolata"}]
["2012-09-26","17960030",9819.1379179930827,null,{"$f":"VLOOKUP(B147,UKOptima!A:D,4,FALSE)","v":"Tetraedron minimum"}]
["2012-09-26","24170000",1783.1538993331003,null,{"$f":"VLOOKUP(B148,UKOptima!A:D,4,FALSE)","v":"Gloeotila"}]
["2012-09-26","27370000",1499.1659642242089,null,{"$f":"VLOOKUP(B149,UKOptima!A:D,4,FALSE)","v":"Staurastrum"}]
["2012-09-26","27370000",1382.7662775737972,null,{"$f":"VLOOKUP(B150,UKOptima!A:D,4,FALSE)","v":"Staurastrum"}]
[null,null,null,null,{"$f":"VLOOKUP(B151,UKOptima!A:D,4,FALSE)","v":{"$error":"#N/A"}}]
[null,null,null,null,{"$f":"VLOOKUP(B152,UKOptima!A:D,4,FALSE)","v":{"$error":"#N/A"}}]
[null,null,null,null,{"$f":"VLOOKUP(B153,UKOptima!A:D,4,FALSE)","v":{"$error":"#N/A"}}]
[null,null,null,null,{"$f":"VLOOKUP(B154,UKOptima!A:D,4,FALSE)","v":{"$error":"#N/A"}}]
[null,null,null,null,{"$f":"VLOOKUP(B155,UKOptima!A:D,4,FALSE)","v":{"$error":"#N/A"}}]
[null,null,null,null,{"$f":"VLOOKUP(B156,UKOptima!A:D,4,FALSE)","v":{"$error":"#N/A"}}]
[null,null,null,null,{"$f":"VLOOKUP(B157,UKOptima!A:D,4,FALSE)","v":{"$error":"#N/A"}}]
[null,null,null,null,{"$f":"VLOOKUP(B158,UKOptima!A:D,4,FALSE)","v":{"$error":"#N/A"}}]
[null,null,null,null,{"$f":"VLOOKUP(B159,UKOptima!A:D,4,FALSE)","v":{"$error":"#N/A"}}]
[null,null,null,null,{"$f":"VLOOKUP(B160,UKOptima!A:D,4,FALSE)","v":{"$error":"#N/A"}}]
[null,null,null,null,{"$f":"VLOOKUP(B161,UKOptima!A:D,4,FALSE)","v":{"$error":"#N/A"}}]
[null,null,null,null,{"$f":"VLOOKUP(B162,UKOptima!A:D,4,FALSE)","v":{"$error":"#N/A"}}]
[null,null,null,null,{"$f":"VLOOKUP(B163,UKOptima!A:D,4,FALSE)","v":{"$error":"#N/A"}}]
[null,null,null,null,{"$f":"VLOOKUP(B164,UKOptima!A:D,4,FALSE)","v":{"$error":"#N/A"}}]
[null,null,null,null,{"$f":"VLOOKUP(B165,UKOptima!A:D,4,FALSE)","v":{"$error":"#N/A"}}]
[null,null,null,null,{"$f":"VLOOKUP(B166,UKOptima!A:D,4,FALSE)","v":{"$error":"#N/A"}}]
[null,null,null,null,{"$f":"VLOOKUP(B167,UKOptima!A:D,4,FALSE)","v":{"$error":"#N/A"}}]
[null,null,null,null,{"$f":"VLOOKUP(B168,UKOptima!A:D,4,FALSE)","v":{"$error":"#N/A"}}]
[null,null,null,null,{"$f":"VLOOKUP(B169,UKOptima!A:D,4,FALSE)","v":{"$error":"#N/A"}}]
[null,null,null,null,{"$f":"VLOOKUP(B170,UKOptima!A:D,4,FALSE)","v":{"$error":"#N/A"}}]
[null,null,null,null,{"$f":"VLOOKUP(B171,UKOptima!A:D,4,FALSE)","v":{"$error":"#N/A"}}]
[null,null,null,null,{"$f":"VLOOKUP(B172,UKOptima!A:D,4,FALSE)","v":{"$error":"#N/A"}}]
[null,null,null,null,{"$f":"VLOOKUP(B173,UKOptima!A:D,4,FALSE)","v":{"$error":"#N/A"}}]
[null,null,null,null,{"$f":"VLOOKUP(B174,UKOptima!A:D,4,FALSE)","v":{"$error":"#N/A"}}]
[null,null,null,null,{"$f":"VLOOKUP(B175,UKOptima!A:D,4,FALSE)","v":{"$error":"#N/A"}}]
[null,null,null,null,{"$f":"VLOOKUP(B176,UKOptima!A:D,4,FALSE)","v":{"$error":"#N/A"}}]
[null,null,null,null,{"$f":"VLOOKUP(B177,UKOptima!A:D,4,FALSE)","v":{"$error":"#N/A"}}]
[null,null,null,null,{"$f":"VLOOKUP(B178,UKOptima!A:D,4,FALSE)","v":{"$error":"#N/A"}}]
[null,null,null,null,{"$f":"VLOOKUP(B179,UKOptima!A:D,4,FALSE)","v":{"$error":"#N/A"}}]
[null,null,null,null,{"$f":"VLOOKUP(B180,UKOptima!A:D,4,FALSE)","v":{"$error":"#N/A"}}]
[null,null,null,null,{"$f":"VLOOKUP(B181,UKOptima!A:D,4,FALSE)","v":{"$error":"#N/A"}}]
[null,null,null,null,{"$f":"VLOOKUP(B182,UKOptima!A:D,4,FALSE)","v":{"$error":"#N/A"}}]
[null,null,null,null,{"$f":"VLOOKUP(B183,UKOptima!A:D,4,FALSE)","v":{"$error":"#N/A"}}]
[null,null,null,null,{"$f":"VLOOKUP(B184,UKOptima!A:D,4,FALSE)","v":{"$error":"#N/A"}}]
[null,null,null,null,{"$f":"VLOOKUP(B185,UKOptima!A:D,4,FALSE)","v":{"$error":"#N/A"}}]
[null,null,null,null,{"$f":"VLOOKUP(B186,UKOptima!A:D,4,FALSE)","v":{"$error":"#N/A"}}]
[null,null,null,null,{"$f":"VLOOKUP(B187,UKOptima!A:D,4,FALSE)","v":{"$error":"#N/A"}}]
[null,null,null,null,{"$f":"VLOOKUP(B188,UKOptima!A:D,4,FALSE)","v":{"$error":"#N/A"}}]
[null,null,null,null,{"$f":"VLOOKUP(B189,UKOptima!A:D,4,FALSE)","v":{"$error":"#N/A"}}]
[null,null,null,null,{"$f":"VLOOKUP(B190,UKOptima!A:D,4,FALSE)","v":{"$error":"#N/A"}}]
[null,null,null,null,{"$f":"VLOOKUP(B191,UKOptima!A:D,4,FALSE)","v":{"$error":"#N/A"}}]
[null,null,null,null,{"$f":"VLOOKUP(B192,UKOptima!A:D,4,FALSE)","v":{"$error":"#N/A"}}]
[null,null,null,null,{"$f":"VLOOKUP(B193,UKOptima!A:D,4,FALSE)","v":{"$error":"#N/A"}}]
[null,null,null,null,{"$f":"VLOOKUP(B194,UKOptima!A:D,4,FALSE)","v":{"$error":"#N/A"}}]
[null,null,null,null,{"$f":"VLOOKUP(B195,UKOptima!A:D,4,FALSE)","v":{"$error":"#N/A"}}]
[null,null,null,null,{"$f":"VLOOKUP(B196,UKOptima!A:D,4,FALSE)","v":{"$error":"#N/A"}}]
[null,null,null,null,{"$f":"VLOOKUP(B197,UKOptima!A:D,4,FALSE)","v":{"$error":"#N/A"}}]
[null,null,null,null,{"$f":"VLOOKUP(B198,UKOptima!A:D,4,FALSE)","v":{"$error":"#N/A"}}]
[null,null,null,null,{"$f":"VLOOKUP(B199,UKOptima!A:D,4,FALSE)","v":{"$error":"#N/A"}}]
[null,null,null,null,{"$f":"VLOOKUP(B200,UKOptima!A:D,4,FALSE)","v":{"$error":"#N/A"}}]
[null,null,null,null,{"$f":"VLOOKUP(B201,UKOptima!A:D,4,FALSE)","v":{"$error":"#N/A"}}]
[null,null,null,null,{"$f":"VLOOKUP(B202,UKOptima!A:D,4,FALSE)","v":{"$error":"#N/A"}}]
[null,null,null,null,{"$f":"VLOOKUP(B203,UKOptima!A:D,4,FALSE)","v":{"$error":"#N/A"}}]
[null,null,null,null,{"$f":"VLOOKUP(B204,UKOptima!A:D,4,FALSE)","v":{"$error":"#N/A"}}]
[null,null,null,null,{"$f":"VLOOKUP(B205,UKOptima!A:D,4,FALSE)","v":{"$error":"#N/A"}}]
[null,null,null,null,{"$f":"VLOOKUP(B206,UKOptima!A:D,4,FALSE)","v":{"$error":"#N/A"}}]
[null,null,null,null,{"$f":"VLOOKUP(B207,UKOptima!A:D,4,FALSE)","v":{"$error":"#N/A"}}]
[null,null,null,null,{"$f":"VLOOKUP(B208,UKOptima!A:D,4,FALSE)","v":{"$error":"#N/A"}}]
[null,null,null,null,{"$f":"VLOOKUP(B209,UKOptima!A:D,4,FALSE)","v":{"$error":"#N/A"}}]
[null,null,null,null,{"$f":"VLOOKUP(B210,UKOptima!A:D,4,FALSE)","v":{"$error":"#N/A"}}]
[null,null,null,null,{"$f":"VLOOKUP(B211,UKOptima!A:D,4,FALSE)","v":{"$error":"#N/A"}}]
[null,null,null,null,{"$f":"VLOOKUP(B212,UKOptima!A:D,4,FALSE)","v":{"$error":"#N/A"}}]
[null,null,null,null,{"$f":"VLOOKUP(B213,UKOptima!A:D,4,FALSE)","v":{"$error":"#N/A"}}]
[null,null,null,null,{"$f":"VLOOKUP(B214,UKOptima!A:D,4,FALSE)","v":{"$error":"#N/A"}}]
[null,null,null,null,{"$f":"VLOOKUP(B215,UKOptima!A:D,4,FALSE)","v":{"$error":"#N/A"}}]
[null,null,null,null,{"$f":"VLOOKUP(B216,UKOptima!A:D,4,FALSE)","v":{"$error":"#N/A"}}]
[null,null,null,null,{"$f":"VLOOKUP(B217,UKOptima!A:D,4,FALSE)","v":{"$error":"#N/A"}}]
[null,null,null,null,{"$f":"VLOOKUP(B218,UKOptima!A:D,4,FALSE)","v":{"$error":"#N/A"}}]
[null,null,null,null,{"$f":"VLOOKUP(B219,UKOptima!A:D,4,FALSE)","v":{"$error":"#N/A"}}]
[null,null,null,null,{"$f":"VLOOKUP(B220,UKOptima!A:D,4,FALSE)","v":{"$error":"#N/A"}}]
[null,null,null,null,{"$f":"VLOOKUP(B221,UKOptima!A:D,4,FALSE)","v":{"$error":"#N/A"}}]
[null,null,null,null,{"$f":"VLOOKUP(B222,UKOptima!A:D,4,FALSE)","v":{"$error":"#N/A"}}]
[null,null,null,null,{"$f":"VLOOKUP(B223,UKOptima!A:D,4,FALSE)","v":{"$error":"#N/A"}}]
[null,null,null,null,{"$f":"VLOOKUP(B224,UKOptima!A:D,4,FALSE)","v":{"$error":"#N/A"}}]
[null,null,null,null,{"$f":"VLOOKUP(B225,UKOptima!A:D,4,FALSE)","v":{"$error":"#N/A"}}]
[null,null,null,null,{"$f":"VLOOKUP(B226,UKOptima!A:D,4,FALSE)","v":{"$error":"#N/A"}}]
[null,null,null,null,{"$f":"VLOOKUP(B227,UKOptima!A:D,4,FALSE)","v":{"$error":"#N/A"}}]
[null,null,null,null,{"$f":"VLOOKUP(B228,UKOptima!A:D,4,FALSE)","v":{"$error":"#N/A"}}]
[null,null,null,null,{"$f":"VLOOKUP(B229,UKOptima!A:D,4,FALSE)","v":{"$error":"#N/A"}}]
[null,null,null,null,{"$f":"VLOOKUP(B230,UKOptima!A:D,4,FALSE)","v":{"$error":"#N/A"}}]
[null,null,null,null,{"$f":"VLOOKUP(B231,UKOptima!A:D,4,FALSE)","v":{"$error":"#N/A"}}]
[null,null,null,null,{"$f":"VLOOKUP(B232,UKOptima!A:D,4,FALSE)","v":{"$error":"#N/A"}}]
[null,null,null,null,{"$f":"VLOOKUP(B233,UKOptima!A:D,4,FALSE)","v":{"$error":"#N/A"}}]
[null,null,null,null,{"$f":"VLOOKUP(B234,UKOptima!A:D,4,FALSE)","v":{"$error":"#N/A"}}]
[null,null,null,null,{"$f":"VLOOKUP(B235,UKOptima!A:D,4,FALSE)","v":{"$error":"#N/A"}}]
[null,null,null,null,{"$f":"VLOOKUP(B236,UKOptima!A:D,4,FALSE)","v":{"$error":"#N/A"}}]
[null,null,null,null,{"$f":"VLOOKUP(B237,UKOptima!A:D,4,FALSE)","v":{"$error":"#N/A"}}]
[null,null,null,null,{"$f":"VLOOKUP(B238,UKOptima!A:D,4,FALSE)","v":{"$error":"#N/A"}}]
[null,null,null,null,{"$f":"VLOOKUP(B239,UKOptima!A:D,4,FALSE)","v":{"$error":"#N/A"}}]
[null,null,null,null,{"$f":"VLOOKUP(B240,UKOptima!A:D,4,FALSE)","v":{"$error":"#N/A"}}]
[null,null,null,null,{"$f":"VLOOKUP(B241,UKOptima!A:D,4,FALSE)","v":{"$error":"#N/A"}}]
[null,null,null,null,{"$f":"VLOOKUP(B242,UKOptima!A:D,4,FALSE)","v":{"$error":"#N/A"}}]
[null,null,null,null,{"$f":"VLOOKUP(B243,UKOptima!A:D,4,FALSE)","v":{"$error":"#N/A"}}]
[null,null,null,null,{"$f":"VLOOKUP(B244,UKOptima!A:D,4,FALSE)","v":{"$error":"#N/A"}}]
[null,null,null,null,{"$f":"VLOOKUP(B245,UKOptima!A:D,4,FALSE)","v":{"$error":"#N/A"}}]
[null,null,null,null,{"$f":"VLOOKUP(B246,UKOptima!A:D,4,FALSE)","v":{"$error":"#N/A"}}]
[null,null,null,null,{"$f":"VLOOKUP(B247,UKOptima!A:D,4,FALSE)","v":{"$error":"#N/A"}}]
[null,null,null,null,{"$f":"VLOOKUP(B248,UKOptima!A:D,4,FALSE)","v":{"$error":"#N/A"}}]
[null,null,null,null,{"$f":"VLOOKUP(B249,UKOptima!A:D,4,FALSE)","v":{"$error":"#N/A"}}]
[null,null,null,null,{"$f":"VLOOKUP(B250,UKOptima!A:D,4,FALSE)","v":{"$error":"#N/A"}}]
[null,null,null,null,{"$f":"VLOOKUP(B251,UKOptima!A:D,4,FALSE)","v":{"$error":"#N/A"}}]
[null,null,null,null,{"$f":"VLOOKUP(B252,UKOptima!A:D,4,FALSE)","v":{"$error":"#N/A"}}]
[null,null,null,null,{"$f":"VLOOKUP(B253,UKOptima!A:D,4,FALSE)","v":{"$error":"#N/A"}}]
[null,null,null,null,{"$f":"VLOOKUP(B254,UKOptima!A:D,4,FALSE)","v":{"$error":"#N/A"}}]
[null,null,null,null,{"$f":"VLOOKUP(B255,UKOptima!A:D,4,FALSE)","v":{"$error":"#N/A"}}]
[null,null,null,null,{"$f":"VLOOKUP(B256,UKOptima!A:D,4,FALSE)","v":{"$error":"#N/A"}}]
[null,null,null,null,{"$f":"VLOOKUP(B257,UKOptima!A:D,4,FALSE)","v":{"$error":"#N/A"}}]
[null,null,null,null,{"$f":"VLOOKUP(B258,UKOptima!A:D,4,FALSE)","v":{"$error":"#N/A"}}]
[null,null,null,null,{"$f":"VLOOKUP(B259,UKOptima!A:D,4,FALSE)","v":{"$error":"#N/A"}}]
[null,null,null,null,{"$f":"VLOOKUP(B260,UKOptima!A:D,4,FALSE)","v":{"$error":"#N/A"}}]
[null,null,null,null,{"$f":"VLOOKUP(B261,UKOptima!A:D,4,FALSE)","v":{"$error":"#N/A"}}]
[null,null,null,null,{"$f":"VLOOKUP(B262,UKOptima!A:D,4,FALSE)","v":{"$error":"#N/A"}}]
[null,null,null,null,{"$f":"VLOOKUP(B263,UKOptima!A:D,4,FALSE)","v":{"$error":"#N/A"}}]
[null,null,null,null,{"$f":"VLOOKUP(B264,UKOptima!A:D,4,FALSE)","v":{"$error":"#N/A"}}]
[null,null,null,null,{"$f":"VLOOKUP(B265,UKOptima!A:D,4,FALSE)","v":{"$error":"#N/A"}}]
[null,null,null,null,{"$f":"VLOOKUP(B266,UKOptima!A:D,4,FALSE)","v":{"$error":"#N/A"}}]
[null,null,null,null,{"$f":"VLOOKUP(B267,UKOptima!A:D,4,FALSE)","v":{"$error":"#N/A"}}]
[null,null,null,null,{"$f":"VLOOKUP(B268,UKOptima!A:D,4,FALSE)","v":{"$error":"#N/A"}}]
[null,null,null,null,{"$f":"VLOOKUP(B269,UKOptima!A:D,4,FALSE)","v":{"$error":"#N/A"}}]
[null,null,null,null,{"$f":"VLOOKUP(B270,UKOptima!A:D,4,FALSE)","v":{"$error":"#N/A"}}]
[null,null,null,null,{"$f":"VLOOKUP(B271,UKOptima!A:D,4,FALSE)","v":{"$error":"#N/A"}}]
[null,null,null,null,{"$f":"VLOOKUP(B272,UKOptima!A:D,4,FALSE)","v":{"$error":"#N/A"}}]
[null,null,null,null,{"$f":"VLOOKUP(B273,UKOptima!A:D,4,FALSE)","v":{"$error":"#N/A"}}]
[null,null,null,null,{"$f":"VLOOKUP(B274,UKOptima!A:D,4,FALSE)","v":{"$error":"#N/A"}}]
[null,null,null,null,{"$f":"VLOOKUP(B275,UKOptima!A:D,4,FALSE)","v":{"$error":"#N/A"}}]
[null,null,null,null,{"$f":"VLOOKUP(B276,UKOptima!A:D,4,FALSE)","v":{"$error":"#N/A"}}]
[null,null,null,null,{"$f":"VLOOKUP(B277,UKOptima!A:D,4,FALSE)","v":{"$error":"#N/A"}}]
[null,null,null,null,{"$f":"VLOOKUP(B278,UKOptima!A:D,4,FALSE)","v":{"$error":"#N/A"}}]
[null,null,null,null,{"$f":"VLOOKUP(B279,UKOptima!A:D,4,FALSE)","v":{"$error":"#N/A"}}]
[null,null,null,null,{"$f":"VLOOKUP(B280,UKOptima!A:D,4,FALSE)","v":{"$error":"#N/A"}}]
[null,null,null,null,{"$f":"VLOOKUP(B281,UKOptima!A:D,4,FALSE)","v":{"$error":"#N/A"}}]
[null,null,null,null,{"$f":"VLOOKUP(B282,UKOptima!A:D,4,FALSE)","v":{"$error":"#N/A"}}]
[null,null,null,null,{"$f":"VLOOKUP(B283,UKOptima!A:D,4,FALSE)","v":{"$error":"#N/A"}}]
[null,null,null,null,{"$f":"VLOOKUP(B284,UKOptima!A:D,4,FALSE)","v":{"$error":"#N/A"}}]
[null,null,null,null,{"$f":"VLOOKUP(B285,UKOptima!A:D,4,FALSE)","v":{"$error":"#N/A"}}]
[null,null,null,null,{"$f":"VLOOKUP(B286,UKOptima!A:D,4,FALSE)","v":{"$error":"#N/A"}}]
[null,null,null,null,{"$f":"VLOOKUP(B287,UKOptima!A:D,4,FALSE)","v":{"$error":"#N/A"}}]
[null,null,null,null,{"$f":"VLOOKUP(B288,UKOptima!A:D,4,FALSE)","v":{"$error":"#N/A"}}]
[null,null,null,null,{"$f":"VLOOKUP(B289,UKOptima!A:D,4,FALSE)","v":{"$error":"#N/A"}}]
[null,null,null,null,{"$f":"VLOOKUP(B290,UKOptima!A:D,4,FALSE)","v":{"$error":"#N/A"}}]
[null,null,null,null,{"$f":"VLOOKUP(B291,UKOptima!A:D,4,FALSE)","v":{"$error":"#N/A"}}]
[null,null,null,null,{"$f":"VLOOKUP(B292,UKOptima!A:D,4,FALSE)","v":{"$error":"#N/A"}}]
[null,null,null,null,{"$f":"VLOOKUP(B293,UKOptima!A:D,4,FALSE)","v":{"$error":"#N/A"}}]
[null,null,null,null,{"$f":"VLOOKUP(B294,UKOptima!A:D,4,FALSE)","v":{"$error":"#N/A"}}]
[null,null,null,null,{"$f":"VLOOKUP(B295,UKOptima!A:D,4,FALSE)","v":{"$error":"#N/A"}}]
[null,null,null,null,{"$f":"VLOOKUP(B296,UKOptima!A:D,4,FALSE)","v":{"$error":"#N/A"}}]
[null,null,null,null,{"$f":"VLOOKUP(B297,UKOptima!A:D,4,FALSE)","v":{"$error":"#N/A"}}]
[null,null,null,null,{"$f":"VLOOKUP(B298,UKOptima!A:D,4,FALSE)","v":{"$error":"#N/A"}}]
[null,null,null,null,{"$f":"VLOOKUP(B299,UKOptima!A:D,4,FALSE)","v":{"$error":"#N/A"}}]
[null,null,null,null,{"$f":"VLOOKUP(B300,UKOptima!A:D,4,FALSE)","v":{"$error":"#N/A"}}]
[null,null,null,null,{"$f":"VLOOKUP(B301,UKOptima!A:D,4,FALSE)","v":{"$error":"#N/A"}}]
[null,null,null,null,{"$f":"VLOOKUP(B302,UKOptima!A:D,4,FALSE)","v":{"$error":"#N/A"}}]
[null,null,null,null,{"$f":"VLOOKUP(B303,UKOptima!A:D,4,FALSE)","v":{"$error":"#N/A"}}]
[null,null,null,null,{"$f":"VLOOKUP(B304,UKOptima!A:D,4,FALSE)","v":{"$error":"#N/A"}}]
[null,null,null,null,{"$f":"VLOOKUP(B305,UKOptima!A:D,4,FALSE)","v":{"$error":"#N/A"}}]
[null,null,null,null,{"$f":"VLOOKUP(B306,UKOptima!A:D,4,FALSE)","v":{"$error":"#N/A"}}]
[null,null,null,null,{"$f":"VLOOKUP(B307,UKOptima!A:D,4,FALSE)","v":{"$error":"#N/A"}}]
[null,null,null,null,{"$f":"VLOOKUP(B308,UKOptima!A:D,4,FALSE)","v":{"$error":"#N/A"}}]
[null,null,null,null,{"$f":"VLOOKUP(B309,UKOptima!A:D,4,FALSE)","v":{"$error":"#N/A"}}]
[null,null,null,null,{"$f":"VLOOKUP(B310,UKOptima!A:D,4,FALSE)","v":{"$error":"#N/A"}}]
[null,null,null,null,{"$f":"VLOOKUP(B311,UKOptima!A:D,4,FALSE)","v":{"$error":"#N/A"}}]
[null,null,null,null,{"$f":"VLOOKUP(B312,UKOptima!A:D,4,FALSE)","v":{"$error":"#N/A"}}]
[null,null,null,null,{"$f":"VLOOKUP(B313,UKOptima!A:D,4,FALSE)","v":{"$error":"#N/A"}}]
[null,null,null,null,{"$f":"VLOOKUP(B314,UKOptima!A:D,4,FALSE)","v":{"$error":"#N/A"}}]
[null,null,null,null,{"$f":"VLOOKUP(B315,UKOptima!A:D,4,FALSE)","v":{"$error":"#N/A"}}]
[null,null,null,null,{"$f":"VLOOKUP(B316,UKOptima!A:D,4,FALSE)","v":{"$error":"#N/A"}}]
[null,null,null,null,{"$f":"VLOOKUP(B317,UKOptima!A:D,4,FALSE)","v":{"$error":"#N/A"}}]
[null,null,null,null,{"$f":"VLOOKUP(B318,UKOptima!A:D,4,FALSE)","v":{"$error":"#N/A"}}]
[null,null,null,null,{"$f":"VLOOKUP(B319,UKOptima!A:D,4,FALSE)","v":{"$error":"#N/A"}}]
[null,null,null,null,{"$f":"VLOOKUP(B320,UKOptima!A:D,4,FALSE)","v":{"$error":"#N/A"}}]
[null,null,null,null,{"$f":"VLOOKUP(B321,UKOptima!A:D,4,FALSE)","v":{"$error":"#N/A"}}]
[null,null,null,null,{"$f":"VLOOKUP(B322,UKOptima!A:D,4,FALSE)","v":{"$error":"#N/A"}}]
[null,null,null,null,{"$f":"VLOOKUP(B323,UKOptima!A:D,4,FALSE)","v":{"$error":"#N/A"}}]
[null,null,null,null,{"$f":"VLOOKUP(B324,UKOptima!A:D,4,FALSE)","v":{"$error":"#N/A"}}]
[null,null,null,null,{"$f":"VLOOKUP(B325,UKOptima!A:D,4,FALSE)","v":{"$error":"#N/A"}}]
[null,null,null,null,{"$f":"VLOOKUP(B326,UKOptima!A:D,4,FALSE)","v":{"$error":"#N/A"}}]
[null,null,null,null,{"$f":"VLOOKUP(B327,UKOptima!A:D,4,FALSE)","v":{"$error":"#N/A"}}]

{"sheet":"Chl_PivotTable","index":6,"n_rows":20,"n_cols":4,"rows_kept":20,"cut":false,"hidden":false,"merged":[]}
["Average of Log10Chl","Column Labels"]
["Row Labels",2010,2011,2012]
[1,0.43136376415898736,0.61278385671973545,0.41497334797081797]
[2,0.92941892571429274,0.27875360095282892,0.62324929039790045]
[3,1.1398790864012365,0.71600334363479923,0.93449845124356767]
[4,0.87506126339170009,0.93951925261861846,1.0492180226701815]
[5,0.41497334797081797,1.1238516409670858,0.55630250076728727]
[6,0.36172783601759284,0.85733249643126852,0.86332286012045589]
[7,0.44715803134221921,0.88081359228079137,0.27875360095282892]
[8,0.82607480270082645,0.77085201164214423,1.1238516409670858]
[9,0.88649072517248184,0.63346845557958653,0.51851393987788741]
[10,1,0.78532983501076703,0.65321251377534373]
[11,0.88649072517248184,0.81954393554186866,0.41497334797081797]
[12,-0.6020599913279624,0.49136169383427269,0.53147891704225514]
[]
[]
["Average",{"$f":"AVERAGE($B$3:$I$14)","v":0.67968168515791305}]
["Standard Deviation",{"$f":"STDEV($B$3:$I$14)","v":0.33088946549756265}]
["Count",{"$f":"COUNT($B$3:$I$14)","v":36}]
["Years",{"$f":"COUNT(B2:I2)","v":3}]

{"sheet":"Taxa_PivotTable","index":7,"n_rows":301,"n_cols":10,"rows_kept":301,"cut":false,"hidden":false,"merged":[[17,1,17,10]]}
[{"$f":"'Site Data'!$B$3&\" (WB\"&'Site Data'!$B$2&\")\"","v":"Loweswater (WB28986)"}]
[]
["Warnings: ",{"$f":"IF(OR(MONTH(MIN(C20:K20))<7,MONTH(MAX(C20:K20))>9),\"Month out of range !\",\"Months in range\")","v":"Months in range"}]
[null,{"$f":"IF(B301=\"\",\"Data within range of sheet\",\"Data exceeds range of sheet\")","v":"Data within range of sheet"}]
[]
[]
["Data below are created using a pivot table which takes data in list form from sheet \"Taxa_Data\""]
["Use refresh button to update."]
[]
[]
[]
[]
[]
[]
[]
[]
[]
[null,"Enter Whitton taxon code and phytoplankton counts in um3 /ml for each sample"]
["Taxon Name","Sum of BioVol","Date"]
[null,"SpeciesCode","2010-07-07","2010-08-12","2010-09-13","2011-09-27","2012-07-24","2012-08-21","2012-09-26","(blank)"]
[{"$f":"VLOOKUP(B21,UKOptima!A:D,4,FALSE)","v":"Anabaena"},"01020000",114004.89887719243,31383.371039227128,84305.50861135083,12104.144637025307,1376.4602311627552,114966.91169971511,4045.1176420056436]
[{"$f":"VLOOKUP(B22,UKOptima!A:D,4,FALSE)","v":"Aphanizomenon flos-aquae"},"01040020",null,null,null,null,27789.247255847957,61639.735133119313,79723.26640226008]
[{"$f":"VLOOKUP(B23,UKOptima!A:D,4,FALSE)","v":"Oscillatoria"},"01530000",214663.19901731593,31349.661725543741,30338.38231504233,16559.700346960606,445378.89684295387,490258.61600750999,195166.81343266735]
[{"$f":"VLOOKUP(B24,UKOptima!A:D,4,FALSE)","v":"Woronichinia"},"01780000",411637.1541384022,842837.26213684736,1347920.4882312252,246129.20648200583,1159207.4508351162,1744824.8977983445,568430.42879864376]
[{"$f":"VLOOKUP(B25,UKOptima!A:D,4,FALSE)","v":"Trachelomonas"},"04100000",1160.907486544987,null,45464.552924098345,7163.9600994691154,null,2348.1803860235927]
[{"$f":"VLOOKUP(B26,UKOptima!A:D,4,FALSE)","v":"Cryptomonas (small) Length <20 µm"},"05040001",330.21368506168517,8118.2260534090938,2256.804153843455,1104.495982013616,52305.718098675541,52586.399035442402,9371.464382050628]
[{"$f":"VLOOKUP(B27,UKOptima!A:D,4,FALSE)","v":"Cryptomonas (medium) Length 20-30 µm"},"05040002",87263.589269141172,75581.949946399007,110568.36505675544,21569.029566333182,55418.432997101721,137887.3169960987,42069.2234768587]
[{"$f":"VLOOKUP(B28,UKOptima!A:D,4,FALSE)","v":"Cryptomonas (large) Length >30 µm"},"05040003",27813.021562644804]
[{"$f":"VLOOKUP(B29,UKOptima!A:D,4,FALSE)","v":"Rhodomonas"},"05100000",null,null,null,6285.6016832796358,null,null,15820.220804670253]
[{"$f":"VLOOKUP(B30,UKOptima!A:D,4,FALSE)","v":"Rhodomonas lacustris var. nannoplanctica"},"05100012",29871.293980819581,26219.37898414777,20300.806630824485,null,26142.349279580259,11845.029054110699]
[{"$f":"VLOOKUP(B31,UKOptima!A:D,4,FALSE)","v":"Ceratium hirundinella"},"06020040",399310.52505046898,463837.72134235204,278034.81252638716,37606.698762239757,196673.9705509143,21040.043359908334]
[{"$f":"VLOOKUP(B32,UKOptima!A:D,4,FALSE)","v":"Gymnodinium"},"06070000",null,648141.61518298567,null,null,null,386486.64283243782]
[{"$f":"VLOOKUP(B33,UKOptima!A:D,4,FALSE)","v":"Gymnodinium helveticum"},"06070110",null,null,null,22891.375771724117,111737.45967344586,46358.217464700152,29089.073873225621]
[{"$f":"VLOOKUP(B34,UKOptima!A:D,4,FALSE)","v":"Peridinium cinctum"},"06110050",76081.233038212275,110294.81053648893,51155.60337747274,40468.031076898129]
[{"$f":"VLOOKUP(B35,UKOptima!A:D,4,FALSE)","v":"Chrysochromulina"},"08010000",1088.2620443464207,2369.0058108221397,15901.739481950519,null,null,30124.277890414338]
[{"$f":"VLOOKUP(B36,UKOptima!A:D,4,FALSE)","v":"Dinobryon divergens"},"09230050",null,396.25642207402228,61609.948504068983,null,null,2749.022115981526,2655.5990936213889]
[{"$f":"VLOOKUP(B37,UKOptima!A:D,4,FALSE)","v":"Mallomonas"},"09310000",13410.80328456769,27734.853791884107,4339.2142052637073,null,null,null,1934.8458109083119]
[{"$f":"VLOOKUP(B38,UKOptima!A:D,4,FALSE)","v":"Medium centric diatom (10-20 µm diam.)"},"12000002",null,null,24485.895997794465,83088.251850112283,44974.094689826568,null,35535.0871623321]
[{"$f":"VLOOKUP(B39,UKOptima!A:D,4,FALSE)","v":"Large centric diatom (>20 µm diam.)"},"12000003",null,null,null,17242.107565495895,null,7227.7061076153432]
[{"$f":"VLOOKUP(B40,UKOptima!A:D,4,FALSE)","v":"Aulacoseira"},"12030000",null,null,5572.3559354159379,15111.42956057952]
[{"$f":"VLOOKUP(B41,UKOptima!A:D,4,FALSE)","v":"Urosolenia eriensis"},"12200010",null,null,null,null,15.478728130526614,null,97.516228869778928]
[{"$f":"VLOOKUP(B42,UKOptima!A:D,4,FALSE)","v":"Asterionella formosa"},"13080010",null,null,2554.1798163520575]
[{"$f":"VLOOKUP(B43,UKOptima!A:D,4,FALSE)","v":"Fragilaria crotonensis"},"13370040",null,null,null,29357.301345972413,84005.898830936902,null,434460.31080633745]
[{"$f":"VLOOKUP(B44,UKOptima!A:D,4,FALSE)","v":"Tabellaria fenestrata"},"13820010",null,null,null,null,37839.607215342839,null,64563.989802232572]
[{"$f":"VLOOKUP(B45,UKOptima!A:D,4,FALSE)","v":"Tabellaria flocculosa"},"13820020",null,null,null,1182.4906557185452,11824.877254794637,null,22204.546757381569]
[{"$f":"VLOOKUP(B46,UKOptima!A:D,4,FALSE)","v":"Paulschulzia"},"16490000",null,null,null,null,3146.1950000000002]
[{"$f":"VLOOKUP(B47,UKOptima!A:D,4,FALSE)","v":"Chlorococcales"},"17000000",1485.9615827775835,30364.331469537727,18952.046486577117,12775.049953954443,15616.005100634222,18952.046486577117,3997.6973057623609]
[{"$f":"VLOOKUP(B48,UKOptima!A:D,4,FALSE)","v":"Ankyra lanceolata"},"17060000",null,null,null,null,null,null,60.539175594642288]
[{"$f":"VLOOKUP(B49,UKOptima!A:D,4,FALSE)","v":"Botryococcus"},"17080000",null,14747.824736478909,67597.493112835829]
[{"$f":"VLOOKUP(B50,UKOptima!A:D,4,FALSE)","v":"Monoraphidium"},"17580000",null,null,null,null,null,1998.8486528811804]
[{"$f":"VLOOKUP(B51,UKOptima!A:D,4,FALSE)","v":"Monoraphidium contortum"},"17580020",null,null,249.85608161014756,null,185.0785789704797]
[{"$f":"VLOOKUP(B52,UKOptima!A:D,4,FALSE)","v":"Quadrigula"},"17780000",null,null,201.99790265882774]
[{"$f":"VLOOKUP(B53,UKOptima!A:D,4,FALSE)","v":"Tetraedron minimum"},"17960030",3031.0399653979243,5880.9244809688589,1908.7598615916959,null,4418.425605536333,49701.279003460229,9819.1379179930827]
[{"$f":"VLOOKUP(B54,UKOptima!A:D,4,FALSE)","v":"Gloeotila"},"24170000",null,null,2476.6026379626392,null,null,null,1783.1538993331003]
[{"$f":"VLOOKUP(B55,UKOptima!A:D,4,FALSE)","v":"Elakatothrix"},"25010000",136.21314508794515,null,111.44711870831877,126.4099263126764,330.21286678456772]
[{"$f":"VLOOKUP(B56,UKOptima!A:D,4,FALSE)","v":"Cosmarium"},"27050000",null,null,null,null,8528.4352281839274,24497.391877191134]
[{"$f":"VLOOKUP(B57,UKOptima!A:D,4,FALSE)","v":"Spondylosium planum"},"27360040",null,1434.2379051303142]
[{"$f":"VLOOKUP(B58,UKOptima!A:D,4,FALSE)","v":"Staurastrum"},"27370000",null,1398.0562364130135,1255.1666210738611,3953.5518569829801,949.80544311043263,5222.3659413176783,2881.9322417980061]
[{"$f":"VLOOKUP(B59,UKOptima!A:D,4,FALSE)","v":"Picoplankton - unidentified single cells <2 µm diam."},"90000000",772.82453882279538,294.00549442184075,20299.144678191129]
[{"$f":"VLOOKUP(B60,UKOptima!A:D,4,FALSE)","v":"Nanoplankton - unidentified single cells 2-20 µm diameter"},"90000003",null,19788.831355316201,null,2385.260922292578]
[{"$f":"VLOOKUP(B61,UKOptima!A:D,4,FALSE)","v":"Nanoplankton - unidentified flagellates 2-20 µm diameter"},"90000005",null,1184.5029054110698,2826.9759079023142,819.93344203807374,null,44144.054278859767]
[{"$f":"VLOOKUP(B62,UKOptima!A:D,4,FALSE)","v":{"$error":"#N/A"}},"(blank)"]
[{"$f":"VLOOKUP(B63,UKOptima!A:D,4,FALSE)","v":{"$error":"#N/A"}}]
[{"$f":"VLOOKUP(B64,UKOptima!A:D,4,FALSE)","v":{"$error":"#N/A"}}]
[{"$f":"VLOOKUP(B65,UKOptima!A:D,4,FALSE)","v":{"$error":"#N/A"}}]
[{"$f":"VLOOKUP(B66,UKOptima!A:D,4,FALSE)","v":{"$error":"#N/A"}}]
[{"$f":"VLOOKUP(B67,UKOptima!A:D,4,FALSE)","v":{"$error":"#N/A"}}]
[{"$f":"VLOOKUP(B68,UKOptima!A:D,4,FALSE)","v":{"$error":"#N/A"}}]
[{"$f":"VLOOKUP(B69,UKOptima!A:D,4,FALSE)","v":{"$error":"#N/A"}}]
[{"$f":"VLOOKUP(B70,UKOptima!A:D,4,FALSE)","v":{"$error":"#N/A"}}]
[{"$f":"VLOOKUP(B71,UKOptima!A:D,4,FALSE)","v":{"$error":"#N/A"}}]
[{"$f":"VLOOKUP(B72,UKOptima!A:D,4,FALSE)","v":{"$error":"#N/A"}}]
[{"$f":"VLOOKUP(B73,UKOptima!A:D,4,FALSE)","v":{"$error":"#N/A"}}]
[{"$f":"VLOOKUP(B74,UKOptima!A:D,4,FALSE)","v":{"$error":"#N/A"}}]
[{"$f":"VLOOKUP(B75,UKOptima!A:D,4,FALSE)","v":{"$error":"#N/A"}}]
[{"$f":"VLOOKUP(B76,UKOptima!A:D,4,FALSE)","v":{"$error":"#N/A"}}]
[{"$f":"VLOOKUP(B77,UKOptima!A:D,4,FALSE)","v":{"$error":"#N/A"}}]
[{"$f":"VLOOKUP(B78,UKOptima!A:D,4,FALSE)","v":{"$error":"#N/A"}}]
[{"$f":"VLOOKUP(B79,UKOptima!A:D,4,FALSE)","v":{"$error":"#N/A"}}]
[{"$f":"VLOOKUP(B80,UKOptima!A:D,4,FALSE)","v":{"$error":"#N/A"}}]
[{"$f":"VLOOKUP(B81,UKOptima!A:D,4,FALSE)","v":{"$error":"#N/A"}}]
[{"$f":"VLOOKUP(B82,UKOptima!A:D,4,FALSE)","v":{"$error":"#N/A"}}]
[{"$f":"VLOOKUP(B83,UKOptima!A:D,4,FALSE)","v":{"$error":"#N/A"}}]
[{"$f":"VLOOKUP(B84,UKOptima!A:D,4,FALSE)","v":{"$error":"#N/A"}}]
[{"$f":"VLOOKUP(B85,UKOptima!A:D,4,FALSE)","v":{"$error":"#N/A"}}]
[{"$f":"VLOOKUP(B86,UKOptima!A:D,4,FALSE)","v":{"$error":"#N/A"}}]
[{"$f":"VLOOKUP(B87,UKOptima!A:D,4,FALSE)","v":{"$error":"#N/A"}}]
[{"$f":"VLOOKUP(B88,UKOptima!A:D,4,FALSE)","v":{"$error":"#N/A"}}]
[{"$f":"VLOOKUP(B89,UKOptima!A:D,4,FALSE)","v":{"$error":"#N/A"}}]
[{"$f":"VLOOKUP(B90,UKOptima!A:D,4,FALSE)","v":{"$error":"#N/A"}}]
[{"$f":"VLOOKUP(B91,UKOptima!A:D,4,FALSE)","v":{"$error":"#N/A"}}]
[{"$f":"VLOOKUP(B92,UKOptima!A:D,4,FALSE)","v":{"$error":"#N/A"}}]
[{"$f":"VLOOKUP(B93,UKOptima!A:D,4,FALSE)","v":{"$error":"#N/A"}}]
[{"$f":"VLOOKUP(B94,UKOptima!A:D,4,FALSE)","v":{"$error":"#N/A"}}]
[{"$f":"VLOOKUP(B95,UKOptima!A:D,4,FALSE)","v":{"$error":"#N/A"}}]
[{"$f":"VLOOKUP(B96,UKOptima!A:D,4,FALSE)","v":{"$error":"#N/A"}}]
[{"$f":"VLOOKUP(B97,UKOptima!A:D,4,FALSE)","v":{"$error":"#N/A"}}]
[{"$f":"VLOOKUP(B98,UKOptima!A:D,4,FALSE)","v":{"$error":"#N/A"}}]
[{"$f":"VLOOKUP(B99,UKOptima!A:D,4,FALSE)","v":{"$error":"#N/A"}}]
[{"$f":"VLOOKUP(B100,UKOptima!A:D,4,FALSE)","v":{"$error":"#N/A"}}]
[{"$f":"VLOOKUP(B101,UKOptima!A:D,4,FALSE)","v":{"$error":"#N/A"}}]
[{"$f":"VLOOKUP(B102,UKOptima!A:D,4,FALSE)","v":{"$error":"#N/A"}}]
[{"$f":"VLOOKUP(B103,UKOptima!A:D,4,FALSE)","v":{"$error":"#N/A"}}]
[{"$f":"VLOOKUP(B104,UKOptima!A:D,4,FALSE)","v":{"$error":"#N/A"}}]
[{"$f":"VLOOKUP(B105,UKOptima!A:D,4,FALSE)","v":{"$error":"#N/A"}}]
[{"$f":"VLOOKUP(B106,UKOptima!A:D,4,FALSE)","v":{"$error":"#N/A"}}]
[{"$f":"VLOOKUP(B107,UKOptima!A:D,4,FALSE)","v":{"$error":"#N/A"}}]
[{"$f":"VLOOKUP(B108,UKOptima!A:D,4,FALSE)","v":{"$error":"#N/A"}}]
[{"$f":"VLOOKUP(B109,UKOptima!A:D,4,FALSE)","v":{"$error":"#N/A"}}]
[{"$f":"VLOOKUP(B110,UKOptima!A:D,4,FALSE)","v":{"$error":"#N/A"}}]
[{"$f":"VLOOKUP(B111,UKOptima!A:D,4,FALSE)","v":{"$error":"#N/A"}}]
[{"$f":"VLOOKUP(B112,UKOptima!A:D,4,FALSE)","v":{"$error":"#N/A"}}]
[{"$f":"VLOOKUP(B113,UKOptima!A:D,4,FALSE)","v":{"$error":"#N/A"}}]
[{"$f":"VLOOKUP(B114,UKOptima!A:D,4,FALSE)","v":{"$error":"#N/A"}}]
[{"$f":"VLOOKUP(B115,UKOptima!A:D,4,FALSE)","v":{"$error":"#N/A"}}]
[{"$f":"VLOOKUP(B116,UKOptima!A:D,4,FALSE)","v":{"$error":"#N/A"}}]
[{"$f":"VLOOKUP(B117,UKOptima!A:D,4,FALSE)","v":{"$error":"#N/A"}}]
[{"$f":"VLOOKUP(B118,UKOptima!A:D,4,FALSE)","v":{"$error":"#N/A"}}]
[{"$f":"VLOOKUP(B119,UKOptima!A:D,4,FALSE)","v":{"$error":"#N/A"}}]
[{"$f":"VLOOKUP(B120,UKOptima!A:D,4,FALSE)","v":{"$error":"#N/A"}}]
[{"$f":"VLOOKUP(B121,UKOptima!A:D,4,FALSE)","v":{"$error":"#N/A"}}]
[{"$f":"VLOOKUP(B122,UKOptima!A:D,4,FALSE)","v":{"$error":"#N/A"}}]
[{"$f":"VLOOKUP(B123,UKOptima!A:D,4,FALSE)","v":{"$error":"#N/A"}}]
[{"$f":"VLOOKUP(B124,UKOptima!A:D,4,FALSE)","v":{"$error":"#N/A"}}]
[{"$f":"VLOOKUP(B125,UKOptima!A:D,4,FALSE)","v":{"$error":"#N/A"}}]
[{"$f":"VLOOKUP(B126,UKOptima!A:D,4,FALSE)","v":{"$error":"#N/A"}}]
[{"$f":"VLOOKUP(B127,UKOptima!A:D,4,FALSE)","v":{"$error":"#N/A"}}]
[{"$f":"VLOOKUP(B128,UKOptima!A:D,4,FALSE)","v":{"$error":"#N/A"}}]
[{"$f":"VLOOKUP(B129,UKOptima!A:D,4,FALSE)","v":{"$error":"#N/A"}}]
[{"$f":"VLOOKUP(B130,UKOptima!A:D,4,FALSE)","v":{"$error":"#N/A"}}]
[{"$f":"VLOOKUP(B131,UKOptima!A:D,4,FALSE)","v":{"$error":"#N/A"}}]
[{"$f":"VLOOKUP(B132,UKOptima!A:D,4,FALSE)","v":{"$error":"#N/A"}}]
[{"$f":"VLOOKUP(B133,UKOptima!A:D,4,FALSE)","v":{"$error":"#N/A"}}]
[{"$f":"VLOOKUP(B134,UKOptima!A:D,4,FALSE)","v":{"$error":"#N/A"}}]
[{"$f":"VLOOKUP(B135,UKOptima!A:D,4,FALSE)","v":{"$error":"#N/A"}}]
[{"$f":"VLOOKUP(B136,UKOptima!A:D,4,FALSE)","v":{"$error":"#N/A"}}]
[{"$f":"VLOOKUP(B137,UKOptima!A:D,4,FALSE)","v":{"$error":"#N/A"}}]
[{"$f":"VLOOKUP(B138,UKOptima!A:D,4,FALSE)","v":{"$error":"#N/A"}}]
[{"$f":"VLOOKUP(B139,UKOptima!A:D,4,FALSE)","v":{"$error":"#N/A"}}]
[{"$f":"VLOOKUP(B140,UKOptima!A:D,4,FALSE)","v":{"$error":"#N/A"}}]
[{"$f":"VLOOKUP(B141,UKOptima!A:D,4,FALSE)","v":{"$error":"#N/A"}}]
[{"$f":"VLOOKUP(B142,UKOptima!A:D,4,FALSE)","v":{"$error":"#N/A"}}]
[{"$f":"VLOOKUP(B143,UKOptima!A:D,4,FALSE)","v":{"$error":"#N/A"}}]
[{"$f":"VLOOKUP(B144,UKOptima!A:D,4,FALSE)","v":{"$error":"#N/A"}}]
[{"$f":"VLOOKUP(B145,UKOptima!A:D,4,FALSE)","v":{"$error":"#N/A"}}]
[{"$f":"VLOOKUP(B146,UKOptima!A:D,4,FALSE)","v":{"$error":"#N/A"}}]
[{"$f":"VLOOKUP(B147,UKOptima!A:D,4,FALSE)","v":{"$error":"#N/A"}}]
[{"$f":"VLOOKUP(B148,UKOptima!A:D,4,FALSE)","v":{"$error":"#N/A"}}]
[{"$f":"VLOOKUP(B149,UKOptima!A:D,4,FALSE)","v":{"$error":"#N/A"}}]
[{"$f":"VLOOKUP(B150,UKOptima!A:D,4,FALSE)","v":{"$error":"#N/A"}}]
[{"$f":"VLOOKUP(B151,UKOptima!A:D,4,FALSE)","v":{"$error":"#N/A"}}]
[{"$f":"VLOOKUP(B152,UKOptima!A:D,4,FALSE)","v":{"$error":"#N/A"}}]
[{"$f":"VLOOKUP(B153,UKOptima!A:D,4,FALSE)","v":{"$error":"#N/A"}}]
[{"$f":"VLOOKUP(B154,UKOptima!A:D,4,FALSE)","v":{"$error":"#N/A"}}]
[{"$f":"VLOOKUP(B155,UKOptima!A:D,4,FALSE)","v":{"$error":"#N/A"}}]
[{"$f":"VLOOKUP(B156,UKOptima!A:D,4,FALSE)","v":{"$error":"#N/A"}}]
[{"$f":"VLOOKUP(B157,UKOptima!A:D,4,FALSE)","v":{"$error":"#N/A"}}]
[{"$f":"VLOOKUP(B158,UKOptima!A:D,4,FALSE)","v":{"$error":"#N/A"}}]
[{"$f":"VLOOKUP(B159,UKOptima!A:D,4,FALSE)","v":{"$error":"#N/A"}}]
[{"$f":"VLOOKUP(B160,UKOptima!A:D,4,FALSE)","v":{"$error":"#N/A"}}]
[{"$f":"VLOOKUP(B161,UKOptima!A:D,4,FALSE)","v":{"$error":"#N/A"}}]
[{"$f":"VLOOKUP(B162,UKOptima!A:D,4,FALSE)","v":{"$error":"#N/A"}}]
[{"$f":"VLOOKUP(B163,UKOptima!A:D,4,FALSE)","v":{"$error":"#N/A"}}]
[{"$f":"VLOOKUP(B164,UKOptima!A:D,4,FALSE)","v":{"$error":"#N/A"}}]
[{"$f":"VLOOKUP(B165,UKOptima!A:D,4,FALSE)","v":{"$error":"#N/A"}}]
[{"$f":"VLOOKUP(B166,UKOptima!A:D,4,FALSE)","v":{"$error":"#N/A"}}]
[{"$f":"VLOOKUP(B167,UKOptima!A:D,4,FALSE)","v":{"$error":"#N/A"}}]
[{"$f":"VLOOKUP(B168,UKOptima!A:D,4,FALSE)","v":{"$error":"#N/A"}}]
[{"$f":"VLOOKUP(B169,UKOptima!A:D,4,FALSE)","v":{"$error":"#N/A"}}]
[{"$f":"VLOOKUP(B170,UKOptima!A:D,4,FALSE)","v":{"$error":"#N/A"}}]
[{"$f":"VLOOKUP(B171,UKOptima!A:D,4,FALSE)","v":{"$error":"#N/A"}}]
[{"$f":"VLOOKUP(B172,UKOptima!A:D,4,FALSE)","v":{"$error":"#N/A"}}]
[{"$f":"VLOOKUP(B173,UKOptima!A:D,4,FALSE)","v":{"$error":"#N/A"}}]
[{"$f":"VLOOKUP(B174,UKOptima!A:D,4,FALSE)","v":{"$error":"#N/A"}}]
[{"$f":"VLOOKUP(B175,UKOptima!A:D,4,FALSE)","v":{"$error":"#N/A"}}]
[{"$f":"VLOOKUP(B176,UKOptima!A:D,4,FALSE)","v":{"$error":"#N/A"}}]
[{"$f":"VLOOKUP(B177,UKOptima!A:D,4,FALSE)","v":{"$error":"#N/A"}}]
[{"$f":"VLOOKUP(B178,UKOptima!A:D,4,FALSE)","v":{"$error":"#N/A"}}]
[{"$f":"VLOOKUP(B179,UKOptima!A:D,4,FALSE)","v":{"$error":"#N/A"}}]
[{"$f":"VLOOKUP(B180,UKOptima!A:D,4,FALSE)","v":{"$error":"#N/A"}}]
[{"$f":"VLOOKUP(B181,UKOptima!A:D,4,FALSE)","v":{"$error":"#N/A"}}]
[{"$f":"VLOOKUP(B182,UKOptima!A:D,4,FALSE)","v":{"$error":"#N/A"}}]
[{"$f":"VLOOKUP(B183,UKOptima!A:D,4,FALSE)","v":{"$error":"#N/A"}}]
[{"$f":"VLOOKUP(B184,UKOptima!A:D,4,FALSE)","v":{"$error":"#N/A"}}]
[{"$f":"VLOOKUP(B185,UKOptima!A:D,4,FALSE)","v":{"$error":"#N/A"}}]
[{"$f":"VLOOKUP(B186,UKOptima!A:D,4,FALSE)","v":{"$error":"#N/A"}}]
[{"$f":"VLOOKUP(B187,UKOptima!A:D,4,FALSE)","v":{"$error":"#N/A"}}]
[{"$f":"VLOOKUP(B188,UKOptima!A:D,4,FALSE)","v":{"$error":"#N/A"}}]
[{"$f":"VLOOKUP(B189,UKOptima!A:D,4,FALSE)","v":{"$error":"#N/A"}}]
[{"$f":"VLOOKUP(B190,UKOptima!A:D,4,FALSE)","v":{"$error":"#N/A"}}]
[{"$f":"VLOOKUP(B191,UKOptima!A:D,4,FALSE)","v":{"$error":"#N/A"}}]
[{"$f":"VLOOKUP(B192,UKOptima!A:D,4,FALSE)","v":{"$error":"#N/A"}}]
[{"$f":"VLOOKUP(B193,UKOptima!A:D,4,FALSE)","v":{"$error":"#N/A"}}]
[{"$f":"VLOOKUP(B194,UKOptima!A:D,4,FALSE)","v":{"$error":"#N/A"}}]
[{"$f":"VLOOKUP(B195,UKOptima!A:D,4,FALSE)","v":{"$error":"#N/A"}}]
[{"$f":"VLOOKUP(B196,UKOptima!A:D,4,FALSE)","v":{"$error":"#N/A"}}]
[{"$f":"VLOOKUP(B197,UKOptima!A:D,4,FALSE)","v":{"$error":"#N/A"}}]
[{"$f":"VLOOKUP(B198,UKOptima!A:D,4,FALSE)","v":{"$error":"#N/A"}}]
[{"$f":"VLOOKUP(B199,UKOptima!A:D,4,FALSE)","v":{"$error":"#N/A"}}]
[{"$f":"VLOOKUP(B200,UKOptima!A:D,4,FALSE)","v":{"$error":"#N/A"}}]
[{"$f":"VLOOKUP(B201,UKOptima!A:D,4,FALSE)","v":{"$error":"#N/A"}}]
[{"$f":"VLOOKUP(B202,UKOptima!A:D,4,FALSE)","v":{"$error":"#N/A"}}]
[{"$f":"VLOOKUP(B203,UKOptima!A:D,4,FALSE)","v":{"$error":"#N/A"}}]
[{"$f":"VLOOKUP(B204,UKOptima!A:D,4,FALSE)","v":{"$error":"#N/A"}}]
[{"$f":"VLOOKUP(B205,UKOptima!A:D,4,FALSE)","v":{"$error":"#N/A"}}]
[{"$f":"VLOOKUP(B206,UKOptima!A:D,4,FALSE)","v":{"$error":"#N/A"}}]
[{"$f":"VLOOKUP(B207,UKOptima!A:D,4,FALSE)","v":{"$error":"#N/A"}}]
[{"$f":"VLOOKUP(B208,UKOptima!A:D,4,FALSE)","v":{"$error":"#N/A"}}]
[{"$f":"VLOOKUP(B209,UKOptima!A:D,4,FALSE)","v":{"$error":"#N/A"}}]
[{"$f":"VLOOKUP(B210,UKOptima!A:D,4,FALSE)","v":{"$error":"#N/A"}}]
[{"$f":"VLOOKUP(B211,UKOptima!A:D,4,FALSE)","v":{"$error":"#N/A"}}]
[{"$f":"VLOOKUP(B212,UKOptima!A:D,4,FALSE)","v":{"$error":"#N/A"}}]
[{"$f":"VLOOKUP(B213,UKOptima!A:D,4,FALSE)","v":{"$error":"#N/A"}}]
[{"$f":"VLOOKUP(B214,UKOptima!A:D,4,FALSE)","v":{"$error":"#N/A"}}]
[{"$f":"VLOOKUP(B215,UKOptima!A:D,4,FALSE)","v":{"$error":"#N/A"}}]
[{"$f":"VLOOKUP(B216,UKOptima!A:D,4,FALSE)","v":{"$error":"#N/A"}}]
[{"$f":"VLOOKUP(B217,UKOptima!A:D,4,FALSE)","v":{"$error":"#N/A"}}]
[{"$f":"VLOOKUP(B218,UKOptima!A:D,4,FALSE)","v":{"$error":"#N/A"}}]
[{"$f":"VLOOKUP(B219,UKOptima!A:D,4,FALSE)","v":{"$error":"#N/A"}}]
[{"$f":"VLOOKUP(B220,UKOptima!A:D,4,FALSE)","v":{"$error":"#N/A"}}]
[{"$f":"VLOOKUP(B221,UKOptima!A:D,4,FALSE)","v":{"$error":"#N/A"}}]
[{"$f":"VLOOKUP(B222,UKOptima!A:D,4,FALSE)","v":{"$error":"#N/A"}}]
[{"$f":"VLOOKUP(B223,UKOptima!A:D,4,FALSE)","v":{"$error":"#N/A"}}]
[{"$f":"VLOOKUP(B224,UKOptima!A:D,4,FALSE)","v":{"$error":"#N/A"}}]
[{"$f":"VLOOKUP(B225,UKOptima!A:D,4,FALSE)","v":{"$error":"#N/A"}}]
[{"$f":"VLOOKUP(B226,UKOptima!A:D,4,FALSE)","v":{"$error":"#N/A"}}]
[{"$f":"VLOOKUP(B227,UKOptima!A:D,4,FALSE)","v":{"$error":"#N/A"}}]
[{"$f":"VLOOKUP(B228,UKOptima!A:D,4,FALSE)","v":{"$error":"#N/A"}}]
[{"$f":"VLOOKUP(B229,UKOptima!A:D,4,FALSE)","v":{"$error":"#N/A"}}]
[{"$f":"VLOOKUP(B230,UKOptima!A:D,4,FALSE)","v":{"$error":"#N/A"}}]
[{"$f":"VLOOKUP(B231,UKOptima!A:D,4,FALSE)","v":{"$error":"#N/A"}}]
[{"$f":"VLOOKUP(B232,UKOptima!A:D,4,FALSE)","v":{"$error":"#N/A"}}]
[{"$f":"VLOOKUP(B233,UKOptima!A:D,4,FALSE)","v":{"$error":"#N/A"}}]
[{"$f":"VLOOKUP(B234,UKOptima!A:D,4,FALSE)","v":{"$error":"#N/A"}}]
[{"$f":"VLOOKUP(B235,UKOptima!A:D,4,FALSE)","v":{"$error":"#N/A"}}]
[{"$f":"VLOOKUP(B236,UKOptima!A:D,4,FALSE)","v":{"$error":"#N/A"}}]
[{"$f":"VLOOKUP(B237,UKOptima!A:D,4,FALSE)","v":{"$error":"#N/A"}}]
[{"$f":"VLOOKUP(B238,UKOptima!A:D,4,FALSE)","v":{"$error":"#N/A"}}]
[{"$f":"VLOOKUP(B239,UKOptima!A:D,4,FALSE)","v":{"$error":"#N/A"}}]
[{"$f":"VLOOKUP(B240,UKOptima!A:D,4,FALSE)","v":{"$error":"#N/A"}}]
[{"$f":"VLOOKUP(B241,UKOptima!A:D,4,FALSE)","v":{"$error":"#N/A"}}]
[{"$f":"VLOOKUP(B242,UKOptima!A:D,4,FALSE)","v":{"$error":"#N/A"}}]
[{"$f":"VLOOKUP(B243,UKOptima!A:D,4,FALSE)","v":{"$error":"#N/A"}}]
[{"$f":"VLOOKUP(B244,UKOptima!A:D,4,FALSE)","v":{"$error":"#N/A"}}]
[{"$f":"VLOOKUP(B245,UKOptima!A:D,4,FALSE)","v":{"$error":"#N/A"}}]
[{"$f":"VLOOKUP(B246,UKOptima!A:D,4,FALSE)","v":{"$error":"#N/A"}}]
[{"$f":"VLOOKUP(B247,UKOptima!A:D,4,FALSE)","v":{"$error":"#N/A"}}]
[{"$f":"VLOOKUP(B248,UKOptima!A:D,4,FALSE)","v":{"$error":"#N/A"}}]
[{"$f":"VLOOKUP(B249,UKOptima!A:D,4,FALSE)","v":{"$error":"#N/A"}}]
[{"$f":"VLOOKUP(B250,UKOptima!A:D,4,FALSE)","v":{"$error":"#N/A"}}]
[{"$f":"VLOOKUP(B251,UKOptima!A:D,4,FALSE)","v":{"$error":"#N/A"}}]
[{"$f":"VLOOKUP(B252,UKOptima!A:D,4,FALSE)","v":{"$error":"#N/A"}}]
[{"$f":"VLOOKUP(B253,UKOptima!A:D,4,FALSE)","v":{"$error":"#N/A"}}]
[{"$f":"VLOOKUP(B254,UKOptima!A:D,4,FALSE)","v":{"$error":"#N/A"}}]
[{"$f":"VLOOKUP(B255,UKOptima!A:D,4,FALSE)","v":{"$error":"#N/A"}}]
[{"$f":"VLOOKUP(B256,UKOptima!A:D,4,FALSE)","v":{"$error":"#N/A"}}]
[{"$f":"VLOOKUP(B257,UKOptima!A:D,4,FALSE)","v":{"$error":"#N/A"}}]
[{"$f":"VLOOKUP(B258,UKOptima!A:D,4,FALSE)","v":{"$error":"#N/A"}}]
[{"$f":"VLOOKUP(B259,UKOptima!A:D,4,FALSE)","v":{"$error":"#N/A"}}]
[{"$f":"VLOOKUP(B260,UKOptima!A:D,4,FALSE)","v":{"$error":"#N/A"}}]
[{"$f":"VLOOKUP(B261,UKOptima!A:D,4,FALSE)","v":{"$error":"#N/A"}}]
[{"$f":"VLOOKUP(B262,UKOptima!A:D,4,FALSE)","v":{"$error":"#N/A"}}]
[{"$f":"VLOOKUP(B263,UKOptima!A:D,4,FALSE)","v":{"$error":"#N/A"}}]
[{"$f":"VLOOKUP(B264,UKOptima!A:D,4,FALSE)","v":{"$error":"#N/A"}}]
[{"$f":"VLOOKUP(B265,UKOptima!A:D,4,FALSE)","v":{"$error":"#N/A"}}]
[{"$f":"VLOOKUP(B266,UKOptima!A:D,4,FALSE)","v":{"$error":"#N/A"}}]
[{"$f":"VLOOKUP(B267,UKOptima!A:D,4,FALSE)","v":{"$error":"#N/A"}}]
[{"$f":"VLOOKUP(B268,UKOptima!A:D,4,FALSE)","v":{"$error":"#N/A"}}]
[{"$f":"VLOOKUP(B269,UKOptima!A:D,4,FALSE)","v":{"$error":"#N/A"}}]
[{"$f":"VLOOKUP(B270,UKOptima!A:D,4,FALSE)","v":{"$error":"#N/A"}}]
[{"$f":"VLOOKUP(B271,UKOptima!A:D,4,FALSE)","v":{"$error":"#N/A"}}]
[{"$f":"VLOOKUP(B272,UKOptima!A:D,4,FALSE)","v":{"$error":"#N/A"}}]
[{"$f":"VLOOKUP(B273,UKOptima!A:D,4,FALSE)","v":{"$error":"#N/A"}}]
[{"$f":"VLOOKUP(B274,UKOptima!A:D,4,FALSE)","v":{"$error":"#N/A"}}]
[{"$f":"VLOOKUP(B275,UKOptima!A:D,4,FALSE)","v":{"$error":"#N/A"}}]
[{"$f":"VLOOKUP(B276,UKOptima!A:D,4,FALSE)","v":{"$error":"#N/A"}}]
[{"$f":"VLOOKUP(B277,UKOptima!A:D,4,FALSE)","v":{"$error":"#N/A"}}]
[{"$f":"VLOOKUP(B278,UKOptima!A:D,4,FALSE)","v":{"$error":"#N/A"}}]
[{"$f":"VLOOKUP(B279,UKOptima!A:D,4,FALSE)","v":{"$error":"#N/A"}}]
[{"$f":"VLOOKUP(B280,UKOptima!A:D,4,FALSE)","v":{"$error":"#N/A"}}]
[{"$f":"VLOOKUP(B281,UKOptima!A:D,4,FALSE)","v":{"$error":"#N/A"}}]
[{"$f":"VLOOKUP(B282,UKOptima!A:D,4,FALSE)","v":{"$error":"#N/A"}}]
[{"$f":"VLOOKUP(B283,UKOptima!A:D,4,FALSE)","v":{"$error":"#N/A"}}]
[{"$f":"VLOOKUP(B284,UKOptima!A:D,4,FALSE)","v":{"$error":"#N/A"}}]
[{"$f":"VLOOKUP(B285,UKOptima!A:D,4,FALSE)","v":{"$error":"#N/A"}}]
[{"$f":"VLOOKUP(B286,UKOptima!A:D,4,FALSE)","v":{"$error":"#N/A"}}]
[{"$f":"VLOOKUP(B287,UKOptima!A:D,4,FALSE)","v":{"$error":"#N/A"}}]
[{"$f":"VLOOKUP(B288,UKOptima!A:D,4,FALSE)","v":{"$error":"#N/A"}}]
[{"$f":"VLOOKUP(B289,UKOptima!A:D,4,FALSE)","v":{"$error":"#N/A"}}]
[{"$f":"VLOOKUP(B290,UKOptima!A:D,4,FALSE)","v":{"$error":"#N/A"}}]
[{"$f":"VLOOKUP(B291,UKOptima!A:D,4,FALSE)","v":{"$error":"#N/A"}}]
[{"$f":"VLOOKUP(B292,UKOptima!A:D,4,FALSE)","v":{"$error":"#N/A"}}]
[{"$f":"VLOOKUP(B293,UKOptima!A:D,4,FALSE)","v":{"$error":"#N/A"}}]
[{"$f":"VLOOKUP(B294,UKOptima!A:D,4,FALSE)","v":{"$error":"#N/A"}}]
[{"$f":"VLOOKUP(B295,UKOptima!A:D,4,FALSE)","v":{"$error":"#N/A"}}]
[{"$f":"VLOOKUP(B296,UKOptima!A:D,4,FALSE)","v":{"$error":"#N/A"}}]
[{"$f":"VLOOKUP(B297,UKOptima!A:D,4,FALSE)","v":{"$error":"#N/A"}}]
[{"$f":"VLOOKUP(B298,UKOptima!A:D,4,FALSE)","v":{"$error":"#N/A"}}]
[{"$f":"VLOOKUP(B299,UKOptima!A:D,4,FALSE)","v":{"$error":"#N/A"}}]
[{"$f":"VLOOKUP(B300,UKOptima!A:D,4,FALSE)","v":{"$error":"#N/A"}}]
[{"$f":"VLOOKUP(B301,UKOptima!A:D,4,FALSE)","v":{"$error":"#N/A"}}]

{"sheet":"Taxon EQRs","index":8,"n_rows":300,"n_cols":39,"rows_kept":300,"cut":false,"hidden":false,"merged":[]}
["Calculation of Taxonomic Metrics and Class",null,null,null,null,null,"Sample 1",null,null,null,"Sample 2",null,null,null,"Sample 3",null,null,null,"Sample 4",null,null,null,"Sample 5",null,null,null,"Sample 6",null,null,null,"Sample 7",null,null,null,"Sample 8",null,null,null,"Sample 9"]
[null,null,null,null,null,null,{"$f":"IF(Taxa_PivotTable!C20=\"\",\"\",Taxa_PivotTable!C20)","v":"2010-07-07"},null,null,null,{"$f":"IF(Taxa_PivotTable!D20=\"\",\"\",Taxa_PivotTable!D20)","v":"2010-08-12"},null,null,null,{"$f":"IF(Taxa_PivotTable!E20=\"\",\"\",Taxa_PivotTable!E20)","v":"2010-09-13"},null,null,null,{"$f":"IF(Taxa_PivotTable!F20=\"\",\"\",Taxa_PivotTable!F20)","v":"2011-09-27"},null,null,null,{"$f":"IF(Taxa_PivotTable!G20>0,Taxa_PivotTable!G20,\"\")","v":"2012-07-24"},null,null,null,{"$f":"IF(Taxa_PivotTable!H20>0,Taxa_PivotTable!H20,\"\")","v":"2012-08-21"},null,null,null,{"$f":"IF(Taxa_PivotTable!I20>0,Taxa_PivotTable!I20,\"\")","v":"2012-09-26"},null,null,null,{"$f":"IF(Taxa_PivotTable!J20>0,Taxa_PivotTable!J20,\"\")","v":"(blank)"},null,null,null,{"$f":"IF(Taxa_PivotTable!K20>0,Taxa_PivotTable!K20,\"\")","v":""}]
[{"$f":"'Site Data'!A2","v":"UK Lake WBID"},{"$f":"'Site Data'!B2","v":28986},"PTI Class",null,null,null,{"$f":"IF(COUNT(D21:D150)>1,IF(G4>=0.8,\"High\",IF(G4>=0.6,\"Good\",IF(G4>=0.4,\"Moderate\",IF(G4>=0.2,\"Poor\",\"Bad\")))),\"\")","v":"Moderate"},null,null,null,{"$f":"IF(COUNT(H21:H150)>1,IF(K4>=0.8,\"High\",IF(K4>=0.6,\"Good\",IF(K4>=0.4,\"Moderate\",IF(K4>=0.2,\"Poor\",\"Bad\")))),\"\")","v":"Good"},null,null,null,{"$f":"IF(COUNT(L21:L150)>1,IF(O4>=0.8,\"High\",IF(O4>=0.6,\"Good\",IF(O4>=0.4,\"Moderate\",IF(O4>=0.2,\"Poor\",\"Bad\")))),\"\")","v":"Good"},null,null,null,{"$f":"IF(COUNT(P21:P150)>1,IF(S4>=0.8,\"High\",IF(S4>=0.6,\"Good\",IF(S4>=0.4,\"Moderate\",IF(S4>=0.2,\"Poor\",\"Bad\")))),\"\")","v":"Moderate"},null,null,null,{"$f":"IF(COUNT(T21:T150)>1,IF(W4>=0.8,\"High\",IF(W4>=0.6,\"Good\",IF(W4>=0.4,\"Moderate\",IF(W4>=0.2,\"Poor\",\"Bad\")))),\"\")","v":"Good"},null,null,null,{"$f":"IF(COUNT(X21:X150)>1,IF(AA4>=0.8,\"High\",IF(AA4>=0.6,\"Good\",IF(AA4>=0.4,\"Moderate\",IF(AA4>=0.2,\"Poor\",\"Bad\")))),\"\")","v":"Moderate"},null,null,null,{"$f":"IF(COUNT(AB21:AB150)>1,IF(AE4>=0.8,\"High\",IF(AE4>=0.6,\"Good\",IF(AE4>=0.4,\"Moderate\",IF(AE4>=0.2,\"Poor\",\"Bad\")))),\"\")","v":"Good"},null,null,null,{"$f":"IF(COUNT(AF21:AF150)>1,IF(AI4>=0.8,\"High\",IF(AI4>=0.6,\"Good\",IF(AI4>=0.4,\"Moderate\",IF(AI4>=0.2,\"Poor\",\"Bad\")))),\"\")","v":""},null,null,null,{"$f":"IF(COUNT(AJ21:AJ150)>1,IF(AM4>=0.8,\"High\",IF(AM4>=0.6,\"Good\",IF(AM4>=0.4,\"Moderate\",IF(AM4>=0.2,\"Poor\",\"Bad\")))),\"\")","v":""}]
[{"$f":"'Site Data'!A3","v":"Lake Name"},{"$f":"'Site Data'!B3","v":"Loweswater"},"PTI EQRNorm",null,null,null,{"$f":"IF(COUNT(D21:D150)>1,1.228*'Taxon EQRs'!G5^2-VLOOKUP($B11,LU!$O3:$Q7,2,FALSE)*'Taxon EQRs'!G5-VLOOKUP('Taxon EQRs'!$B11,LU!$O3:$Q7,3,FALSE),\"\")","v":0.45118686363877991},null,null,null,{"$f":"IF(COUNT(H21:H150)>1,1.228*'Taxon EQRs'!K5^2-VLOOKUP($B11,LU!$O3:$Q7,2,FALSE)*'Taxon EQRs'!K5-VLOOKUP('Taxon EQRs'!$B11,LU!$O3:$Q7,3,FALSE),\"\")","v":0.66061479537862622},null,null,null,{"$f":"IF(COUNT(L21:L150)>1,1.228*'Taxon EQRs'!O5^2-VLOOKUP($B11,LU!$O3:$Q7,2,FALSE)*'Taxon EQRs'!O5-VLOOKUP('Taxon EQRs'!$B11,LU!$O3:$Q7,3,FALSE),\"\")","v":0.62727228797134804},null,null,null,{"$f":"IF(COUNT(P21:P150)>1,1.228*'Taxon EQRs'!S5^2-VLOOKUP($B11,LU!$O3:$Q7,2,FALSE)*'Taxon EQRs'!S5-VLOOKUP('Taxon EQRs'!$B11,LU!$O3:$Q7,3,FALSE),\"\")","v":0.43480743463478566},null,null,null,{"$f":"IF(COUNT(T21:T150)>1,1.228*'Taxon EQRs'!W5^2-VLOOKUP($B11,LU!$O3:$Q7,2,FALSE)*'Taxon EQRs'!W5-VLOOKUP('Taxon EQRs'!$B11,LU!$O3:$Q7,3,FALSE),\"\")","v":0.60859559763354332},null,null,null,{"$f":"IF(COUNT(X21:X150)>1,1.228*'Taxon EQRs'!AA5^2-VLOOKUP($B11,LU!$O3:$Q7,2,FALSE)*'Taxon EQRs'!AA5-VLOOKUP('Taxon EQRs'!$B11,LU!$O3:$Q7,3,FALSE),\"\")","v":0.43594796059186558},null,null,null,{"$f":"IF(COUNT(AB21:AB150)>1,1.228*'Taxon EQRs'!AE5^2-VLOOKUP($B11,LU!$O3:$Q7,2,FALSE)*'Taxon EQRs'!AE5-VLOOKUP('Taxon EQRs'!$B11,LU!$O3:$Q7,3,FALSE),\"\")","v":0.62545266236087005},null,null,null,{"$f":"IF(COUNT(AF21:AF150)>1,1.228*'Taxon EQRs'!AI5^2-VLOOKUP($B11,LU!$O3:$Q7,2,FALSE)*'Taxon EQRs'!AI5-VLOOKUP('Taxon EQRs'!$B11,LU!$O3:$Q7,3,FALSE),\"\")","v":""},null,null,null,{"$f":"IF(COUNT(AJ21:AJ150)>1,1.228*'Taxon EQRs'!AM5^2-VLOOKUP($B11,LU!$O3:$Q7,2,FALSE)*'Taxon EQRs'!AM5-VLOOKUP('Taxon EQRs'!$B11,LU!$O3:$Q7,3,FALSE),\"\")","v":""}]
["Mean alkalinity used (min 0.005) (mEq/l)",{"$f":"IF('Site Data'!B4<0.005,0.005,'Site Data'!B4)","v":0.19800000000000001},"PTI EQR",null,null,null,{"$f":"(G7-0.75)/(G6-0.75)","v":0.78429145565983194},null,null,null,{"$f":"(K7-0.75)/(K6-0.75)","v":0.89665725061653789},null,null,null,{"$f":"(O7-0.75)/(O6-0.75)","v":0.87982714458811562},null,null,null,{"$f":"(S7-0.75)/(S6-0.75)","v":0.77473567165888091},null,null,null,{"$f":"(W7-0.75)/(W6-0.75)","v":0.87024289641339214},null,null,null,{"$f":"(AA7-0.75)/(AA6-0.75)","v":0.77540531934902546},null,null,null,{"$f":"(AE7-0.75)/(AE6-0.75)","v":0.87889843960993552},null,null,null,{"$f":"(AI7-0.75)/(AI6-0.75)","v":{"$error":"#DIV/0!"}},null,null,null,{"$f":"(AM7-0.75)/(AM6-0.75)","v":{"$error":"#DIV/0!"}}]
["Mean depth used (min 1.0) (m)",{"$f":"IF('Site Data'!B5<1,1,'Site Data'!B5)","v":8.3699999999999992},"Ref PTI",null,null,null,{"$f":"0.028*LOG($B5/$B6)+0.498","v":0.45247031250351161},null,null,null,{"$f":"0.028*LOG($B5/$B6)+0.498","v":0.45247031250351161},null,null,null,{"$f":"0.028*LOG($B5/$B6)+0.498","v":0.45247031250351161},null,null,null,{"$f":"0.028*LOG($B5/$B6)+0.498","v":0.45247031250351161},null,null,null,{"$f":"0.028*LOG($B5/$B6)+0.498","v":0.45247031250351161},null,null,null,{"$f":"0.028*LOG($B5/$B6)+0.498","v":0.45247031250351161},null,null,null,{"$f":"0.028*LOG($B5/$B6)+0.498","v":0.45247031250351161},null,null,null,{"$f":"0.028*LOG($B5/$B6)+0.498","v":0.45247031250351161},null,null,null,{"$f":"0.028*LOG($B5/$B6)+0.498","v":0.45247031250351161}]
["Humic Type",{"$f":"'Site Data'!B6","v":"C"},"PTI",null,null,null,{"$f":"F17/E17","v":0.5166500082913642},null,null,null,{"$f":"J17/I17","v":0.48321784843260102},null,null,null,{"$f":"N17/M17","v":0.48822530461977026},null,null,null,{"$f":"R17/Q17","v":0.51949313771895111},null,null,null,{"$f":"V17/U17","v":0.49107690298408452},null,null,null,{"$f":"Z17/Y17","v":0.51929389765096967},null,null,null,{"$f":"AD17/AC17","v":0.4885016219217046},null,null,null,{"$f":"AH17/AG17","v":{"$error":"#DIV/0!"}},null,null,null,{"$f":"AL17/AK17","v":{"$error":"#DIV/0!"}}]
["Alkalinity Type",{"$f":"'Site Data'!B9","v":"LA"},"Cyan Class",null,null,null,{"$f":"IF(COUNT(D21:D150)>1,IF(G9>=0.8,\"High\",IF(G9>=0.6,\"Good\",IF(G9>=0.4,\"Moderate\",IF(G9>=0.2,\"Poor\",\"Bad\")))),\"\")","v":"Moderate"},null,null,null,{"$f":"IF(COUNT(H21:H150)>1,IF(K9>=0.8,\"High\",IF(K9>=0.6,\"Good\",IF(K9>=0.4,\"Moderate\",IF(K9>=0.2,\"Poor\",\"Bad\")))),\"\")","v":"Moderate"},null,null,null,{"$f":"IF(COUNT(L21:L150)>1,IF(O9>=0.8,\"High\",IF(O9>=0.6,\"Good\",IF(O9>=0.4,\"Moderate\",IF(O9>=0.2,\"Poor\",\"Bad\")))),\"\")","v":"Moderate"},null,null,null,{"$f":"IF(COUNT(P21:P150)>1,IF(S9>=0.8,\"High\",IF(S9>=0.6,\"Good\",IF(S9>=0.4,\"Moderate\",IF(S9>=0.2,\"Poor\",\"Bad\")))),\"\")","v":"Good"},null,null,null,{"$f":"IF(COUNT(T21:T150)>1,IF(W9>=0.8,\"High\",IF(W9>=0.6,\"Good\",IF(W9>=0.4,\"Moderate\",IF(W9>=0.2,\"Poor\",\"Bad\")))),\"\")","v":"Moderate"},null,null,null,{"$f":"IF(COUNT(X21:X150)>1,IF(AA9>=0.8,\"High\",IF(AA9>=0.6,\"Good\",IF(AA9>=0.4,\"Moderate\",IF(AA9>=0.2,\"Poor\",\"Bad\")))),\"\")","v":"Poor"},null,null,null,{"$f":"IF(COUNT(AB21:AB150)>1,IF(AE9>=0.8,\"High\",IF(AE9>=0.6,\"Good\",IF(AE9>=0.4,\"Moderate\",IF(AE9>=0.2,\"Poor\",\"Bad\")))),\"\")","v":"Moderate"},null,null,null,{"$f":"IF(COUNT(AF21:AF150)>1,IF(AI9>=0.8,\"High\",IF(AI9>=0.6,\"Good\",IF(AI9>=0.4,\"Moderate\",IF(AI9>=0.2,\"Poor\",\"Bad\")))),\"\")","v":""},null,null,null,{"$f":"IF(COUNT(AJ21:AJ150)>1,IF(AM9>=0.8,\"High\",IF(AM9>=0.6,\"Good\",IF(AM9>=0.4,\"Moderate\",IF(AM9>=0.2,\"Poor\",\"Bad\")))),\"\")","v":""}]
["Depth Type",{"$f":"'Site Data'!B10","v":"S"},"Cyan EQRNorm",null,null,null,{"$f":"IF(COUNT(D21:D150)>1,IF($B$8=\"HA\",((G10-VLOOKUP(G10,LU!$H3:$H7,1))/VLOOKUP(G10,LU!$H3:$J7,2)*0.2)+VLOOKUP(G10,LU!$H3:$J7,3),((G10-VLOOKUP(G10,LU!$C3:$E7,1))/VLOOKUP(G10,LU!$C3:$E7,2)*0.2)+VLOOKUP(G10,LU!$C3:$E7,3)),\"\")","v":0.54115886468399066},null,null,null,{"$f":"IF(COUNT(H21:H150)>1,IF($B$8=\"HA\",((K10-VLOOKUP(K10,LU!$H3:$H7,1))/VLOOKUP(K10,LU!$H3:$J7,2)*0.2)+VLOOKUP(K10,LU!$H3:$J7,3),((K10-VLOOKUP(K10,LU!$C3:$E7,1))/VLOOKUP(K10,LU!$C3:$E7,2)*0.2)+VLOOKUP(K10,LU!$C3:$E7,3)),\"\")","v":0.50565740502405288},null,null,null,{"$f":"IF(COUNT(L21:L150)>1,IF($B$8=\"HA\",((O10-VLOOKUP(O10,LU!$H3:$H7,1))/VLOOKUP(O10,LU!$H3:$J7,2)*0.2)+VLOOKUP(O10,LU!$H3:$J7,3),((O10-VLOOKUP(O10,LU!$C3:$E7,1))/VLOOKUP(O10,LU!$C3:$E7,2)*0.2)+VLOOKUP(O10,LU!$C3:$E7,3)),\"\")","v":0.42119514962879967},null,null,null,{"$f":"IF(COUNT(P21:P150)>1,IF($B$8=\"HA\",((S10-VLOOKUP(S10,LU!$H3:$H7,1))/VLOOKUP(S10,LU!$H3:$J7,2)*0.2)+VLOOKUP(S10,LU!$H3:$J7,3),((S10-VLOOKUP(S10,LU!$C3:$E7,1))/VLOOKUP(S10,LU!$C3:$E7,2)*0.2)+VLOOKUP(S10,LU!$C3:$E7,3)),\"\")","v":0.66944757698252855},null,null,null,{"$f":"IF(COUNT(T21:T150)>1,IF($B$8=\"HA\",((W10-VLOOKUP(W10,LU!$H3:$H7,1))/VLOOKUP(W10,LU!$H3:$J7,2)*0.2)+VLOOKUP(W10,LU!$H3:$J7,3),((W10-VLOOKUP(W10,LU!$C3:$E7,1))/VLOOKUP(W10,LU!$C3:$E7,2)*0.2)+VLOOKUP(W10,LU!$C3:$E7,3)),\"\")","v":0.40169259676909241},null,null,null,{"$f":"IF(COUNT(X21:X150)>1,IF($B$8=\"HA\",((AA10-VLOOKUP(AA10,LU!$H3:$H7,1))/VLOOKUP(AA10,LU!$H3:$J7,2)*0.2)+VLOOKUP(AA10,LU!$H3:$J7,3),((AA10-VLOOKUP(AA10,LU!$C3:$E7,1))/VLOOKUP(AA10,LU!$C3:$E7,2)*0.2)+VLOOKUP(AA10,LU!$C3:$E7,3)),\"\")","v":0.33976580508334953},null,null,null,{"$f":"IF(COUNT(AB21:AB150)>1,IF($B$8=\"HA\",((AE10-VLOOKUP(AE10,LU!$H3:$H7,1))/VLOOKUP(AE10,LU!$H3:$J7,2)*0.2)+VLOOKUP(AE10,LU!$H3:$J7,3),((AE10-VLOOKUP(AE10,LU!$C3:$E7,1))/VLOOKUP(AE10,LU!$C3:$E7,2)*0.2)+VLOOKUP(AE10,LU!$C3:$E7,3)),\"\")","v":0.5173618601339024},null,null,null,{"$f":"IF(COUNT(AF21:AF150)>1,IF($B$8=\"HA\",((AI10-VLOOKUP(AI10,LU!$H3:$H7,1))/VLOOKUP(AI10,LU!$H3:$J7,2)*0.2)+VLOOKUP(AI10,LU!$H3:$J7,3),((AI10-VLOOKUP(AI10,LU!$C3:$E7,1))/VLOOKUP(AI10,LU!$C3:$E7,2)*0.2)+VLOOKUP(AI10,LU!$C3:$E7,3)),\"\")","v":""},null,null,null,{"$f":"IF(COUNT(AJ21:AJ150)>1,IF($B$8=\"HA\",((AM10-VLOOKUP(AM10,LU!$H3:$H7,1))/VLOOKUP(AM10,LU!$H3:$J7,2)*0.2)+VLOOKUP(AM10,LU!$H3:$J7,3),((AM10-VLOOKUP(AM10,LU!$C3:$E7,1))/VLOOKUP(AM10,LU!$C3:$E7,2)*0.2)+VLOOKUP(AM10,LU!$C3:$E7,3)),\"\")","v":""}]
["Type used for PTI",{"$f":"'Site Data'!B9&'Site Data'!B10&'Site Data'!B6","v":"LASC"},"Cyan EQR",null,null,null,{"$f":"IF(COUNT(D21:D300)>1,IF(G17>=30,0,(LOG(G12+0.0001)-LOG(30+0.0001))/((LOG(G11+0.0001)-LOG(30+0.0001)))),\"\")","v":0.2935214891077958},null,null,null,{"$f":"IF(COUNT(H21:H300)>1,IF(K17>=30,0,(LOG(K12+0.0001)-LOG(30+0.0001))/((LOG(K11+0.0001)-LOG(30+0.0001)))),\"\")","v":0.2775458322608238},null,null,null,{"$f":"IF(COUNT(L21:L300)>1,IF(O17>=30,0,(LOG(O12+0.0001)-LOG(30+0.0001))/((LOG(O11+0.0001)-LOG(30+0.0001)))),\"\")","v":0.23953781733295984},null,null,null,{"$f":"IF(COUNT(P21:P300)>1,IF(S17>=30,0,(LOG(S12+0.0001)-LOG(30+0.0001))/((LOG(S11+0.0001)-LOG(30+0.0001)))),\"\")","v":0.37208568273689646},null,null,null,{"$f":"IF(COUNT(T21:T300)>1,IF(W17>=30,0,(LOG(W12+0.0001)-LOG(30+0.0001))/((LOG(W11+0.0001)-LOG(30+0.0001)))),\"\")","v":0.23076166854609159},null,null,null,{"$f":"IF(COUNT(X21:X300)>1,IF(AA17>=30,0,(LOG(AA12+0.0001)-LOG(30+0.0001))/((LOG(AA11+0.0001)-LOG(30+0.0001)))),\"\")","v":0.19988290254167476},null,null,null,{"$f":"IF(COUNT(AB21:AB300)>1,IF(AE17>=30,0,(LOG(AE12+0.0001)-LOG(30+0.0001))/((LOG(AE11+0.0001)-LOG(30+0.0001)))),\"\")","v":0.28281283706025606},null,null,null,{"$f":"IF(COUNT(AF21:AF300)>1,IF(AI17>=30,0,(LOG(AI12+0.0001)-LOG(30+0.0001))/((LOG(AI11+0.0001)-LOG(30+0.0001)))),\"\")","v":""},null,null,null,{"$f":"IF(COUNT(AJ21:AJ300)>1,IF(AM17>=30,0,(LOG(AM12+0.0001)-LOG(30+0.0001))/((LOG(AM11+0.0001)-LOG(30+0.0001)))),\"\")","v":""}]
["PTI normalisation equation",{"$f":"VLOOKUP('Site Data'!B9&'Site Data'!B10&'Site Data'!B6,LU!L4:M23,2,FALSE)","v":5},"Ref Cyan",null,null,null,{"$f":"IF($B8=\"HA\",LU!$G3,LU!$B3)","v":0},null,null,null,{"$f":"IF($B8=\"HA\",LU!$G3,LU!$B3)","v":0},null,null,null,{"$f":"IF($B8=\"HA\",LU!$G3,LU!$B3)","v":0},null,null,null,{"$f":"IF($B8=\"HA\",LU!$G3,LU!$B3)","v":0},null,null,null,{"$f":"IF($B8=\"HA\",LU!$G3,LU!$B3)","v":0},null,null,null,{"$f":"IF($B8=\"HA\",LU!$G3,LU!$B3)","v":0},null,null,null,{"$f":"IF($B8=\"HA\",LU!$G3,LU!$B3)","v":0},null,null,null,{"$f":"IF($B8=\"HA\",LU!$G3,LU!$B3)","v":0},null,null,null,{"$f":"IF($B8=\"HA\",LU!$G3,LU!$B3)","v":0}]
[null,null,"Cyan Bvol (mm3/l)",null,null,null,{"$f":"SUM(G21:G300)","v":0.74030525203291053},null,null,null,{"$f":"SUM(K21:K300)","v":0.90557029490161822},null,null,null,{"$f":"SUM(O21:O300)","v":1.4625643791576184},null,null,null,{"$f":"SUM(S21:S300)","v":0.27479305146599176},null,null,null,{"$f":"SUM(W21:W300)","v":1.6337520551650808},null,null,null,{"$f":"SUM(AA21:AA300)","v":2.4116901606386891},null,null,null,{"$f":"SUM(AE21:AE300)","v":0.84736562627557688},null,null,null,{"$f":"SUM(AI21:AI300)","v":0},null,null,null,{"$f":"SUM(AM21:AM300)","v":0}]
[]
[]
[null,null,"N Taxa",null,null,null,{"$f":"COUNT(D21:D300)","v":16},null,null,null,{"$f":"COUNT(H21:H300)","v":20},null,null,null,{"$f":"COUNT(L21:L300)","v":25},null,null,null,{"$f":"COUNT(P21:P300)","v":20},null,null,null,{"$f":"COUNT(T21:T300)","v":21},null,null,null,{"$f":"COUNT(X21:X300)","v":20},null,null,null,{"$f":"COUNT(AB21:AB300)","v":20},null,null,null,{"$f":"COUNT(AF21:AF300)","v":0},null,null,null,{"$f":"COUNT(AJ21:AJ300)","v":0}]
[null,null,"Cyan Taxa",null,null,null,{"$f":"COUNT(G21:G300)","v":3},null,null,null,{"$f":"COUNT(K21:K300)","v":3},null,null,null,{"$f":"COUNT(O21:O300)","v":3},null,null,null,{"$f":"COUNT(S21:S300)","v":3},null,null,null,{"$f":"COUNT(W21:W300)","v":4},null,null,null,{"$f":"COUNT(AA21:AA300)","v":4},null,null,null,{"$f":"COUNT(AE21:AE300)","v":4},null,null,null,{"$f":"COUNT(AI21:AI300)","v":0},null,null,null,{"$f":"COUNT(AM21:AM300)","v":0}]
[null,null,"Sum",{"$f":"SUM(D21:D300)","v":1382061.1406668045},64.769799380992666,33.46331738721986,0.74030525203291053,2343356.827555859,83.622332037233463,40.407803367948517,0.90557029490161822,2200688.1481769579,100.61333009195516,49.121973732954309,1.4625643791576184,577924.03148740856,79.238088759660243,41.163643356608652,0.27479305146599176,2287864.1003070502,85.966052978815995,42.21594305860269,1.6337520551650808,3254858.9821217102,90.467342222880717,46.979138753043863,2.4116901606386891,1523709.9650145466,80.944031824976022,39.541290831382859,0.84736562627557688,0,0,0,0,0,0,0,0]
["Taxon name","Taxon Code","PTI Optima ","BioVol (µm3/ml)","Log BVol","Product (Optima x Log BVol)","Cyan BioVol (mm3/l)","Bio Vol (µm3/ml)","Log BVol","Product (Optima x Log BVol)","Cyan BioVol (mm3/l)","Bio Vol (µm3/ml)","Log BVol","Product (Optima x Log BVol)","Cyan BioVol (mm3/l)","Bio Vol (µm3/ml)","Log BVol","Product (Optima x Log BVol)","Cyan BioVol (mm3/l)","Bio Vol (µm3/ml)","Log BVol","Product (Optima x Log BVol)","Cyan BioVol (mm3/l)","Bio Vol (µm3/ml)","Log BVol","Product (Optima x Log BVol)","Cyan BioVol (mm3/l)","Bio Vol (µm3/ml)","Log BVol","Product (Optima x Log BVol)","Cyan BioVol (mm3/l)","Bio Vol (µm3/ml)","Log BVol","Product (Optima x Log BVol)","Cyan BioVol (mm3/l)","Bio Vol (µm3/ml)","Log BVol","Product (Optima x Log BVol)","Cyan BioVol (mm3/l)"]
[]
[]
[{"$f":"Taxa_PivotTable!A21","v":"Anabaena"},{"$f":"IF(Taxa_PivotTable!B21=\"\",\"\",Taxa_PivotTable!B21)","v":"01020000"},{"$f":"IF(ISNUMBER(VLOOKUP(B21,UKOptima!A:J,10,FALSE)),VLOOKUP(B21,UKOptima!A:J,10,FALSE),\"\")","v":0.56799999999999995},{"$f":"IF(ISNUMBER(Taxa_PivotTable!C21),Taxa_PivotTable!C21,\"\")","v":114004.89887719243},{"$f":"IF(ISNUMBER(D21),LOG(ROUND(D21,6)),\"\")","v":5.0569235137008288},{"$f":"IF(COUNT(E21,$C21)=2,(E21)*$C21,\"\")","v":2.8723325557820707},{"$f":"IF(AND(ISNUMBER(D21),LEFT($B21,2)=\"01\"),D21/10^6,\"\")","v":0.11400489887719244},{"$f":"IF(ISNUMBER(Taxa_PivotTable!D21),Taxa_PivotTable!D21,\"\")","v":31383.371039227128},{"$f":"IF(ISNUMBER(H21),LOG(ROUND(H21,6)),\"\")","v":4.4966995914180385},{"$f":"IF(COUNT(I21,$C21)=2,(I21)*$C21,\"\")","v":2.5541253679254456},{"$f":"IF(AND(ISNUMBER(H21),LEFT($B21,2)=\"01\"),H21/10^6,\"\")","v":3.1383371039227129E-2},{"$f":"IF(ISNUMBER(Taxa_PivotTable!E21),Taxa_PivotTable!E21,\"\")","v":84305.50861135083},{"$f":"IF(ISNUMBER(L21),LOG(ROUND(L21,6)),\"\")","v":4.9258559528121548},{"$f":"IF(COUNT(M21,$C21)=2,(M21)*$C21,\"\")","v":2.7978861811973035},{"$f":"IF(AND(ISNUMBER(L21),LEFT($B21,2)=\"01\"),L21/10^6,\"\")","v":8.4305508611350832E-2},{"$f":"IF(ISNUMBER(Taxa_PivotTable!F21),Taxa_PivotTable!F21,\"\")","v":12104.144637025307},{"$f":"IF(ISNUMBER(P21),LOG(ROUND(P21,6)),\"\")","v":4.0829341045950773},{"$f":"IF(COUNT(Q21,$C21)=2,(Q21)*$C21,\"\")","v":2.3191065714100039},{"$f":"IF(AND(ISNUMBER(P21),LEFT($B21,2)=\"01\"),P21/10^6,\"\")","v":1.2104144637025306E-2},{"$f":"IF(ISNUMBER(Taxa_PivotTable!G21),Taxa_PivotTable!G21,\"\")","v":1376.4602311627552},{"$f":"IF(ISNUMBER(T21),LOG(ROUND(T21,6)),\"\")","v":3.1387636681763134},{"$f":"IF(COUNT(U21,$C21)=2,(U21)*$C21,\"\")","v":1.7828177635241458},{"$f":"IF(AND(ISNUMBER(T21),LEFT($B21,2)=\"01\"),T21/10^6,\"\")","v":1.3764602311627553E-3},{"$f":"IF(ISNUMBER(Taxa_PivotTable!H21),Taxa_PivotTable!H21,\"\")","v":114966.91169971511},{"$f":"IF(ISNUMBER(X21),LOG(ROUND(X21,6)),\"\")","v":5.0605728652769928},{"$f":"IF(COUNT(Y21,$C21)=2,(Y21)*$C21,\"\")","v":2.8744053874773314},{"$f":"IF(AND(ISNUMBER(X21),LEFT($B21,2)=\"01\"),X21/10^6,\"\")","v":0.11496691169971511},{"$f":"IF(ISNUMBER(Taxa_PivotTable!I21),Taxa_PivotTable!I21,\"\")","v":4045.1176420056436},{"$f":"IF(ISNUMBER(AB21),LOG(ROUND(AB21,6)),\"\")","v":3.606931156486858},{"$f":"IF(COUNT(AC21,$C21)=2,(AC21)*$C21,\"\")","v":2.048736896884535},{"$f":"IF(AND(ISNUMBER(AB21),LEFT($B21,2)=\"01\"),AB21/10^6,\"\")","v":4.0451176420056439E-3},{"$f":"IF(ISNUMBER(Taxa_PivotTable!J21),Taxa_PivotTable!J21,\"\")","v":""},{"$f":"IF(ISNUMBER(AF21),LOG(ROUND(AF21,6)),\"\")","v":""},{"$f":"IF(COUNT(AG21,$C21)=2,(AG21)*$C21,\"\")","v":""},{"$f":"IF(AND(ISNUMBER(AF21),LEFT($B21,2)=\"01\"),AF21/10^6,\"\")","v":""},{"$f":"IF(ISNUMBER(Taxa_PivotTable!K21),Taxa_PivotTable!K21,\"\")","v":""},{"$f":"IF(ISNUMBER(AJ21),LOG(ROUND(AJ21,6)),\"\")","v":""},{"$f":"IF(COUNT(AK21,$C21)=2,(AK21)*$C21,\"\")","v":""},{"$f":"IF(AND(ISNUMBER(AJ21),LEFT($B21,2)=\"01\"),AJ21/10^6,\"\")","v":""}]
[{"$f":"Taxa_PivotTable!A22","v":"Aphanizomenon flos-aquae"},{"$f":"IF(Taxa_PivotTable!B22=\"\",\"\",Taxa_PivotTable!B22)","v":"01040020"},{"$f":"IF(ISNUMBER(VLOOKUP(B22,UKOptima!A:J,10,FALSE)),VLOOKUP(B22,UKOptima!A:J,10,FALSE),\"\")","v":0.748},{"$f":"IF(ISNUMBER(Taxa_PivotTable!C22),Taxa_PivotTable!C22,\"\")","v":""},{"$f":"IF(ISNUMBER(D22),LOG(ROUND(D22,6)),\"\")","v":""},"",{"$f":"IF(AND(ISNUMBER(D22),LEFT($B22,2)=\"01\"),D22/10^6,\"\")","v":""},{"$f":"IF(ISNUMBER(Taxa_PivotTable!D22),Taxa_PivotTable!D22,\"\")","v":""},{"$f":"IF(ISNUMBER(H22),LOG(ROUND(H22,6)),\"\")","v":""},"",{"$f":"IF(AND(ISNUMBER(H22),LEFT($B22,2)=\"01\"),H22/10^6,\"\")","v":""},{"$f":"IF(ISNUMBER(Taxa_PivotTable!E22),Taxa_PivotTable!E22,\"\")","v":""},{"$f":"IF(ISNUMBER(L22),LOG(ROUND(L22,6)),\"\")","v":""},"",{"$f":"IF(AND(ISNUMBER(L22),LEFT($B22,2)=\"01\"),L22/10^6,\"\")","v":""},{"$f":"IF(ISNUMBER(Taxa_PivotTable!F22),Taxa_PivotTable!F22,\"\")","v":""},{"$f":"IF(ISNUMBER(P22),LOG(ROUND(P22,6)),\"\")","v":""},"",{"$f":"IF(AND(ISNUMBER(P22),LEFT($B22,2)=\"01\"),P22/10^6,\"\")","v":""},{"$f":"IF(ISNUMBER(Taxa_PivotTable!G22),Taxa_PivotTable!G22,\"\")","v":27789.247255847957},{"$f":"IF(ISNUMBER(T22),LOG(ROUND(T22,6)),\"\")","v":4.4438767829417083},3.3240198336403979,{"$f":"IF(AND(ISNUMBER(T22),LEFT($B22,2)=\"01\"),T22/10^6,\"\")","v":2.7789247255847957E-2},{"$f":"IF(ISNUMBER(Taxa_PivotTable!H22),Taxa_PivotTable!H22,\"\")","v":61639.735133119313},{"$f":"IF(ISNUMBER(X22),LOG(ROUND(X22,6)),\"\")","v":4.7898607638795472},3.5828158513819011,{"$f":"IF(AND(ISNUMBER(X22),LEFT($B22,2)=\"01\"),X22/10^6,\"\")","v":6.1639735133119315E-2},{"$f":"IF(ISNUMBER(Taxa_PivotTable!I22),Taxa_PivotTable!I22,\"\")","v":79723.26640226008},{"$f":"IF(ISNUMBER(AB22),LOG(ROUND(AB22,6)),\"\")","v":4.9015850841993354},3.666385642981103,{"$f":"IF(AND(ISNUMBER(AB22),LEFT($B22,2)=\"01\"),AB22/10^6,\"\")","v":7.9723266402260073E-2},{"$f":"IF(ISNUMBER(Taxa_PivotTable!J22),Taxa_PivotTable!J22,\"\")","v":""},{"$f":"IF(ISNUMBER(AF22),LOG(ROUND(AF22,6)),\"\")","v":""},"",{"$f":"IF(AND(ISNUMBER(AF22),LEFT($B22,2)=\"01\"),AF22/10^6,\"\")","v":""},{"$f":"IF(ISNUMBER(Taxa_PivotTable!K22),Taxa_PivotTable!K22,\"\")","v":""},{"$f":"IF(ISNUMBER(AJ22),LOG(ROUND(AJ22,6)),\"\")","v":""},"",{"$f":"IF(AND(ISNUMBER(AJ22),LEFT($B22,2)=\"01\"),AJ22/10^6,\"\")","v":""}]
[{"$f":"Taxa_PivotTable!A23","v":"Oscillatoria"},{"$f":"IF(Taxa_PivotTable!B23=\"\",\"\",Taxa_PivotTable!B23)","v":"01530000"},{"$f":"IF(ISNUMBER(VLOOKUP(B23,UKOptima!A:J,10,FALSE)),VLOOKUP(B23,UKOptima!A:J,10,FALSE),\"\")","v":0.56699999999999995},{"$f":"IF(ISNUMBER(Taxa_PivotTable!C23),Taxa_PivotTable!C23,\"\")","v":214663.19901731593},5.3317575971435076,3.0231065575803684,0.21466319901731593,{"$f":"IF(ISNUMBER(Taxa_PivotTable!D23),Taxa_PivotTable!D23,\"\")","v":31349.661725543741},4.4962328590000951,2.5493640310530536,3.1349661725543744E-2,{"$f":"IF(ISNUMBER(Taxa_PivotTable!E23),Taxa_PivotTable!E23,\"\")","v":30338.38231504233},4.4819924198785577,2.541289702071142,3.033838231504233E-2,{"$f":"IF(ISNUMBER(Taxa_PivotTable!F23),Taxa_PivotTable!F23,\"\")","v":16559.700346960606},4.2190524738243553,2.3922027526584091,1.6559700346960606E-2,{"$f":"IF(ISNUMBER(Taxa_PivotTable!G23),Taxa_PivotTable!G23,\"\")","v":445378.89684295387},5.6487296352355987,3.2028297031785842,0.44537889684295384,{"$f":"IF(ISNUMBER(Taxa_PivotTable!H23),Taxa_PivotTable!H23,\"\")","v":490258.61600750999},5.6904252348780151,3.2264711081758342,0.49025861600750997,{"$f":"IF(ISNUMBER(Taxa_PivotTable!I23),Taxa_PivotTable!I23,\"\")","v":195166.81343266735},5.290405971280272,2.9996601857159138,0.19516681343266734,{"$f":"IF(ISNUMBER(Taxa_PivotTable!J23),Taxa_PivotTable!J23,\"\")","v":""},"","","",{"$f":"IF(ISNUMBER(Taxa_PivotTable!K23),Taxa_PivotTable!K23,\"\")","v":""},"","",""]
[{"$f":"Taxa_PivotTable!A24","v":"Woronichinia"},{"$f":"IF(Taxa_PivotTable!B24=\"\",\"\",Taxa_PivotTable!B24)","v":"01780000"},{"$f":"IF(ISNUMBER(VLOOKUP(B24,UKOptima!A:J,10,FALSE)),VLOOKUP(B24,UKOptima!A:J,10,FALSE),\"\")","v":0.503},{"$f":"IF(ISNUMBER(Taxa_PivotTable!C24),Taxa_PivotTable!C24,\"\")","v":411637.1541384022},5.6145145670352097,2.8241008272187105,0.41163715413840218,{"$f":"IF(ISNUMBER(Taxa_PivotTable!D24),Taxa_PivotTable!D24,\"\")","v":842837.26213684736},5.9257437276749751,2.9806490950205125,0.8428372621368474,{"$f":"IF(ISNUMBER(Taxa_PivotTable!E24),Taxa_PivotTable!E24,\"\")","v":1347920.4882312252},6.1296642745872951,3.0832211301174093,1.3479204882312252,{"$f":"IF(ISNUMBER(Taxa_PivotTable!F24),Taxa_PivotTable!F24,\"\")","v":246129.20648200583},5.3911631515384943,2.7117550652238629,0.24612920648200584,{"$f":"IF(ISNUMBER(Taxa_PivotTable!G24),Taxa_PivotTable!G24,\"\")","v":1159207.4508351162},6.0641611639107778,3.0502730654471213,1.1592074508351162,{"$f":"IF(ISNUMBER(Taxa_PivotTable!H24),Taxa_PivotTable!H24,\"\")","v":1744824.8977983445},6.2417518497847286,3.1396011804417183,1.7448248977983445,{"$f":"IF(ISNUMBER(Taxa_PivotTable!I24),Taxa_PivotTable!I24,\"\")","v":568430.42879864376},5.7546773182100077,2.8946026910596339,0.56843042879864381,{"$f":"IF(ISNUMBER(Taxa_PivotTable!J24),Taxa_PivotTable!J24,\"\")","v":""},"","","",{"$f":"IF(ISNUMBER(Taxa_PivotTable!K24),Taxa_PivotTable!K24,\"\")","v":""},"","",""]
[{"$f":"Taxa_PivotTable!A25","v":"Trachelomonas"},{"$f":"IF(Taxa_PivotTable!B25=\"\",\"\",Taxa_PivotTable!B25)","v":"04100000"},{"$f":"IF(ISNUMBER(VLOOKUP(B25,UKOptima!A:J,10,FALSE)),VLOOKUP(B25,UKOptima!A:J,10,FALSE),\"\")","v":0.621},{"$f":"IF(ISNUMBER(Taxa_PivotTable!C25),Taxa_PivotTable!C25,\"\")","v":1160.907486544987},3.0647976120846079,1.9032393171045414,"",{"$f":"IF(ISNUMBER(Taxa_PivotTable!D25),Taxa_PivotTable!D25,\"\")","v":""},"","","",{"$f":"IF(ISNUMBER(Taxa_PivotTable!E25),Taxa_PivotTable!E25,\"\")","v":45464.552924098345},4.6576729248064677,2.8924148863048162,"",{"$f":"IF(ISNUMBER(Taxa_PivotTable!F25),Taxa_PivotTable!F25,\"\")","v":7163.9600994691154},3.8551531583003356,2.3940501113045083,"",{"$f":"IF(ISNUMBER(Taxa_PivotTable!G25),Taxa_PivotTable!G25,\"\")","v":""},"","","",{"$f":"IF(ISNUMBER(Taxa_PivotTable!H25),Taxa_PivotTable!H25,\"\")","v":2348.1803860235927},3.3707314561340485,2.0932242342592442,"",{"$f":"IF(ISNUMBER(Taxa_PivotTable!I25),Taxa_PivotTable!I25,\"\")","v":""},"","","",{"$f":"IF(ISNUMBER(Taxa_PivotTable!J25),Taxa_PivotTable!J25,\"\")","v":""},"","","",{"$f":"IF(ISNUMBER(Taxa_PivotTable!K25),Taxa_PivotTable!K25,\"\")","v":""},"","",""]
[{"$f":"Taxa_PivotTable!A26","v":"Cryptomonas (small) Length <20 µm"},{"$f":"IF(Taxa_PivotTable!B26=\"\",\"\",Taxa_PivotTable!B26)","v":"05040001"},{"$f":"IF(ISNUMBER(VLOOKUP(B26,UKOptima!A:J,10,FALSE)),VLOOKUP(B26,UKOptima!A:J,10,FALSE),\"\")","v":0.53},{"$f":"IF(ISNUMBER(Taxa_PivotTable!C26),Taxa_PivotTable!C26,\"\")","v":330.21368506168517},2.5187950677057849,1.3349613858840661,"",{"$f":"IF(ISNUMBER(Taxa_PivotTable!D26),Taxa_PivotTable!D26,\"\")","v":8118.2260534090938},3.9094611401327422,2.0720144042703534,"",{"$f":"IF(ISNUMBER(Taxa_PivotTable!E26),Taxa_PivotTable!E26,\"\")","v":2256.804153843455},3.3534938725347687,1.7773517524434275,"",{"$f":"IF(ISNUMBER(Taxa_PivotTable!F26),Taxa_PivotTable!F26,\"\")","v":1104.495982013616},3.0431641403084928,1.6128769943635013,"",{"$f":"IF(ISNUMBER(Taxa_PivotTable!G26),Taxa_PivotTable!G26,\"\")","v":52305.718098675541},4.7185491688500187,2.5008310594905101,"",{"$f":"IF(ISNUMBER(Taxa_PivotTable!H26),Taxa_PivotTable!H26,\"\")","v":52586.399035442402},4.7208734325975845,2.5020629192767201,"",{"$f":"IF(ISNUMBER(Taxa_PivotTable!I26),Taxa_PivotTable!I26,\"\")","v":9371.464382050628},3.9718074589060217,2.1050579532201916,"",{"$f":"IF(ISNUMBER(Taxa_PivotTable!J26),Taxa_PivotTable!J26,\"\")","v":""},"","","",{"$f":"IF(ISNUMBER(Taxa_PivotTable!K26),Taxa_PivotTable!K26,\"\")","v":""},"","",""]
[{"$f":"Taxa_PivotTable!A27","v":"Cryptomonas (medium) Length 20-30 µm"},{"$f":"IF(Taxa_PivotTable!B27=\"\",\"\",Taxa_PivotTable!B27)","v":"05040002"},{"$f":"IF(ISNUMBER(VLOOKUP(B27,UKOptima!A:J,10,FALSE)),VLOOKUP(B27,UKOptima!A:J,10,FALSE),\"\")","v":0.53300000000000003},{"$f":"IF(ISNUMBER(Taxa_PivotTable!C27),Taxa_PivotTable!C27,\"\")","v":87263.589269141172},4.9408330721353595,2.6334640274481469,"",{"$f":"IF(ISNUMBER(Taxa_PivotTable!D27),Taxa_PivotTable!D27,\"\")","v":75581.949946399007},4.8784180921306612,2.6001968431056426,"",{"$f":"IF(ISNUMBER(Taxa_PivotTable!E27),Taxa_PivotTable!E27,\"\")","v":110568.36505675544},5.0436308878509344,2.6882552632245482,"",{"$f":"IF(ISNUMBER(Taxa_PivotTable!F27),Taxa_PivotTable!F27,\"\")","v":21569.029566333182},4.333830605760304,2.3099317128702421,"",{"$f":"IF(ISNUMBER(Taxa_PivotTable!G27),Taxa_PivotTable!G27,\"\")","v":55418.432997101721},4.7436542415765386,2.5283677107602953,"",{"$f":"IF(ISNUMBER(Taxa_PivotTable!H27),Taxa_PivotTable!H27,\"\")","v":137887.3169960987},5.1395243212014758,2.7393664632003869,"",{"$f":"IF(ISNUMBER(Taxa_PivotTable!I27),Taxa_PivotTable!I27,\"\")","v":42069.2234768587},4.6239644957877033,2.4645730762548461,"",{"$f":"IF(ISNUMBER(Taxa_PivotTable!J27),Taxa_PivotTable!J27,\"\")","v":""},"","","",{"$f":"IF(ISNUMBER(Taxa_PivotTable!K27),Taxa_PivotTable!K27,\"\")","v":""},"","",""]
[{"$f":"Taxa_PivotTable!A28","v":"Cryptomonas (large) Length >30 µm"},{"$f":"IF(Taxa_PivotTable!B28=\"\",\"\",Taxa_PivotTable!B28)","v":"05040003"},{"$f":"IF(ISNUMBER(VLOOKUP(B28,UKOptima!A:J,10,FALSE)),VLOOKUP(B28,UKOptima!A:J,10,FALSE),\"\")","v":0.58899999999999997},{"$f":"IF(ISNUMBER(Taxa_PivotTable!C28),Taxa_PivotTable!C28,\"\")","v":27813.021562644804},4.4442481724979155,2.6176621736012722,"",{"$f":"IF(ISNUMBER(Taxa_PivotTable!D28),Taxa_PivotTable!D28,\"\")","v":""},"","","",{"$f":"IF(ISNUMBER(Taxa_PivotTable!E28),Taxa_PivotTable!E28,\"\")","v":""},"","","",{"$f":"IF(ISNUMBER(Taxa_PivotTable!F28),Taxa_PivotTable!F28,\"\")","v":""},"","","",{"$f":"IF(ISNUMBER(Taxa_PivotTable!G28),Taxa_PivotTable!G28,\"\")","v":""},"","","",{"$f":"IF(ISNUMBER(Taxa_PivotTable!H28),Taxa_PivotTable!H28,\"\")","v":""},"","","",{"$f":"IF(ISNUMBER(Taxa_PivotTable!I28),Taxa_PivotTable!I28,\"\")","v":""},"","","",{"$f":"IF(ISNUMBER(Taxa_PivotTable!J28),Taxa_PivotTable!J28,\"\")","v":""},"","","",{"$f":"IF(ISNUMBER(Taxa_PivotTable!K28),Taxa_PivotTable!K28,\"\")","v":""},"","",""]
[{"$f":"Taxa_PivotTable!A29","v":"Rhodomonas"},{"$f":"IF(Taxa_PivotTable!B29=\"\",\"\",Taxa_PivotTable!B29)","v":"05100000"},{"$f":"IF(ISNUMBER(VLOOKUP(B29,UKOptima!A:J,10,FALSE)),VLOOKUP(B29,UKOptima!A:J,10,FALSE),\"\")","v":0.53900000000000003},{"$f":"IF(ISNUMBER(Taxa_PivotTable!C29),Taxa_PivotTable!C29,\"\")","v":""},"","","",{"$f":"IF(ISNUMBER(Taxa_PivotTable!D29),Taxa_PivotTable!D29,\"\")","v":""},"","","",{"$f":"IF(ISNUMBER(Taxa_PivotTable!E29),Taxa_PivotTable!E29,\"\")","v":""},"","","",{"$f":"IF(ISNUMBER(Taxa_PivotTable!F29),Taxa_PivotTable!F29,\"\")","v":6285.6016832796358},3.7983468564212846,2.0473089556110726,"",{"$f":"IF(ISNUMBER(Taxa_PivotTable!G29),Taxa_PivotTable!G29,\"\")","v":""},"","","",{"$f":"IF(ISNUMBER(Taxa_PivotTable!H29),Taxa_PivotTable!H29,\"\")","v":""},"","","",{"$f":"IF(ISNUMBER(Taxa_PivotTable!I29),Taxa_PivotTable!I29,\"\")","v":15820.220804670253},4.199212540711839,2.2633755594436815,"",{"$f":"IF(ISNUMBER(Taxa_PivotTable!J29),Taxa_PivotTable!J29,\"\")","v":""},"","","",{"$f":"IF(ISNUMBER(Taxa_PivotTable!K29),Taxa_PivotTable!K29,\"\")","v":""},"","",""]
[{"$f":"Taxa_PivotTable!A30","v":"Rhodomonas lacustris var. nannoplanctica"},{"$f":"IF(Taxa_PivotTable!B30=\"\",\"\",Taxa_PivotTable!B30)","v":"05100012"},{"$f":"IF(ISNUMBER(VLOOKUP(B30,UKOptima!A:J,10,FALSE)),VLOOKUP(B30,UKOptima!A:J,10,FALSE),\"\")","v":0.47299999999999998},{"$f":"IF(ISNUMBER(Taxa_PivotTable!C30),Taxa_PivotTable!C30,\"\")","v":29871.293980819581},4.4752540360167821,2.116795159035938,"",{"$f":"IF(ISNUMBER(Taxa_PivotTable!D30),Taxa_PivotTable!D30,\"\")","v":26219.37898414777},4.4186224010452948,2.0900083956944244,"",{"$f":"IF(ISNUMBER(Taxa_PivotTable!E30),Taxa_PivotTable!E30,\"\")","v":20300.806630824485},4.3075132944862391,2.037453788291991,"",{"$f":"IF(ISNUMBER(Taxa_PivotTable!F30),Taxa_PivotTable!F30,\"\")","v":""},"","","",{"$f":"IF(ISNUMBER(Taxa_PivotTable!G30),Taxa_PivotTable!G30,\"\")","v":26142.349279580259},4.4173446128350156,2.0894040018709621,"",{"$f":"IF(ISNUMBER(Taxa_PivotTable!H30),Taxa_PivotTable!H30,\"\")","v":11845.029054110699},4.0735361303163948,1.9267825896396547,"",{"$f":"IF(ISNUMBER(Taxa_PivotTable!I30),Taxa_PivotTable!I30,\"\")","v":""},"","","",{"$f":"IF(ISNUMBER(Taxa_PivotTable!J30),Taxa_PivotTable!J30,\"\")","v":""},"","","",{"$f":"IF(ISNUMBER(Taxa_PivotTable!K30),Taxa_PivotTable!K30,\"\")","v":""},"","",""]
[{"$f":"Taxa_PivotTable!A31","v":"Ceratium hirundinella"},{"$f":"IF(Taxa_PivotTable!B31=\"\",\"\",Taxa_PivotTable!B31)","v":"06020040"},{"$f":"IF(ISNUMBER(VLOOKUP(B31,UKOptima!A:J,10,FALSE)),VLOOKUP(B31,UKOptima!A:J,10,FALSE),\"\")","v":0.49299999999999999},{"$f":"IF(ISNUMBER(Taxa_PivotTable!C31),Taxa_PivotTable!C31,\"\")","v":399310.52505046898},5.6013107575043684,2.7614462034496534,"",{"$f":"IF(ISNUMBER(Taxa_PivotTable!D31),Taxa_PivotTable!D31,\"\")","v":463837.72134235204},5.6663660644928422,2.7935184697949711,"",{"$f":"IF(ISNUMBER(Taxa_PivotTable!E31),Taxa_PivotTable!E31,\"\")","v":278034.81252638716},5.4440991770022178,2.6839408942620935,"",{"$f":"IF(ISNUMBER(Taxa_PivotTable!F31),Taxa_PivotTable!F31,\"\")","v":37606.698762239757},4.5752652113172987,2.2556057491794284,"",{"$f":"IF(ISNUMBER(Taxa_PivotTable!G31),Taxa_PivotTable!G31,\"\")","v":196673.9705509143},5.2937468856229648,2.6098172146121215,"",{"$f":"IF(ISNUMBER(Taxa_PivotTable!H31),Taxa_PivotTable!H31,\"\")","v":21040.043359908334},4.3230466304907003,2.1312619888319153,"",{"$f":"IF(ISNUMBER(Taxa_PivotTable!I31),Taxa_PivotTable!I31,\"\")","v":""},"","","",{"$f":"IF(ISNUMBER(Taxa_PivotTable!J31),Taxa_PivotTable!J31,\"\")","v":""},"","","",{"$f":"IF(ISNUMBER(Taxa_PivotTable!K31),Taxa_PivotTable!K31,\"\")","v":""},"","",""]
[{"$f":"Taxa_PivotTable!A32","v":"Gymnodinium"},{"$f":"IF(Taxa_PivotTable!B32=\"\",\"\",Taxa_PivotTable!B32)","v":"06070000"},{"$f":"IF(ISNUMBER(VLOOKUP(B32,UKOptima!A:J,10,FALSE)),VLOOKUP(B32,UKOptima!A:J,10,FALSE),\"\")","v":0.46},{"$f":"IF(ISNUMBER(Taxa_PivotTable!C32),Taxa_PivotTable!C32,\"\")","v":""},"","","",{"$f":"IF(ISNUMBER(Taxa_PivotTable!D32),Taxa_PivotTable!D32,\"\")","v":648141.61518298567},5.811669907063572,2.6733681572492434,"",{"$f":"IF(ISNUMBER(Taxa_PivotTable!E32),Taxa_PivotTable!E32,\"\")","v":""},"","","",{"$f":"IF(ISNUMBER(Taxa_PivotTable!F32),Taxa_PivotTable!F32,\"\")","v":""},"","","",{"$f":"IF(ISNUMBER(Taxa_PivotTable!G32),Taxa_PivotTable!G32,\"\")","v":""},"","","",{"$f":"IF(ISNUMBER(Taxa_PivotTable!H32),Taxa_PivotTable!H32,\"\")","v":386486.64283243782},5.5871344890833301,2.5700818649783321,"",{"$f":"IF(ISNUMBER(Taxa_PivotTable!I32),Taxa_PivotTable!I32,\"\")","v":""},"","","",{"$f":"IF(ISNUMBER(Taxa_PivotTable!J32),Taxa_PivotTable!J32,\"\")","v":""},"","","",{"$f":"IF(ISNUMBER(Taxa_PivotTable!K32),Taxa_PivotTable!K32,\"\")","v":""},"","",""]
[{"$f":"Taxa_PivotTable!A33","v":"Gymnodinium helveticum"},{"$f":"IF(Taxa_PivotTable!B33=\"\",\"\",Taxa_PivotTable!B33)","v":"06070110"},{"$f":"IF(ISNUMBER(VLOOKUP(B33,UKOptima!A:J,10,FALSE)),VLOOKUP(B33,UKOptima!A:J,10,FALSE),\"\")","v":0.47899999999999998},{"$f":"IF(ISNUMBER(Taxa_PivotTable!C33),Taxa_PivotTable!C33,\"\")","v":""},"","","",{"$f":"IF(ISNUMBER(Taxa_PivotTable!D33),Taxa_PivotTable!D33,\"\")","v":""},"","","",{"$f":"IF(ISNUMBER(Taxa_PivotTable!E33),Taxa_PivotTable!E33,\"\")","v":""},"","","",{"$f":"IF(ISNUMBER(Taxa_PivotTable!F33),Taxa_PivotTable!F33,\"\")","v":22891.375771724117},4.359671894563272,2.0882828374958073,"",{"$f":"IF(ISNUMBER(Taxa_PivotTable!G33),Taxa_PivotTable!G33,\"\")","v":111737.45967344586},5.0481987935451826,2.4180872221081424,"",{"$f":"IF(ISNUMBER(Taxa_PivotTable!H33),Taxa_PivotTable!H33,\"\")","v":46358.217464700152},4.6661267284132677,2.2350747029099551,"",{"$f":"IF(ISNUMBER(Taxa_PivotTable!I33),Taxa_PivotTable!I33,\"\")","v":29089.073873225621},4.4637298945626895,2.1381266194955284,"",{"$f":"IF(ISNUMBER(Taxa_PivotTable!J33),Taxa_PivotTable!J33,\"\")","v":""},"","","",{"$f":"IF(ISNUMBER(Taxa_PivotTable!K33),Taxa_PivotTable!K33,\"\")","v":""},"","",""]
[{"$f":"Taxa_PivotTable!A34","v":"Peridinium cinctum"},{"$f":"IF(Taxa_PivotTable!B34=\"\",\"\",Taxa_PivotTable!B34)","v":"06110050"},{"$f":"IF(ISNUMBER(VLOOKUP(B34,UKOptima!A:J,10,FALSE)),VLOOKUP(B34,UKOptima!A:J,10,FALSE),\"\")","v":0.48499999999999999},{"$f":"IF(ISNUMBER(Taxa_PivotTable!C34),Taxa_PivotTable!C34,\"\")","v":76081.233038212275},4.8812775425368757,2.3674196081303847,"",{"$f":"IF(ISNUMBER(Taxa_PivotTable!D34),Taxa_PivotTable!D34,\"\")","v":110294.81053648893},5.0425550789986771,2.4456392133143585,"",{"$f":"IF(ISNUMBER(Taxa_PivotTable!E34),Taxa_PivotTable!E34,\"\")","v":51155.60337747274},4.7088932115071733,2.2838132075809789,"",{"$f":"IF(ISNUMBER(Taxa_PivotTable!F34),Taxa_PivotTable!F34,\"\")","v":40468.031076898129},4.607112074833978,2.2344493562944794,"",{"$f":"IF(ISNUMBER(Taxa_PivotTable!G34),Taxa_PivotTable!G34,\"\")","v":""},"","","",{"$f":"IF(ISNUMBER(Taxa_PivotTable!H34),Taxa_PivotTable!H34,\"\")","v":""},"","","",{"$f":"IF(ISNUMBER(Taxa_PivotTable!I34),Taxa_PivotTable!I34,\"\")","v":""},"","","",{"$f":"IF(ISNUMBER(Taxa_PivotTable!J34),Taxa_PivotTable!J34,\"\")","v":""},"","","",{"$f":"IF(ISNUMBER(Taxa_PivotTable!K34),Taxa_PivotTable!K34,\"\")","v":""},"","",""]
[{"$f":"Taxa_PivotTable!A35","v":"Chrysochromulina"},{"$f":"IF(Taxa_PivotTable!B35=\"\",\"\",Taxa_PivotTable!B35)","v":"08010000"},{"$f":"IF(ISNUMBER(VLOOKUP(B35,UKOptima!A:J,10,FALSE)),VLOOKUP(B35,UKOptima!A:J,10,FALSE),\"\")","v":0.34100000000000003},{"$f":"IF(ISNUMBER(Taxa_PivotTable!C35),Taxa_PivotTable!C35,\"\")","v":1088.2620443464207},3.0367334822744585,1.0355261174555905,"",{"$f":"IF(ISNUMBER(Taxa_PivotTable!D35),Taxa_PivotTable!D35,\"\")","v":2369.0058108221397},3.374566126017041,1.1507270489718111,"",{"$f":"IF(ISNUMBER(Taxa_PivotTable!E35),Taxa_PivotTable!E35,\"\")","v":15901.739481950519},4.2014446341389098,1.4326926202413683,"",{"$f":"IF(ISNUMBER(Taxa_PivotTable!F35),Taxa_PivotTable!F35,\"\")","v":""},"","","",{"$f":"IF(ISNUMBER(Taxa_PivotTable!G35),Taxa_PivotTable!G35,\"\")","v":""},"","","",{"$f":"IF(ISNUMBER(Taxa_PivotTable!H35),Taxa_PivotTable!H35,\"\")","v":30124.277890414338},4.4789166452211973,1.5273105760204284,"",{"$f":"IF(ISNUMBER(Taxa_PivotTable!I35),Taxa_PivotTable!I35,\"\")","v":""},"","","",{"$f":"IF(ISNUMBER(Taxa_PivotTable!J35),Taxa_PivotTable!J35,\"\")","v":""},"","","",{"$f":"IF(ISNUMBER(Taxa_PivotTable!K35),Taxa_PivotTable!K35,\"\")","v":""},"","",""]
[{"$f":"Taxa_PivotTable!A36","v":"Dinobryon divergens"},{"$f":"IF(Taxa_PivotTable!B36=\"\",\"\",Taxa_PivotTable!B36)","v":"09230050"},{"$f":"IF(ISNUMBER(VLOOKUP(B36,UKOptima!A:J,10,FALSE)),VLOOKUP(B36,UKOptima!A:J,10,FALSE),\"\")","v":0.39200000000000002},{"$f":"IF(ISNUMBER(Taxa_PivotTable!C36),Taxa_PivotTable!C36,\"\")","v":""},"","","",{"$f":"IF(ISNUMBER(Taxa_PivotTable!D36),Taxa_PivotTable!D36,\"\")","v":396.25642207402228},2.5979763137534095,1.0184067149913365,"",{"$f":"IF(ISNUMBER(Taxa_PivotTable!E36),Taxa_PivotTable!E36,\"\")","v":61609.948504068983},4.7896508457932798,1.8775431315509659,"",{"$f":"IF(ISNUMBER(Taxa_PivotTable!F36),Taxa_PivotTable!F36,\"\")","v":""},"","","",{"$f":"IF(ISNUMBER(Taxa_PivotTable!G36),Taxa_PivotTable!G36,\"\")","v":""},"","","",{"$f":"IF(ISNUMBER(Taxa_PivotTable!H36),Taxa_PivotTable!H36,\"\")","v":2749.022115981526},3.439178233775126,1.3481578676398493,"",{"$f":"IF(ISNUMBER(Taxa_PivotTable!I36),Taxa_PivotTable!I36,\"\")","v":2655.5990936213889},3.4241625118084165,1.3422717046288992,"",{"$f":"IF(ISNUMBER(Taxa_PivotTable!J36),Taxa_PivotTable!J36,\"\")","v":""},"","","",{"$f":"IF(ISNUMBER(Taxa_PivotTable!K36),Taxa_PivotTable!K36,\"\")","v":""},"","",""]
[{"$f":"Taxa_PivotTable!A37","v":"Mallomonas"},{"$f":"IF(Taxa_PivotTable!B37=\"\",\"\",Taxa_PivotTable!B37)","v":"09310000"},{"$f":"IF(ISNUMBER(VLOOKUP(B37,UKOptima!A:J,10,FALSE)),VLOOKUP(B37,UKOptima!A:J,10,FALSE),\"\")","v":0.45200000000000001},{"$f":"IF(ISNUMBER(Taxa_PivotTable!C37),Taxa_PivotTable!C37,\"\")","v":13410.80328456769},4.1274547921539515,1.8656095660535861,"",{"$f":"IF(ISNUMBER(Taxa_PivotTable!D37),Taxa_PivotTable!D37,\"\")","v":27734.853791884107},4.4430258807793042,2.0082476981122457,"",{"$f":"IF(ISNUMBER(Taxa_PivotTable!E37),Taxa_PivotTable!E37,\"\")","v":4339.2142052637073},3.6374110895745444,1.6441098124876941,"",{"$f":"IF(ISNUMBER(Taxa_PivotTable!F37),Taxa_PivotTable!F37,\"\")","v":""},"","","",{"$f":"IF(ISNUMBER(Taxa_PivotTable!G37),Taxa_PivotTable!G37,\"\")","v":""},"","","",{"$f":"IF(ISNUMBER(Taxa_PivotTable!H37),Taxa_PivotTable!H37,\"\")","v":""},"","","",{"$f":"IF(ISNUMBER(Taxa_PivotTable!I37),Taxa_PivotTable!I37,\"\")","v":1934.8458109083119},3.2866463615513246,1.4855641554211987,"",{"$f":"IF(ISNUMBER(Taxa_PivotTable!J37),Taxa_PivotTable!J37,\"\")","v":""},"","","",{"$f":"IF(ISNUMBER(Taxa_PivotTable!K37),Taxa_PivotTable!K37,\"\")","v":""},"","",""]
[{"$f":"Taxa_PivotTable!A38","v":"Medium centric diatom (10-20 µm diam.)"},{"$f":"IF(Taxa_PivotTable!B38=\"\",\"\",Taxa_PivotTable!B38)","v":"12000002"},{"$f":"IF(ISNUMBER(VLOOKUP(B38,UKOptima!A:J,10,FALSE)),VLOOKUP(B38,UKOptima!A:J,10,FALSE),\"\")","v":0.56799999999999995},{"$f":"IF(ISNUMBER(Taxa_PivotTable!C38),Taxa_PivotTable!C38,\"\")","v":""},"","","",{"$f":"IF(ISNUMBER(Taxa_PivotTable!D38),Taxa_PivotTable!D38,\"\")","v":""},"","","",{"$f":"IF(ISNUMBER(Taxa_PivotTable!E38),Taxa_PivotTable!E38,\"\")","v":24485.895997794465},4.388916000527713,2.4929042882997408,"",{"$f":"IF(ISNUMBER(Taxa_PivotTable!F38),Taxa_PivotTable!F38,\"\")","v":83088.251850112283},4.9195396216492515,2.7942985050967746,"",{"$f":"IF(ISNUMBER(Taxa_PivotTable!G38),Taxa_PivotTable!G38,\"\")","v":44974.094689826568},4.6529624299365535,2.6428826602039623,"",{"$f":"IF(ISNUMBER(Taxa_PivotTable!H38),Taxa_PivotTable!H38,\"\")","v":""},"","","",{"$f":"IF(ISNUMBER(Taxa_PivotTable!I38),Taxa_PivotTable!I38,\"\")","v":35535.0871623321},4.5506573850360574,2.5847733947004805,"",{"$f":"IF(ISNUMBER(Taxa_PivotTable!J38),Taxa_PivotTable!J38,\"\")","v":""},"","","",{"$f":"IF(ISNUMBER(Taxa_PivotTable!K38),Taxa_PivotTable!K38,\"\")","v":""},"","",""]
[{"$f":"Taxa_PivotTable!A39","v":"Large centric diatom (>20 µm diam.)"},{"$f":"IF(Taxa_PivotTable!B39=\"\",\"\",Taxa_PivotTable!B39)","v":"12000003"},{"$f":"IF(ISNUMBER(VLOOKUP(B39,UKOptima!A:J,10,FALSE)),VLOOKUP(B39,UKOptima!A:J,10,FALSE),\"\")","v":0.59899999999999998},{"$f":"IF(ISNUMBER(Taxa_PivotTable!C39),Taxa_PivotTable!C39,\"\")","v":""},"","","",{"$f":"IF(ISNUMBER(Taxa_PivotTable!D39),Taxa_PivotTable!D39,\"\")","v":""},"","","",{"$f":"IF(ISNUMBER(Taxa_PivotTable!E39),Taxa_PivotTable!E39,\"\")","v":""},"","","",{"$f":"IF(ISNUMBER(Taxa_PivotTable!F39),Taxa_PivotTable!F39,\"\")","v":17242.107565495895},4.2365903501143913,2.5377176197185203,"",{"$f":"IF(ISNUMBER(Taxa_PivotTable!G39),Taxa_PivotTable!G39,\"\")","v":""},"","","",{"$f":"IF(ISNUMBER(Taxa_PivotTable!H39),Taxa_PivotTable!H39,\"\")","v":7227.7061076153432},3.859000485024922,2.3115412905299282,"",{"$f":"IF(ISNUMBER(Taxa_PivotTable!I39),Taxa_PivotTable!I39,\"\")","v":""},"","","",{"$f":"IF(ISNUMBER(Taxa_PivotTable!J39),Taxa_PivotTable!J39,\"\")","v":""},"","","",{"$f":"IF(ISNUMBER(Taxa_PivotTable!K39),Taxa_PivotTable!K39,\"\")","v":""},"","",""]
[{"$f":"Taxa_PivotTable!A40","v":"Aulacoseira"},{"$f":"IF(Taxa_PivotTable!B40=\"\",\"\",Taxa_PivotTable!B40)","v":"12030000"},{"$f":"IF(ISNUMBER(VLOOKUP(B40,UKOptima!A:J,10,FALSE)),VLOOKUP(B40,UKOptima!A:J,10,FALSE),\"\")","v":0.60599999999999998},{"$f":"IF(ISNUMBER(Taxa_PivotTable!C40),Taxa_PivotTable!C40,\"\")","v":""},"","","",{"$f":"IF(ISNUMBER(Taxa_PivotTable!D40),Taxa_PivotTable!D40,\"\")","v":""},"","","",{"$f":"IF(ISNUMBER(Taxa_PivotTable!E40),Taxa_PivotTable!E40,\"\")","v":5572.3559354159379},3.746038849257558,2.2700995426500801,"",{"$f":"IF(ISNUMBER(Taxa_PivotTable!F40),Taxa_PivotTable!F40,\"\")","v":15111.42956057952},4.1793055511084685,2.532659163971732,"",{"$f":"IF(ISNUMBER(Taxa_PivotTable!G40),Taxa_PivotTable!G40,\"\")","v":""},"","","",{"$f":"IF(ISNUMBER(Taxa_PivotTable!H40),Taxa_PivotTable!H40,\"\")","v":""},"","","",{"$f":"IF(ISNUMBER(Taxa_PivotTable!I40),Taxa_PivotTable!I40,\"\")","v":""},"","","",{"$f":"IF(ISNUMBER(Taxa_PivotTable!J40),Taxa_PivotTable!J40,\"\")","v":""},"","","",{"$f":"IF(ISNUMBER(Taxa_PivotTable!K40),Taxa_PivotTable!K40,\"\")","v":""},"","",""]
[{"$f":"Taxa_PivotTable!A41","v":"Urosolenia eriensis"},{"$f":"IF(Taxa_PivotTable!B41=\"\",\"\",Taxa_PivotTable!B41)","v":"12200010"},{"$f":"IF(ISNUMBER(VLOOKUP(B41,UKOptima!A:J,10,FALSE)),VLOOKUP(B41,UKOptima!A:J,10,FALSE),\"\")","v":0.25800000000000001},{"$f":"IF(ISNUMBER(Taxa_PivotTable!C41),Taxa_PivotTable!C41,\"\")","v":""},"","","",{"$f":"IF(ISNUMBER(Taxa_PivotTable!D41),Taxa_PivotTable!D41,\"\")","v":""},"","","",{"$f":"IF(ISNUMBER(Taxa_PivotTable!E41),Taxa_PivotTable!E41,\"\")","v":""},"","","",{"$f":"IF(ISNUMBER(Taxa_PivotTable!F41),Taxa_PivotTable!F41,\"\")","v":""},"","","",{"$f":"IF(ISNUMBER(Taxa_PivotTable!G41),Taxa_PivotTable!G41,\"\")","v":15.478728130526614},1.1897352686673741,0.30695169931618255,"",{"$f":"IF(ISNUMBER(Taxa_PivotTable!H41),Taxa_PivotTable!H41,\"\")","v":""},"","","",{"$f":"IF(ISNUMBER(Taxa_PivotTable!I41),Taxa_PivotTable!I41,\"\")","v":97.516228869778928},1.9890768985562171,0.51318183982750398,"",{"$f":"IF(ISNUMBER(Taxa_PivotTable!J41),Taxa_PivotTable!J41,\"\")","v":""},"","","",{"$f":"IF(ISNUMBER(Taxa_PivotTable!K41),Taxa_PivotTable!K41,\"\")","v":""},"","",""]
[{"$f":"Taxa_PivotTable!A42","v":"Asterionella formosa"},{"$f":"IF(Taxa_PivotTable!B42=\"\",\"\",Taxa_PivotTable!B42)","v":"13080010"},{"$f":"IF(ISNUMBER(VLOOKUP(B42,UKOptima!A:J,10,FALSE)),VLOOKUP(B42,UKOptima!A:J,10,FALSE),\"\")","v":0.49099999999999999},{"$f":"IF(ISNUMBER(Taxa_PivotTable!C42),Taxa_PivotTable!C42,\"\")","v":""},"","","",{"$f":"IF(ISNUMBER(Taxa_PivotTable!D42),Taxa_PivotTable!D42,\"\")","v":""},"","","",{"$f":"IF(ISNUMBER(Taxa_PivotTable!E42),Taxa_PivotTable!E42,\"\")","v":2554.1798163520575},3.4072514686312294,1.6729604710979336,"",{"$f":"IF(ISNUMBER(Taxa_PivotTable!F42),Taxa_PivotTable!F42,\"\")","v":""},"","","",{"$f":"IF(ISNUMBER(Taxa_PivotTable!G42),Taxa_PivotTable!G42,\"\")","v":""},"","","",{"$f":"IF(ISNUMBER(Taxa_PivotTable!H42),Taxa_PivotTable!H42,\"\")","v":""},"","","",{"$f":"IF(ISNUMBER(Taxa_PivotTable!I42),Taxa_PivotTable!I42,\"\")","v":""},"","","",{"$f":"IF(ISNUMBER(Taxa_PivotTable!J42),Taxa_PivotTable!J42,\"\")","v":""},"","","",{"$f":"IF(ISNUMBER(Taxa_PivotTable!K42),Taxa_PivotTable!K42,\"\")","v":""},"","",""]
[{"$f":"Taxa_PivotTable!A43","v":"Fragilaria crotonensis"},{"$f":"IF(Taxa_PivotTable!B43=\"\",\"\",Taxa_PivotTable!B43)","v":"13370040"},{"$f":"IF(ISNUMBER(VLOOKUP(B43,UKOptima!A:J,10,FALSE)),VLOOKUP(B43,UKOptima!A:J,10,FALSE),\"\")","v":0.46700000000000003},{"$f":"IF(ISNUMBER(Taxa_PivotTable!C43),Taxa_PivotTable!C43,\"\")","v":""},"","","",{"$f":"IF(ISNUMBER(Taxa_PivotTable!D43),Taxa_PivotTable!D43,\"\")","v":""},"","","",{"$f":"IF(ISNUMBER(Taxa_PivotTable!E43),Taxa_PivotTable!E43,\"\")","v":""},"","","",{"$f":"IF(ISNUMBER(Taxa_PivotTable!F43),Taxa_PivotTable!F43,\"\")","v":29357.301345972413},4.4677161307941917,2.0864234330808875,"",{"$f":"IF(ISNUMBER(Taxa_PivotTable!G43),Taxa_PivotTable!G43,\"\")","v":84005.898830936902},4.9243097829643343,2.2996526686443444,"",{"$f":"IF(ISNUMBER(Taxa_PivotTable!H43),Taxa_PivotTable!H43,\"\")","v":""},"","","",{"$f":"IF(ISNUMBER(Taxa_PivotTable!I43),Taxa_PivotTable!I43,\"\")","v":434460.31080633745},5.6379501085516894,2.6329227006936393,"",{"$f":"IF(ISNUMBER(Taxa_PivotTable!J43),Taxa_PivotTable!J43,\"\")","v":""},"","","",{"$f":"IF(ISNUMBER(Taxa_PivotTable!K43),Taxa_PivotTable!K43,\"\")","v":""},"","",""]
[{"$f":"Taxa_PivotTable!A44","v":"Tabellaria fenestrata"},{"$f":"IF(Taxa_PivotTable!B44=\"\",\"\",Taxa_PivotTable!B44)","v":"13820010"},{"$f":"IF(ISNUMBER(VLOOKUP(B44,UKOptima!A:J,10,FALSE)),VLOOKUP(B44,UKOptima!A:J,10,FALSE),\"\")","v":0.29699999999999999},{"$f":"IF(ISNUMBER(Taxa_PivotTable!C44),Taxa_PivotTable!C44,\"\")","v":""},"","","",{"$f":"IF(ISNUMBER(Taxa_PivotTable!D44),Taxa_PivotTable!D44,\"\")","v":""},"","","",{"$f":"IF(ISNUMBER(Taxa_PivotTable!E44),Taxa_PivotTable!E44,\"\")","v":""},"","","",{"$f":"IF(ISNUMBER(Taxa_PivotTable!F44),Taxa_PivotTable!F44,\"\")","v":""},"","","",{"$f":"IF(ISNUMBER(Taxa_PivotTable!G44),Taxa_PivotTable!G44,\"\")","v":37839.607215342839},4.5779466196630683,1.3596501460399313,"",{"$f":"IF(ISNUMBER(Taxa_PivotTable!H44),Taxa_PivotTable!H44,\"\")","v":""},"","","",{"$f":"IF(ISNUMBER(Taxa_PivotTable!I44),Taxa_PivotTable!I44,\"\")","v":64563.989802232572},4.8099903602433329,1.4285671369922699,"",{"$f":"IF(ISNUMBER(Taxa_PivotTable!J44),Taxa_PivotTable!J44,\"\")","v":""},"","","",{"$f":"IF(ISNUMBER(Taxa_PivotTable!K44),Taxa_PivotTable!K44,\"\")","v":""},"","",""]
[{"$f":"Taxa_PivotTable!A45","v":"Tabellaria flocculosa"},{"$f":"IF(Taxa_PivotTable!B45=\"\",\"\",Taxa_PivotTable!B45)","v":"13820020"},{"$f":"IF(ISNUMBER(VLOOKUP(B45,UKOptima!A:J,10,FALSE)),VLOOKUP(B45,UKOptima!A:J,10,FALSE),\"\")","v":0.29499999999999998},{"$f":"IF(ISNUMBER(Taxa_PivotTable!C45),Taxa_PivotTable!C45,\"\")","v":""},"","","",{"$f":"IF(ISNUMBER(Taxa_PivotTable!D45),Taxa_PivotTable!D45,\"\")","v":""},"","","",{"$f":"IF(ISNUMBER(Taxa_PivotTable!E45),Taxa_PivotTable!E45,\"\")","v":""},"","","",{"$f":"IF(ISNUMBER(Taxa_PivotTable!F45),Taxa_PivotTable!F45,\"\")","v":1182.4906557185452},3.0727977176435304,0.90647532670484143,"",{"$f":"IF(ISNUMBER(Taxa_PivotTable!G45),Taxa_PivotTable!G45,\"\")","v":11824.877254794637},4.0727966413546399,1.2014750091996187,"",{"$f":"IF(ISNUMBER(Taxa_PivotTable!H45),Taxa_PivotTable!H45,\"\")","v":""},"","","",{"$f":"IF(ISNUMBER(Taxa_PivotTable!I45),Taxa_PivotTable!I45,\"\")","v":22204.546757381569},4.3464419127070455,1.2822003642485784,"",{"$f":"IF(ISNUMBER(Taxa_PivotTable!J45),Taxa_PivotTable!J45,\"\")","v":""},"","","",{"$f":"IF(ISNUMBER(Taxa_PivotTable!K45),Taxa_PivotTable!K45,\"\")","v":""},"","",""]
[{"$f":"Taxa_PivotTable!A46","v":"Paulschulzia"},{"$f":"IF(Taxa_PivotTable!B46=\"\",\"\",Taxa_PivotTable!B46)","v":"16490000"},{"$f":"IF(ISNUMBER(VLOOKUP(B46,UKOptima!A:J,10,FALSE)),VLOOKUP(B46,UKOptima!A:J,10,FALSE),\"\")","v":0.30399999999999999},{"$f":"IF(ISNUMBER(Taxa_PivotTable!C46),Taxa_PivotTable!C46,\"\")","v":""},"","","",{"$f":"IF(ISNUMBER(Taxa_PivotTable!D46),Taxa_PivotTable!D46,\"\")","v":""},"","","",{"$f":"IF(ISNUMBER(Taxa_PivotTable!E46),Taxa_PivotTable!E46,\"\")","v":""},"","","",{"$f":"IF(ISNUMBER(Taxa_PivotTable!F46),Taxa_PivotTable!F46,\"\")","v":""},"","","",{"$f":"IF(ISNUMBER(Taxa_PivotTable!G46),Taxa_PivotTable!G46,\"\")","v":3146.1950000000002},3.4977856365324902,1.063326833505877,"",{"$f":"IF(ISNUMBER(Taxa_PivotTable!H46),Taxa_PivotTable!H46,\"\")","v":""},"","","",{"$f":"IF(ISNUMBER(Taxa_PivotTable!I46),Taxa_PivotTable!I46,\"\")","v":""},"","","",{"$f":"IF(ISNUMBER(Taxa_PivotTable!J46),Taxa_PivotTable!J46,\"\")","v":""},"","","",{"$f":"IF(ISNUMBER(Taxa_PivotTable!K46),Taxa_PivotTable!K46,\"\")","v":""},"","",""]
[{"$f":"Taxa_PivotTable!A47","v":"Chlorococcales"},{"$f":"IF(Taxa_PivotTable!B47=\"\",\"\",Taxa_PivotTable!B47)","v":"17000000"},{"$f":"IF(ISNUMBER(VLOOKUP(B47,UKOptima!A:J,10,FALSE)),VLOOKUP(B47,UKOptima!A:J,10,FALSE),\"\")","v":0.503},{"$f":"IF(ISNUMBER(Taxa_PivotTable!C47),Taxa_PivotTable!C47,\"\")","v":1485.9615827775835},3.1720075816272608,1.5955198135585122,"",{"$f":"IF(ISNUMBER(Taxa_PivotTable!D47),Taxa_PivotTable!D47,\"\")","v":30364.331469537727},4.4823637237234877,2.2546289530329142,"",{"$f":"IF(ISNUMBER(Taxa_PivotTable!E47),Taxa_PivotTable!E47,\"\")","v":18952.046486577117},4.2776561129860688,2.1516610248319927,"",{"$f":"IF(ISNUMBER(Taxa_PivotTable!F47),Taxa_PivotTable!F47,\"\")","v":12775.049953954443},4.106362607022338,2.0655003913322361,"",{"$f":"IF(ISNUMBER(Taxa_PivotTable!G47),Taxa_PivotTable!G47,\"\")","v":15616.005100634222},4.1935699421858201,2.1093656809194674,"",{"$f":"IF(ISNUMBER(Taxa_PivotTable!H47),Taxa_PivotTable!H47,\"\")","v":18952.046486577117},4.2776561129860688,2.1516610248319927,"",{"$f":"IF(ISNUMBER(Taxa_PivotTable!I47),Taxa_PivotTable!I47,\"\")","v":3997.6973057623609},3.6018099075133136,1.8117103834791968,"",{"$f":"IF(ISNUMBER(Taxa_PivotTable!J47),Taxa_PivotTable!J47,\"\")","v":""},"","","",{"$f":"IF(ISNUMBER(Taxa_PivotTable!K47),Taxa_PivotTable!K47,\"\")","v":""},"","",""]
[{"$f":"Taxa_PivotTable!A48","v":"Ankyra lanceolata"},{"$f":"IF(Taxa_PivotTable!B48=\"\",\"\",Taxa_PivotTable!B48)","v":"17060000"},{"$f":"IF(ISNUMBER(VLOOKUP(B48,UKOptima!A:J,10,FALSE)),VLOOKUP(B48,UKOptima!A:J,10,FALSE),\"\")","v":0.627},{"$f":"IF(ISNUMBER(Taxa_PivotTable!C48),Taxa_PivotTable!C48,\"\")","v":""},"","","",{"$f":"IF(ISNUMBER(Taxa_PivotTable!D48),Taxa_PivotTable!D48,\"\")","v":""},"","","",{"$f":"IF(ISNUMBER(Taxa_PivotTable!E48),Taxa_PivotTable!E48,\"\")","v":""},"","","",{"$f":"IF(ISNUMBER(Taxa_PivotTable!F48),Taxa_PivotTable!F48,\"\")","v":""},"","","",{"$f":"IF(ISNUMBER(Taxa_PivotTable!G48),Taxa_PivotTable!G48,\"\")","v":""},"","","",{"$f":"IF(ISNUMBER(Taxa_PivotTable!H48),Taxa_PivotTable!H48,\"\")","v":""},"","","",{"$f":"IF(ISNUMBER(Taxa_PivotTable!I48),Taxa_PivotTable!I48,\"\")","v":60.539175594642288},1.7820365054694394,1.1173368889293385,"",{"$f":"IF(ISNUMBER(Taxa_PivotTable!J48),Taxa_PivotTable!J48,\"\")","v":""},"","","",{"$f":"IF(ISNUMBER(Taxa_PivotTable!K48),Taxa_PivotTable!K48,\"\")","v":""},"","",""]
[{"$f":"Taxa_PivotTable!A49","v":"Botryococcus"},{"$f":"IF(Taxa_PivotTable!B49=\"\",\"\",Taxa_PivotTable!B49)","v":"17080000"},{"$f":"IF(ISNUMBER(VLOOKUP(B49,UKOptima!A:J,10,FALSE)),VLOOKUP(B49,UKOptima!A:J,10,FALSE),\"\")","v":0.313},{"$f":"IF(ISNUMBER(Taxa_PivotTable!C49),Taxa_PivotTable!C49,\"\")","v":""},"","","",{"$f":"IF(ISNUMBER(Taxa_PivotTable!D49),Taxa_PivotTable!D49,\"\")","v":14747.824736478909},4.1687279677840685,1.3048118539164135,"",{"$f":"IF(ISNUMBER(Taxa_PivotTable!E49),Taxa_PivotTable!E49,\"\")","v":67597.493112835829},4.8299305902111831,1.5117682747361003,"",{"$f":"IF(ISNUMBER(Taxa_PivotTable!F49),Taxa_PivotTable!F49,\"\")","v":""},"","","",{"$f":"IF(ISNUMBER(Taxa_PivotTable!G49),Taxa_PivotTable!G49,\"\")","v":""},"","","",{"$f":"IF(ISNUMBER(Taxa_PivotTable!H49),Taxa_PivotTable!H49,\"\")","v":""},"","","",{"$f":"IF(ISNUMBER(Taxa_PivotTable!I49),Taxa_PivotTable!I49,\"\")","v":""},"","","",{"$f":"IF(ISNUMBER(Taxa_PivotTable!J49),Taxa_PivotTable!J49,\"\")","v":""},"","","",{"$f":"IF(ISNUMBER(Taxa_PivotTable!K49),Taxa_PivotTable!K49,\"\")","v":""},"","",""]
[{"$f":"Taxa_PivotTable!A50","v":"Monoraphidium"},{"$f":"IF(Taxa_PivotTable!B50=\"\",\"\",Taxa_PivotTable!B50)","v":"17580000"},{"$f":"IF(ISNUMBER(VLOOKUP(B50,UKOptima!A:J,10,FALSE)),VLOOKUP(B50,UKOptima!A:J,10,FALSE),\"\")","v":0.53800000000000003},{"$f":"IF(ISNUMBER(Taxa_PivotTable!C50),Taxa_PivotTable!C50,\"\")","v":""},"","","",{"$f":"IF(ISNUMBER(Taxa_PivotTable!D50),Taxa_PivotTable!D50,\"\")","v":""},"","","",{"$f":"IF(ISNUMBER(Taxa_PivotTable!E50),Taxa_PivotTable!E50,\"\")","v":""},"","","",{"$f":"IF(ISNUMBER(Taxa_PivotTable!F50),Taxa_PivotTable!F50,\"\")","v":""},"","","",{"$f":"IF(ISNUMBER(Taxa_PivotTable!G50),Taxa_PivotTable!G50,\"\")","v":""},"","","",{"$f":"IF(ISNUMBER(Taxa_PivotTable!H50),Taxa_PivotTable!H50,\"\")","v":1998.8486528811804},3.3007799118493324,1.7758195925749409,"",{"$f":"IF(ISNUMBER(Taxa_PivotTable!I50),Taxa_PivotTable!I50,\"\")","v":""},"","","",{"$f":"IF(ISNUMBER(Taxa_PivotTable!J50),Taxa_PivotTable!J50,\"\")","v":""},"","","",{"$f":"IF(ISNUMBER(Taxa_PivotTable!K50),Taxa_PivotTable!K50,\"\")","v":""},"","",""]
[{"$f":"Taxa_PivotTable!A51","v":"Monoraphidium contortum"},{"$f":"IF(Taxa_PivotTable!B51=\"\",\"\",Taxa_PivotTable!B51)","v":"17580020"},{"$f":"IF(ISNUMBER(VLOOKUP(B51,UKOptima!A:J,10,FALSE)),VLOOKUP(B51,UKOptima!A:J,10,FALSE),\"\")","v":0.59599999999999997},{"$f":"IF(ISNUMBER(Taxa_PivotTable!C51),Taxa_PivotTable!C51,\"\")","v":""},"","","",{"$f":"IF(ISNUMBER(Taxa_PivotTable!D51),Taxa_PivotTable!D51,\"\")","v":""},"","","",{"$f":"IF(ISNUMBER(Taxa_PivotTable!E51),Taxa_PivotTable!E51,\"\")","v":249.85608161014756},2.3976899255092059,1.4290231956034867,"",{"$f":"IF(ISNUMBER(Taxa_PivotTable!F51),Taxa_PivotTable!F51,\"\")","v":""},"","","",{"$f":"IF(ISNUMBER(Taxa_PivotTable!G51),Taxa_PivotTable!G51,\"\")","v":185.0785789704797},2.2673561564058371,1.3513442692178788,"",{"$f":"IF(ISNUMBER(Taxa_PivotTable!H51),Taxa_PivotTable!H51,\"\")","v":""},"","","",{"$f":"IF(ISNUMBER(Taxa_PivotTable!I51),Taxa_PivotTable!I51,\"\")","v":""},"","","",{"$f":"IF(ISNUMBER(Taxa_PivotTable!J51),Taxa_PivotTable!J51,\"\")","v":""},"","","",{"$f":"IF(ISNUMBER(Taxa_PivotTable!K51),Taxa_PivotTable!K51,\"\")","v":""},"","",""]
[{"$f":"Taxa_PivotTable!A52","v":"Quadrigula"},{"$f":"IF(Taxa_PivotTable!B52=\"\",\"\",Taxa_PivotTable!B52)","v":"17780000"},{"$f":"IF(ISNUMBER(VLOOKUP(B52,UKOptima!A:J,10,FALSE)),VLOOKUP(B52,UKOptima!A:J,10,FALSE),\"\")","v":0.27100000000000002},{"$f":"IF(ISNUMBER(Taxa_PivotTable!C52),Taxa_PivotTable!C52,\"\")","v":""},"","","",{"$f":"IF(ISNUMBER(Taxa_PivotTable!D52),Taxa_PivotTable!D52,\"\")","v":""},"","","",{"$f":"IF(ISNUMBER(Taxa_PivotTable!E52),Taxa_PivotTable!E52,\"\")","v":201.99790265882774},2.3053468609305061,0.62474899931216721,"",{"$f":"IF(ISNUMBER(Taxa_PivotTable!F52),Taxa_PivotTable!F52,\"\")","v":""},"","","",{"$f":"IF(ISNUMBER(Taxa_PivotTable!G52),Taxa_PivotTable!G52,\"\")","v":""},"","","",{"$f":"IF(ISNUMBER(Taxa_PivotTable!H52),Taxa_PivotTable!H52,\"\")","v":""},"","","",{"$f":"IF(ISNUMBER(Taxa_PivotTable!I52),Taxa_PivotTable!I52,\"\")","v":""},"","","",{"$f":"IF(ISNUMBER(Taxa_PivotTable!J52),Taxa_PivotTable!J52,\"\")","v":""},"","","",{"$f":"IF(ISNUMBER(Taxa_PivotTable!K52),Taxa_PivotTable!K52,\"\")","v":""},"","",""]
[{"$f":"Taxa_PivotTable!A53","v":"Tetraedron minimum"},{"$f":"IF(Taxa_PivotTable!B53=\"\",\"\",Taxa_PivotTable!B53)","v":"17960030"},{"$f":"IF(ISNUMBER(VLOOKUP(B53,UKOptima!A:J,10,FALSE)),VLOOKUP(B53,UKOptima!A:J,10,FALSE),\"\")","v":0.58099999999999996},{"$f":"IF(ISNUMBER(Taxa_PivotTable!C53),Taxa_PivotTable!C53,\"\")","v":3031.0399653979243},3.481591662683869,{"$f":"IF(COUNT(E53,$C53)=2,(E53)*$C53,\"\")","v":2.0228047560193279},"",{"$f":"IF(ISNUMBER(Taxa_PivotTable!D53),Taxa_PivotTable!D53,\"\")","v":5880.9244809688589},3.7694456025111074,{"$f":"IF(COUNT(I53,$C53)=2,(I53)*$C53,\"\")","v":2.190047895058953},"",{"$f":"IF(ISNUMBER(Taxa_PivotTable!E53),Taxa_PivotTable!E53,\"\")","v":1908.7598615916959},3.280751293941945,{"$f":"IF(COUNT(M53,$C53)=2,(M53)*$C53,\"\")","v":1.9061165017802699},"",{"$f":"IF(ISNUMBER(Taxa_PivotTable!F53),Taxa_PivotTable!F53,\"\")","v":""},"",{"$f":"IF(COUNT(Q53,$C53)=2,(Q53)*$C53,\"\")","v":""},"",{"$f":"IF(ISNUMBER(Taxa_PivotTable!G53),Taxa_PivotTable!G53,\"\")","v":4418.425605536333},3.6452675470797073,{"$f":"IF(COUNT(U53,$C53)=2,(U53)*$C53,\"\")","v":2.1179004448533099},"",{"$f":"IF(ISNUMBER(Taxa_PivotTable!H53),Taxa_PivotTable!H53,\"\")","v":49701.279003460229},4.6963675649264527,2.728589555222269,"",{"$f":"IF(ISNUMBER(Taxa_PivotTable!I53),Taxa_PivotTable!I53,\"\")","v":9819.1379179930827},3.9920733600995377,2.3193946222178314,"",{"$f":"IF(ISNUMBER(Taxa_PivotTable!J53),Taxa_PivotTable!J53,\"\")","v":""},"","","",{"$f":"IF(ISNUMBER(Taxa_PivotTable!K53),Taxa_PivotTable!K53,\"\")","v":""},"","",""]
[{"$f":"Taxa_PivotTable!A54","v":"Gloeotila"},{"$f":"IF(Taxa_PivotTable!B54=\"\",\"\",Taxa_PivotTable!B54)","v":"24170000"},{"$f":"IF(ISNUMBER(VLOOKUP(B54,UKOptima!A:J,10,FALSE)),VLOOKUP(B54,UKOptima!A:J,10,FALSE),\"\")","v":0.26400000000000001},{"$f":"IF(ISNUMBER(Taxa_PivotTable!C54),Taxa_PivotTable!C54,\"\")","v":""},"","","",{"$f":"IF(ISNUMBER(Taxa_PivotTable!D54),Taxa_PivotTable!D54,\"\")","v":""},"","","",{"$f":"IF(ISNUMBER(Taxa_PivotTable!E54),Taxa_PivotTable!E54,\"\")","v":2476.6026379626392},3.3938563311851642,0.89597807143288333,"",{"$f":"IF(ISNUMBER(Taxa_PivotTable!F54),Taxa_PivotTable!F54,\"\")","v":""},"","","",{"$f":"IF(ISNUMBER(Taxa_PivotTable!G54),Taxa_PivotTable!G54,\"\")","v":""},"","","",{"$f":"IF(ISNUMBER(Taxa_PivotTable!H54),Taxa_PivotTable!H54,\"\")","v":""},"","","",{"$f":"IF(ISNUMBER(Taxa_PivotTable!I54),Taxa_PivotTable!I54,\"\")","v":1783.1538993331003},3.251188827528753,0.8583138504675909,"",{"$f":"IF(ISNUMBER(Taxa_PivotTable!J54),Taxa_PivotTable!J54,\"\")","v":""},"","","",{"$f":"IF(ISNUMBER(Taxa_PivotTable!K54),Taxa_PivotTable!K54,\"\")","v":""},"","",""]
[{"$f":"Taxa_PivotTable!A55","v":"Elakatothrix"},{"$f":"IF(Taxa_PivotTable!B55=\"\",\"\",Taxa_PivotTable!B55)","v":"25010000"},{"$f":"IF(ISNUMBER(VLOOKUP(B55,UKOptima!A:J,10,FALSE)),VLOOKUP(B55,UKOptima!A:J,10,FALSE),\"\")","v":0.437},{"$f":"IF(ISNUMBER(Taxa_PivotTable!C55),Taxa_PivotTable!C55,\"\")","v":136.21314508794515},2.1342190203924569,0.9326537119115037,"",{"$f":"IF(ISNUMBER(Taxa_PivotTable!D55),Taxa_PivotTable!D55,\"\")","v":""},"","","",{"$f":"IF(ISNUMBER(Taxa_PivotTable!E55),Taxa_PivotTable!E55,\"\")","v":111.44711870831877},2.0470688460905988,0.89456908574159166,"",{"$f":"IF(ISNUMBER(Taxa_PivotTable!F55),Taxa_PivotTable!F55,\"\")","v":126.4099263126764},2.1017811770933257,0.9184783743897833,"",{"$f":"IF(ISNUMBER(Taxa_PivotTable!G55),Taxa_PivotTable!G55,\"\")","v":330.21286678456772},2.5187939918771853,1.1007129744503299,"",{"$f":"IF(ISNUMBER(Taxa_PivotTable!H55),Taxa_PivotTable!H55,\"\")","v":""},"","","",{"$f":"IF(ISNUMBER(Taxa_PivotTable!I55),Taxa_PivotTable!I55,\"\")","v":""},"","","",{"$f":"IF(ISNUMBER(Taxa_PivotTable!J55),Taxa_PivotTable!J55,\"\")","v":""},"","","",{"$f":"IF(ISNUMBER(Taxa_PivotTable!K55),Taxa_PivotTable!K55,\"\")","v":""},"","",""]
[{"$f":"Taxa_PivotTable!A56","v":"Cosmarium"},{"$f":"IF(Taxa_PivotTable!B56=\"\",\"\",Taxa_PivotTable!B56)","v":"27050000"},{"$f":"IF(ISNUMBER(VLOOKUP(B56,UKOptima!A:J,10,FALSE)),VLOOKUP(B56,UKOptima!A:J,10,FALSE),\"\")","v":0.45600000000000002},{"$f":"IF(ISNUMBER(Taxa_PivotTable!C56),Taxa_PivotTable!C56,\"\")","v":""},"","","",{"$f":"IF(ISNUMBER(Taxa_PivotTable!D56),Taxa_PivotTable!D56,\"\")","v":""},"","","",{"$f":"IF(ISNUMBER(Taxa_PivotTable!E56),Taxa_PivotTable!E56,\"\")","v":""},"","","",{"$f":"IF(ISNUMBER(Taxa_PivotTable!F56),Taxa_PivotTable!F56,\"\")","v":""},"","","",{"$f":"IF(ISNUMBER(Taxa_PivotTable!G56),Taxa_PivotTable!G56,\"\")","v":8528.4352281839274},3.9308693554132281,1.792476426068432,"",{"$f":"IF(ISNUMBER(Taxa_PivotTable!H56),Taxa_PivotTable!H56,\"\")","v":24497.391877191134},4.38911984951877,2.0014386513805591,"",{"$f":"IF(ISNUMBER(Taxa_PivotTable!I56),Taxa_PivotTable!I56,\"\")","v":""},"","","",{"$f":"IF(ISNUMBER(Taxa_PivotTable!J56),Taxa_PivotTable!J56,\"\")","v":""},"","","",{"$f":"IF(ISNUMBER(Taxa_PivotTable!K56),Taxa_PivotTable!K56,\"\")","v":""},"","",""]
[{"$f":"Taxa_PivotTable!A57","v":"Spondylosium planum"},{"$f":"IF(Taxa_PivotTable!B57=\"\",\"\",Taxa_PivotTable!B57)","v":"27360040"},{"$f":"IF(ISNUMBER(VLOOKUP(B57,UKOptima!A:J,10,FALSE)),VLOOKUP(B57,UKOptima!A:J,10,FALSE),\"\")","v":0.33900000000000002},{"$f":"IF(ISNUMBER(Taxa_PivotTable!C57),Taxa_PivotTable!C57,\"\")","v":""},"","","",{"$f":"IF(ISNUMBER(Taxa_PivotTable!D57),Taxa_PivotTable!D57,\"\")","v":1434.2379051303142},3.1566211961428299,1.0700945854924193,"",{"$f":"IF(ISNUMBER(Taxa_PivotTable!E57),Taxa_PivotTable!E57,\"\")","v":""},"","","",{"$f":"IF(ISNUMBER(Taxa_PivotTable!F57),Taxa_PivotTable!F57,\"\")","v":""},"","","",{"$f":"IF(ISNUMBER(Taxa_PivotTable!G57),Taxa_PivotTable!G57,\"\")","v":""},"","","",{"$f":"IF(ISNUMBER(Taxa_PivotTable!H57),Taxa_PivotTable!H57,\"\")","v":""},"","","",{"$f":"IF(ISNUMBER(Taxa_PivotTable!I57),Taxa_PivotTable!I57,\"\")","v":""},"","","",{"$f":"IF(ISNUMBER(Taxa_PivotTable!J57),Taxa_PivotTable!J57,\"\")","v":""},"","","",{"$f":"IF(ISNUMBER(Taxa_PivotTable!K57),Taxa_PivotTable!K57,\"\")","v":""},"","",""]
[{"$f":"Taxa_PivotTable!A58","v":"Staurastrum"},{"$f":"IF(Taxa_PivotTable!B58=\"\",\"\",Taxa_PivotTable!B58)","v":"27370000"},{"$f":"IF(ISNUMBER(VLOOKUP(B58,UKOptima!A:J,10,FALSE)),VLOOKUP(B58,UKOptima!A:J,10,FALSE),\"\")","v":0.45800000000000002},{"$f":"IF(ISNUMBER(Taxa_PivotTable!C58),Taxa_PivotTable!C58,\"\")","v":""},"","","",{"$f":"IF(ISNUMBER(Taxa_PivotTable!D58),Taxa_PivotTable!D58,\"\")","v":1398.0562364130135},3.1455246410042816,1.440650285579961,"",{"$f":"IF(ISNUMBER(Taxa_PivotTable!E58),Taxa_PivotTable!E58,\"\")","v":1255.1666210738611},3.098701381416785,1.4192052326888875,"",{"$f":"IF(ISNUMBER(Taxa_PivotTable!F58),Taxa_PivotTable!F58,\"\")","v":3953.5518569829801},3.5969874396204933,1.6474202473461861,"",{"$f":"IF(ISNUMBER(Taxa_PivotTable!G58),Taxa_PivotTable!G58,\"\")","v":949.80544311043263},2.9776346540416321,1.3637566715510676,"",{"$f":"IF(ISNUMBER(Taxa_PivotTable!H58),Taxa_PivotTable!H58,\"\")","v":5222.3659413176783},3.7178673003840426,1.7027832235758915,"",{"$f":"IF(ISNUMBER(Taxa_PivotTable!I58),Taxa_PivotTable!I58,\"\")","v":2881.9322417980061},3.4596837657661612,1.5845351647209018,"",{"$f":"IF(ISNUMBER(Taxa_PivotTable!J58),Taxa_PivotTable!J58,\"\")","v":""},"","","",{"$f":"IF(ISNUMBER(Taxa_PivotTable!K58),Taxa_PivotTable!K58,\"\")","v":""},"","",""]
[{"$f":"Taxa_PivotTable!A59","v":"Picoplankton - unidentified single cells <2 µm diam."},{"$f":"IF(Taxa_PivotTable!B59=\"\",\"\",Taxa_PivotTable!B59)","v":"90000000"},{"$f":"IF(ISNUMBER(VLOOKUP(B59,UKOptima!A:J,10,FALSE)),VLOOKUP(B59,UKOptima!A:J,10,FALSE),\"\")","v":0.53900000000000003},{"$f":"IF(ISNUMBER(Taxa_PivotTable!C59),Taxa_PivotTable!C59,\"\")","v":772.82453882279538},2.8880809034994335,1.5566756069861947,"",{"$f":"IF(ISNUMBER(Taxa_PivotTable!D59),Taxa_PivotTable!D59,\"\")","v":294.00549442184075},2.4683554460298107,1.330443585410068,"",{"$f":"IF(ISNUMBER(Taxa_PivotTable!E59),Taxa_PivotTable!E59,\"\")","v":20299.144678191129},4.3074777389254955,2.3217305012808422,"",{"$f":"IF(ISNUMBER(Taxa_PivotTable!F59),Taxa_PivotTable!F59,\"\")","v":""},"","","",{"$f":"IF(ISNUMBER(Taxa_PivotTable!G59),Taxa_PivotTable!G59,\"\")","v":""},"","","",{"$f":"IF(ISNUMBER(Taxa_PivotTable!H59),Taxa_PivotTable!H59,\"\")","v":""},"","","",{"$f":"IF(ISNUMBER(Taxa_PivotTable!I59),Taxa_PivotTable!I59,\"\")","v":""},"","","",{"$f":"IF(ISNUMBER(Taxa_PivotTable!J59),Taxa_PivotTable!J59,\"\")","v":""},"","","",{"$f":"IF(ISNUMBER(Taxa_PivotTable!K59),Taxa_PivotTable!K59,\"\")","v":""},"","",""]
[{"$f":"Taxa_PivotTable!A60","v":"Nanoplankton - unidentified single cells 2-20 µm diameter"},{"$f":"IF(Taxa_PivotTable!B60=\"\",\"\",Taxa_PivotTable!B60)","v":"90000003"},{"$f":"IF(ISNUMBER(VLOOKUP(B60,UKOptima!A:J,10,FALSE)),VLOOKUP(B60,UKOptima!A:J,10,FALSE),\"\")","v":0.53200000000000003},{"$f":"IF(ISNUMBER(Taxa_PivotTable!C60),Taxa_PivotTable!C60,\"\")","v":""},"","","",{"$f":"IF(ISNUMBER(Taxa_PivotTable!D60),Taxa_PivotTable!D60,\"\")","v":19788.831355316201},4.2964201473614754,2.285695518396305,"",{"$f":"IF(ISNUMBER(Taxa_PivotTable!E60),Taxa_PivotTable!E60,\"\")","v":""},"","","",{"$f":"IF(ISNUMBER(Taxa_PivotTable!F60),Taxa_PivotTable!F60,\"\")","v":2385.260922292578},3.3775358931399686,1.7968490951504634,"",{"$f":"IF(ISNUMBER(Taxa_PivotTable!G60),Taxa_PivotTable!G60,\"\")","v":""},"","","",{"$f":"IF(ISNUMBER(Taxa_PivotTable!H60),Taxa_PivotTable!H60,\"\")","v":""},"","","",{"$f":"IF(ISNUMBER(Taxa_PivotTable!I60),Taxa_PivotTable!I60,\"\")","v":""},"","","",{"$f":"IF(ISNUMBER(Taxa_PivotTable!J60),Taxa_PivotTable!J60,\"\")","v":""},"","","",{"$f":"IF(ISNUMBER(Taxa_PivotTable!K60),Taxa_PivotTable!K60,\"\")","v":""},"","",""]
[{"$f":"Taxa_PivotTable!A61","v":"Nanoplankton - unidentified flagellates 2-20 µm diameter"},{"$f":"IF(Taxa_PivotTable!B61=\"\",\"\",Taxa_PivotTable!B61)","v":"90000005"},{"$f":"IF(ISNUMBER(VLOOKUP(B61,UKOptima!A:J,10,FALSE)),VLOOKUP(B61,UKOptima!A:J,10,FALSE),\"\")","v":0.51900000000000002},{"$f":"IF(ISNUMBER(Taxa_PivotTable!C61),Taxa_PivotTable!C61,\"\")","v":""},"","","",{"$f":"IF(ISNUMBER(Taxa_PivotTable!D61),Taxa_PivotTable!D61,\"\")","v":1184.5029054110698},3.0735361301697361,1.5951652515580932,"",{"$f":"IF(ISNUMBER(Taxa_PivotTable!E61),Taxa_PivotTable!E61,\"\")","v":2826.9759079023142},3.4513221073691653,1.7912361737245968,"",{"$f":"IF(ISNUMBER(Taxa_PivotTable!F61),Taxa_PivotTable!F61,\"\")","v":819.93344203807374},2.9137786000113923,1.5122510934059126,"",{"$f":"IF(ISNUMBER(Taxa_PivotTable!G61),Taxa_PivotTable!G61,\"\")","v":""},"","","",{"$f":"IF(ISNUMBER(Taxa_PivotTable!H61),Taxa_PivotTable!H61,\"\")","v":44144.054278859767},4.6448722171387278,2.4106886806949999,"",{"$f":"IF(ISNUMBER(Taxa_PivotTable!I61),Taxa_PivotTable!I61,\"\")","v":""},"","","",{"$f":"IF(ISNUMBER(Taxa_PivotTable!J61),Taxa_PivotTable!J61,\"\")","v":""},"","","",{"$f":"IF(ISNUMBER(Taxa_PivotTable!K61),Taxa_PivotTable!K61,\"\")","v":""},"","",""]
[{"$f":"Taxa_PivotTable!A62","v":{"$error":"#N/A"}},{"$f":"IF(Taxa_PivotTable!B62=\"\",\"\",Taxa_PivotTable!B62)","v":"(blank)"},{"$f":"IF(ISNUMBER(VLOOKUP(B62,UKOptima!A:J,10,FALSE)),VLOOKUP(B62,UKOptima!A:J,10,FALSE),\"\")","v":""},{"$f":"IF(ISNUMBER(Taxa_PivotTable!C62),Taxa_PivotTable!C62,\"\")","v":""},"","","",{"$f":"IF(ISNUMBER(Taxa_PivotTable!D62),Taxa_PivotTable!D62,\"\")","v":""},"","","",{"$f":"IF(ISNUMBER(Taxa_PivotTable!E62),Taxa_PivotTable!E62,\"\")","v":""},"","","",{"$f":"IF(ISNUMBER(Taxa_PivotTable!F62),Taxa_PivotTable!F62,\"\")","v":""},"","","",{"$f":"IF(ISNUMBER(Taxa_PivotTable!G62),Taxa_PivotTable!G62,\"\")","v":""},"","","",{"$f":"IF(ISNUMBER(Taxa_PivotTable!H62),Taxa_PivotTable!H62,\"\")","v":""},"","","",{"$f":"IF(ISNUMBER(Taxa_PivotTable!I62),Taxa_PivotTable!I62,\"\")","v":""},"","","",{"$f":"IF(ISNUMBER(Taxa_PivotTable!J62),Taxa_PivotTable!J62,\"\")","v":""},"","","",{"$f":"IF(ISNUMBER(Taxa_PivotTable!K62),Taxa_PivotTable!K62,\"\")","v":""},"","",""]
[{"$f":"Taxa_PivotTable!A63","v":{"$error":"#N/A"}},{"$f":"IF(Taxa_PivotTable!B63=\"\",\"\",Taxa_PivotTable!B63)","v":""},{"$f":"IF(ISNUMBER(VLOOKUP(B63,UKOptima!A:J,10,FALSE)),VLOOKUP(B63,UKOptima!A:J,10,FALSE),\"\")","v":""},{"$f":"IF(ISNUMBER(Taxa_PivotTable!C63),Taxa_PivotTable!C63,\"\")","v":""},"","","",{"$f":"IF(ISNUMBER(Taxa_PivotTable!D63),Taxa_PivotTable!D63,\"\")","v":""},"","","",{"$f":"IF(ISNUMBER(Taxa_PivotTable!E63),Taxa_PivotTable!E63,\"\")","v":""},"","","",{"$f":"IF(ISNUMBER(Taxa_PivotTable!F63),Taxa_PivotTable!F63,\"\")","v":""},"","","",{"$f":"IF(ISNUMBER(Taxa_PivotTable!G63),Taxa_PivotTable!G63,\"\")","v":""},"","","",{"$f":"IF(ISNUMBER(Taxa_PivotTable!H63),Taxa_PivotTable!H63,\"\")","v":""},"","","",{"$f":"IF(ISNUMBER(Taxa_PivotTable!I63),Taxa_PivotTable!I63,\"\")","v":""},"","","",{"$f":"IF(ISNUMBER(Taxa_PivotTable!J63),Taxa_PivotTable!J63,\"\")","v":""},"","","",{"$f":"IF(ISNUMBER(Taxa_PivotTable!K63),Taxa_PivotTable!K63,\"\")","v":""},"","",""]
[{"$f":"Taxa_PivotTable!A64","v":{"$error":"#N/A"}},{"$f":"IF(Taxa_PivotTable!B64=\"\",\"\",Taxa_PivotTable!B64)","v":""},{"$f":"IF(ISNUMBER(VLOOKUP(B64,UKOptima!A:J,10,FALSE)),VLOOKUP(B64,UKOptima!A:J,10,FALSE),\"\")","v":""},{"$f":"IF(ISNUMBER(Taxa_PivotTable!C64),Taxa_PivotTable!C64,\"\")","v":""},"","","",{"$f":"IF(ISNUMBER(Taxa_PivotTable!D64),Taxa_PivotTable!D64,\"\")","v":""},"","","",{"$f":"IF(ISNUMBER(Taxa_PivotTable!E64),Taxa_PivotTable!E64,\"\")","v":""},"","","",{"$f":"IF(ISNUMBER(Taxa_PivotTable!F64),Taxa_PivotTable!F64,\"\")","v":""},"","","",{"$f":"IF(ISNUMBER(Taxa_PivotTable!G64),Taxa_PivotTable!G64,\"\")","v":""},"","","",{"$f":"IF(ISNUMBER(Taxa_PivotTable!H64),Taxa_PivotTable!H64,\"\")","v":""},"","","",{"$f":"IF(ISNUMBER(Taxa_PivotTable!I64),Taxa_PivotTable!I64,\"\")","v":""},"","","",{"$f":"IF(ISNUMBER(Taxa_PivotTable!J64),Taxa_PivotTable!J64,\"\")","v":""},"","","",{"$f":"IF(ISNUMBER(Taxa_PivotTable!K64),Taxa_PivotTable!K64,\"\")","v":""},"","",""]
[{"$f":"Taxa_PivotTable!A65","v":{"$error":"#N/A"}},{"$f":"IF(Taxa_PivotTable!B65=\"\",\"\",Taxa_PivotTable!B65)","v":""},{"$f":"IF(ISNUMBER(VLOOKUP(B65,UKOptima!A:J,10,FALSE)),VLOOKUP(B65,UKOptima!A:J,10,FALSE),\"\")","v":""},{"$f":"IF(ISNUMBER(Taxa_PivotTable!C65),Taxa_PivotTable!C65,\"\")","v":""},"","","",{"$f":"IF(ISNUMBER(Taxa_PivotTable!D65),Taxa_PivotTable!D65,\"\")","v":""},"","","",{"$f":"IF(ISNUMBER(Taxa_PivotTable!E65),Taxa_PivotTable!E65,\"\")","v":""},"","","",{"$f":"IF(ISNUMBER(Taxa_PivotTable!F65),Taxa_PivotTable!F65,\"\")","v":""},"","","",{"$f":"IF(ISNUMBER(Taxa_PivotTable!G65),Taxa_PivotTable!G65,\"\")","v":""},"","","",{"$f":"IF(ISNUMBER(Taxa_PivotTable!H65),Taxa_PivotTable!H65,\"\")","v":""},"","","",{"$f":"IF(ISNUMBER(Taxa_PivotTable!I65),Taxa_PivotTable!I65,\"\")","v":""},"","","",{"$f":"IF(ISNUMBER(Taxa_PivotTable!J65),Taxa_PivotTable!J65,\"\")","v":""},"","","",{"$f":"IF(ISNUMBER(Taxa_PivotTable!K65),Taxa_PivotTable!K65,\"\")","v":""},"","",""]
[{"$f":"Taxa_PivotTable!A66","v":{"$error":"#N/A"}},{"$f":"IF(Taxa_PivotTable!B66=\"\",\"\",Taxa_PivotTable!B66)","v":""},{"$f":"IF(ISNUMBER(VLOOKUP(B66,UKOptima!A:J,10,FALSE)),VLOOKUP(B66,UKOptima!A:J,10,FALSE),\"\")","v":""},{"$f":"IF(ISNUMBER(Taxa_PivotTable!C66),Taxa_PivotTable!C66,\"\")","v":""},"","","",{"$f":"IF(ISNUMBER(Taxa_PivotTable!D66),Taxa_PivotTable!D66,\"\")","v":""},"","","",{"$f":"IF(ISNUMBER(Taxa_PivotTable!E66),Taxa_PivotTable!E66,\"\")","v":""},"","","",{"$f":"IF(ISNUMBER(Taxa_PivotTable!F66),Taxa_PivotTable!F66,\"\")","v":""},"","","",{"$f":"IF(ISNUMBER(Taxa_PivotTable!G66),Taxa_PivotTable!G66,\"\")","v":""},"","","",{"$f":"IF(ISNUMBER(Taxa_PivotTable!H66),Taxa_PivotTable!H66,\"\")","v":""},"","","",{"$f":"IF(ISNUMBER(Taxa_PivotTable!I66),Taxa_PivotTable!I66,\"\")","v":""},"","","",{"$f":"IF(ISNUMBER(Taxa_PivotTable!J66),Taxa_PivotTable!J66,\"\")","v":""},"","","",{"$f":"IF(ISNUMBER(Taxa_PivotTable!K66),Taxa_PivotTable!K66,\"\")","v":""},"","",""]
[{"$f":"Taxa_PivotTable!A67","v":{"$error":"#N/A"}},{"$f":"IF(Taxa_PivotTable!B67=\"\",\"\",Taxa_PivotTable!B67)","v":""},{"$f":"IF(ISNUMBER(VLOOKUP(B67,UKOptima!A:J,10,FALSE)),VLOOKUP(B67,UKOptima!A:J,10,FALSE),\"\")","v":""},{"$f":"IF(ISNUMBER(Taxa_PivotTable!C67),Taxa_PivotTable!C67,\"\")","v":""},"","","",{"$f":"IF(ISNUMBER(Taxa_PivotTable!D67),Taxa_PivotTable!D67,\"\")","v":""},"","","",{"$f":"IF(ISNUMBER(Taxa_PivotTable!E67),Taxa_PivotTable!E67,\"\")","v":""},"","","",{"$f":"IF(ISNUMBER(Taxa_PivotTable!F67),Taxa_PivotTable!F67,\"\")","v":""},"","","",{"$f":"IF(ISNUMBER(Taxa_PivotTable!G67),Taxa_PivotTable!G67,\"\")","v":""},"","","",{"$f":"IF(ISNUMBER(Taxa_PivotTable!H67),Taxa_PivotTable!H67,\"\")","v":""},"","","",{"$f":"IF(ISNUMBER(Taxa_PivotTable!I67),Taxa_PivotTable!I67,\"\")","v":""},"","","",{"$f":"IF(ISNUMBER(Taxa_PivotTable!J67),Taxa_PivotTable!J67,\"\")","v":""},"","","",{"$f":"IF(ISNUMBER(Taxa_PivotTable!K67),Taxa_PivotTable!K67,\"\")","v":""},"","",""]
[{"$f":"Taxa_PivotTable!A68","v":{"$error":"#N/A"}},{"$f":"IF(Taxa_PivotTable!B68=\"\",\"\",Taxa_PivotTable!B68)","v":""},{"$f":"IF(ISNUMBER(VLOOKUP(B68,UKOptima!A:J,10,FALSE)),VLOOKUP(B68,UKOptima!A:J,10,FALSE),\"\")","v":""},{"$f":"IF(ISNUMBER(Taxa_PivotTable!C68),Taxa_PivotTable!C68,\"\")","v":""},"","","",{"$f":"IF(ISNUMBER(Taxa_PivotTable!D68),Taxa_PivotTable!D68,\"\")","v":""},"","","",{"$f":"IF(ISNUMBER(Taxa_PivotTable!E68),Taxa_PivotTable!E68,\"\")","v":""},"","","",{"$f":"IF(ISNUMBER(Taxa_PivotTable!F68),Taxa_PivotTable!F68,\"\")","v":""},"","","",{"$f":"IF(ISNUMBER(Taxa_PivotTable!G68),Taxa_PivotTable!G68,\"\")","v":""},"","","",{"$f":"IF(ISNUMBER(Taxa_PivotTable!H68),Taxa_PivotTable!H68,\"\")","v":""},"","","",{"$f":"IF(ISNUMBER(Taxa_PivotTable!I68),Taxa_PivotTable!I68,\"\")","v":""},"","","",{"$f":"IF(ISNUMBER(Taxa_PivotTable!J68),Taxa_PivotTable!J68,\"\")","v":""},"","","",{"$f":"IF(ISNUMBER(Taxa_PivotTable!K68),Taxa_PivotTable!K68,\"\")","v":""},"","",""]
[{"$f":"Taxa_PivotTable!A69","v":{"$error":"#N/A"}},{"$f":"IF(Taxa_PivotTable!B69=\"\",\"\",Taxa_PivotTable!B69)","v":""},{"$f":"IF(ISNUMBER(VLOOKUP(B69,UKOptima!A:J,10,FALSE)),VLOOKUP(B69,UKOptima!A:J,10,FALSE),\"\")","v":""},{"$f":"IF(ISNUMBER(Taxa_PivotTable!C69),Taxa_PivotTable!C69,\"\")","v":""},"","","",{"$f":"IF(ISNUMBER(Taxa_PivotTable!D69),Taxa_PivotTable!D69,\"\")","v":""},"","","",{"$f":"IF(ISNUMBER(Taxa_PivotTable!E69),Taxa_PivotTable!E69,\"\")","v":""},"","","",{"$f":"IF(ISNUMBER(Taxa_PivotTable!F69),Taxa_PivotTable!F69,\"\")","v":""},"","","",{"$f":"IF(ISNUMBER(Taxa_PivotTable!G69),Taxa_PivotTable!G69,\"\")","v":""},"","","",{"$f":"IF(ISNUMBER(Taxa_PivotTable!H69),Taxa_PivotTable!H69,\"\")","v":""},"","","",{"$f":"IF(ISNUMBER(Taxa_PivotTable!I69),Taxa_PivotTable!I69,\"\")","v":""},"","","",{"$f":"IF(ISNUMBER(Taxa_PivotTable!J69),Taxa_PivotTable!J69,\"\")","v":""},"","","",{"$f":"IF(ISNUMBER(Taxa_PivotTable!K69),Taxa_PivotTable!K69,\"\")","v":""},"","",""]
[{"$f":"Taxa_PivotTable!A70","v":{"$error":"#N/A"}},{"$f":"IF(Taxa_PivotTable!B70=\"\",\"\",Taxa_PivotTable!B70)","v":""},{"$f":"IF(ISNUMBER(VLOOKUP(B70,UKOptima!A:J,10,FALSE)),VLOOKUP(B70,UKOptima!A:J,10,FALSE),\"\")","v":""},{"$f":"IF(ISNUMBER(Taxa_PivotTable!C70),Taxa_PivotTable!C70,\"\")","v":""},"","","",{"$f":"IF(ISNUMBER(Taxa_PivotTable!D70),Taxa_PivotTable!D70,\"\")","v":""},"","","",{"$f":"IF(ISNUMBER(Taxa_PivotTable!E70),Taxa_PivotTable!E70,\"\")","v":""},"","","",{"$f":"IF(ISNUMBER(Taxa_PivotTable!F70),Taxa_PivotTable!F70,\"\")","v":""},"","","",{"$f":"IF(ISNUMBER(Taxa_PivotTable!G70),Taxa_PivotTable!G70,\"\")","v":""},"","","",{"$f":"IF(ISNUMBER(Taxa_PivotTable!H70),Taxa_PivotTable!H70,\"\")","v":""},"","","",{"$f":"IF(ISNUMBER(Taxa_PivotTable!I70),Taxa_PivotTable!I70,\"\")","v":""},"","","",{"$f":"IF(ISNUMBER(Taxa_PivotTable!J70),Taxa_PivotTable!J70,\"\")","v":""},"","","",{"$f":"IF(ISNUMBER(Taxa_PivotTable!K70),Taxa_PivotTable!K70,\"\")","v":""},"","",""]
[{"$f":"Taxa_PivotTable!A71","v":{"$error":"#N/A"}},{"$f":"IF(Taxa_PivotTable!B71=\"\",\"\",Taxa_PivotTable!B71)","v":""},{"$f":"IF(ISNUMBER(VLOOKUP(B71,UKOptima!A:J,10,FALSE)),VLOOKUP(B71,UKOptima!A:J,10,FALSE),\"\")","v":""},{"$f":"IF(ISNUMBER(Taxa_PivotTable!C71),Taxa_PivotTable!C71,\"\")","v":""},"","","",{"$f":"IF(ISNUMBER(Taxa_PivotTable!D71),Taxa_PivotTable!D71,\"\")","v":""},"","","",{"$f":"IF(ISNUMBER(Taxa_PivotTable!E71),Taxa_PivotTable!E71,\"\")","v":""},"","","",{"$f":"IF(ISNUMBER(Taxa_PivotTable!F71),Taxa_PivotTable!F71,\"\")","v":""},"","","",{"$f":"IF(ISNUMBER(Taxa_PivotTable!G71),Taxa_PivotTable!G71,\"\")","v":""},"","","",{"$f":"IF(ISNUMBER(Taxa_PivotTable!H71),Taxa_PivotTable!H71,\"\")","v":""},"","","",{"$f":"IF(ISNUMBER(Taxa_PivotTable!I71),Taxa_PivotTable!I71,\"\")","v":""},"","","",{"$f":"IF(ISNUMBER(Taxa_PivotTable!J71),Taxa_PivotTable!J71,\"\")","v":""},"","","",{"$f":"IF(ISNUMBER(Taxa_PivotTable!K71),Taxa_PivotTable!K71,\"\")","v":""},"","",""]
[{"$f":"Taxa_PivotTable!A72","v":{"$error":"#N/A"}},{"$f":"IF(Taxa_PivotTable!B72=\"\",\"\",Taxa_PivotTable!B72)","v":""},{"$f":"IF(ISNUMBER(VLOOKUP(B72,UKOptima!A:J,10,FALSE)),VLOOKUP(B72,UKOptima!A:J,10,FALSE),\"\")","v":""},{"$f":"IF(ISNUMBER(Taxa_PivotTable!C72),Taxa_PivotTable!C72,\"\")","v":""},"","","",{"$f":"IF(ISNUMBER(Taxa_PivotTable!D72),Taxa_PivotTable!D72,\"\")","v":""},"","","",{"$f":"IF(ISNUMBER(Taxa_PivotTable!E72),Taxa_PivotTable!E72,\"\")","v":""},"","","",{"$f":"IF(ISNUMBER(Taxa_PivotTable!F72),Taxa_PivotTable!F72,\"\")","v":""},"","","",{"$f":"IF(ISNUMBER(Taxa_PivotTable!G72),Taxa_PivotTable!G72,\"\")","v":""},"","","",{"$f":"IF(ISNUMBER(Taxa_PivotTable!H72),Taxa_PivotTable!H72,\"\")","v":""},"","","",{"$f":"IF(ISNUMBER(Taxa_PivotTable!I72),Taxa_PivotTable!I72,\"\")","v":""},"","","",{"$f":"IF(ISNUMBER(Taxa_PivotTable!J72),Taxa_PivotTable!J72,\"\")","v":""},"","","",{"$f":"IF(ISNUMBER(Taxa_PivotTable!K72),Taxa_PivotTable!K72,\"\")","v":""},"","",""]
[{"$f":"Taxa_PivotTable!A73","v":{"$error":"#N/A"}},{"$f":"IF(Taxa_PivotTable!B73=\"\",\"\",Taxa_PivotTable!B73)","v":""},{"$f":"IF(ISNUMBER(VLOOKUP(B73,UKOptima!A:J,10,FALSE)),VLOOKUP(B73,UKOptima!A:J,10,FALSE),\"\")","v":""},{"$f":"IF(ISNUMBER(Taxa_PivotTable!C73),Taxa_PivotTable!C73,\"\")","v":""},"","","",{"$f":"IF(ISNUMBER(Taxa_PivotTable!D73),Taxa_PivotTable!D73,\"\")","v":""},"","","",{"$f":"IF(ISNUMBER(Taxa_PivotTable!E73),Taxa_PivotTable!E73,\"\")","v":""},"","","",{"$f":"IF(ISNUMBER(Taxa_PivotTable!F73),Taxa_PivotTable!F73,\"\")","v":""},"","","",{"$f":"IF(ISNUMBER(Taxa_PivotTable!G73),Taxa_PivotTable!G73,\"\")","v":""},"","","",{"$f":"IF(ISNUMBER(Taxa_PivotTable!H73),Taxa_PivotTable!H73,\"\")","v":""},"","","",{"$f":"IF(ISNUMBER(Taxa_PivotTable!I73),Taxa_PivotTable!I73,\"\")","v":""},"","","",{"$f":"IF(ISNUMBER(Taxa_PivotTable!J73),Taxa_PivotTable!J73,\"\")","v":""},"","","",{"$f":"IF(ISNUMBER(Taxa_PivotTable!K73),Taxa_PivotTable!K73,\"\")","v":""},"","",""]
[{"$f":"Taxa_PivotTable!A74","v":{"$error":"#N/A"}},{"$f":"IF(Taxa_PivotTable!B74=\"\",\"\",Taxa_PivotTable!B74)","v":""},{"$f":"IF(ISNUMBER(VLOOKUP(B74,UKOptima!A:J,10,FALSE)),VLOOKUP(B74,UKOptima!A:J,10,FALSE),\"\")","v":""},{"$f":"IF(ISNUMBER(Taxa_PivotTable!C74),Taxa_PivotTable!C74,\"\")","v":""},"","","",{"$f":"IF(ISNUMBER(Taxa_PivotTable!D74),Taxa_PivotTable!D74,\"\")","v":""},"","","",{"$f":"IF(ISNUMBER(Taxa_PivotTable!E74),Taxa_PivotTable!E74,\"\")","v":""},"","","",{"$f":"IF(ISNUMBER(Taxa_PivotTable!F74),Taxa_PivotTable!F74,\"\")","v":""},"","","",{"$f":"IF(ISNUMBER(Taxa_PivotTable!G74),Taxa_PivotTable!G74,\"\")","v":""},"","","",{"$f":"IF(ISNUMBER(Taxa_PivotTable!H74),Taxa_PivotTable!H74,\"\")","v":""},"","","",{"$f":"IF(ISNUMBER(Taxa_PivotTable!I74),Taxa_PivotTable!I74,\"\")","v":""},"","","",{"$f":"IF(ISNUMBER(Taxa_PivotTable!J74),Taxa_PivotTable!J74,\"\")","v":""},"","","",{"$f":"IF(ISNUMBER(Taxa_PivotTable!K74),Taxa_PivotTable!K74,\"\")","v":""},"","",""]
[{"$f":"Taxa_PivotTable!A75","v":{"$error":"#N/A"}},{"$f":"IF(Taxa_PivotTable!B75=\"\",\"\",Taxa_PivotTable!B75)","v":""},{"$f":"IF(ISNUMBER(VLOOKUP(B75,UKOptima!A:J,10,FALSE)),VLOOKUP(B75,UKOptima!A:J,10,FALSE),\"\")","v":""},{"$f":"IF(ISNUMBER(Taxa_PivotTable!C75),Taxa_PivotTable!C75,\"\")","v":""},"","","",{"$f":"IF(ISNUMBER(Taxa_PivotTable!D75),Taxa_PivotTable!D75,\"\")","v":""},"","","",{"$f":"IF(ISNUMBER(Taxa_PivotTable!E75),Taxa_PivotTable!E75,\"\")","v":""},"","","",{"$f":"IF(ISNUMBER(Taxa_PivotTable!F75),Taxa_PivotTable!F75,\"\")","v":""},"","","",{"$f":"IF(ISNUMBER(Taxa_PivotTable!G75),Taxa_PivotTable!G75,\"\")","v":""},"","","",{"$f":"IF(ISNUMBER(Taxa_PivotTable!H75),Taxa_PivotTable!H75,\"\")","v":""},"","","",{"$f":"IF(ISNUMBER(Taxa_PivotTable!I75),Taxa_PivotTable!I75,\"\")","v":""},"","","",{"$f":"IF(ISNUMBER(Taxa_PivotTable!J75),Taxa_PivotTable!J75,\"\")","v":""},"","","",{"$f":"IF(ISNUMBER(Taxa_PivotTable!K75),Taxa_PivotTable!K75,\"\")","v":""},"","",""]
[{"$f":"Taxa_PivotTable!A76","v":{"$error":"#N/A"}},{"$f":"IF(Taxa_PivotTable!B76=\"\",\"\",Taxa_PivotTable!B76)","v":""},{"$f":"IF(ISNUMBER(VLOOKUP(B76,UKOptima!A:J,10,FALSE)),VLOOKUP(B76,UKOptima!A:J,10,FALSE),\"\")","v":""},{"$f":"IF(ISNUMBER(Taxa_PivotTable!C76),Taxa_PivotTable!C76,\"\")","v":""},"","","",{"$f":"IF(ISNUMBER(Taxa_PivotTable!D76),Taxa_PivotTable!D76,\"\")","v":""},"","","",{"$f":"IF(ISNUMBER(Taxa_PivotTable!E76),Taxa_PivotTable!E76,\"\")","v":""},"","","",{"$f":"IF(ISNUMBER(Taxa_PivotTable!F76),Taxa_PivotTable!F76,\"\")","v":""},"","","",{"$f":"IF(ISNUMBER(Taxa_PivotTable!G76),Taxa_PivotTable!G76,\"\")","v":""},"","","",{"$f":"IF(ISNUMBER(Taxa_PivotTable!H76),Taxa_PivotTable!H76,\"\")","v":""},"","","",{"$f":"IF(ISNUMBER(Taxa_PivotTable!I76),Taxa_PivotTable!I76,\"\")","v":""},"","","",{"$f":"IF(ISNUMBER(Taxa_PivotTable!J76),Taxa_PivotTable!J76,\"\")","v":""},"","","",{"$f":"IF(ISNUMBER(Taxa_PivotTable!K76),Taxa_PivotTable!K76,\"\")","v":""},"","",""]
[{"$f":"Taxa_PivotTable!A77","v":{"$error":"#N/A"}},{"$f":"IF(Taxa_PivotTable!B77=\"\",\"\",Taxa_PivotTable!B77)","v":""},{"$f":"IF(ISNUMBER(VLOOKUP(B77,UKOptima!A:J,10,FALSE)),VLOOKUP(B77,UKOptima!A:J,10,FALSE),\"\")","v":""},{"$f":"IF(ISNUMBER(Taxa_PivotTable!C77),Taxa_PivotTable!C77,\"\")","v":""},"","","",{"$f":"IF(ISNUMBER(Taxa_PivotTable!D77),Taxa_PivotTable!D77,\"\")","v":""},"","","",{"$f":"IF(ISNUMBER(Taxa_PivotTable!E77),Taxa_PivotTable!E77,\"\")","v":""},"","","",{"$f":"IF(ISNUMBER(Taxa_PivotTable!F77),Taxa_PivotTable!F77,\"\")","v":""},"","","",{"$f":"IF(ISNUMBER(Taxa_PivotTable!G77),Taxa_PivotTable!G77,\"\")","v":""},"","","",{"$f":"IF(ISNUMBER(Taxa_PivotTable!H77),Taxa_PivotTable!H77,\"\")","v":""},"","","",{"$f":"IF(ISNUMBER(Taxa_PivotTable!I77),Taxa_PivotTable!I77,\"\")","v":""},"","","",{"$f":"IF(ISNUMBER(Taxa_PivotTable!J77),Taxa_PivotTable!J77,\"\")","v":""},"","","",{"$f":"IF(ISNUMBER(Taxa_PivotTable!K77),Taxa_PivotTable!K77,\"\")","v":""},"","",""]
[{"$f":"Taxa_PivotTable!A78","v":{"$error":"#N/A"}},{"$f":"IF(Taxa_PivotTable!B78=\"\",\"\",Taxa_PivotTable!B78)","v":""},{"$f":"IF(ISNUMBER(VLOOKUP(B78,UKOptima!A:J,10,FALSE)),VLOOKUP(B78,UKOptima!A:J,10,FALSE),\"\")","v":""},{"$f":"IF(ISNUMBER(Taxa_PivotTable!C78),Taxa_PivotTable!C78,\"\")","v":""},"","","",{"$f":"IF(ISNUMBER(Taxa_PivotTable!D78),Taxa_PivotTable!D78,\"\")","v":""},"","","",{"$f":"IF(ISNUMBER(Taxa_PivotTable!E78),Taxa_PivotTable!E78,\"\")","v":""},"","","",{"$f":"IF(ISNUMBER(Taxa_PivotTable!F78),Taxa_PivotTable!F78,\"\")","v":""},"","","",{"$f":"IF(ISNUMBER(Taxa_PivotTable!G78),Taxa_PivotTable!G78,\"\")","v":""},"","","",{"$f":"IF(ISNUMBER(Taxa_PivotTable!H78),Taxa_PivotTable!H78,\"\")","v":""},"","","",{"$f":"IF(ISNUMBER(Taxa_PivotTable!I78),Taxa_PivotTable!I78,\"\")","v":""},"","","",{"$f":"IF(ISNUMBER(Taxa_PivotTable!J78),Taxa_PivotTable!J78,\"\")","v":""},"","","",{"$f":"IF(ISNUMBER(Taxa_PivotTable!K78),Taxa_PivotTable!K78,\"\")","v":""},"","",""]
[{"$f":"Taxa_PivotTable!A79","v":{"$error":"#N/A"}},{"$f":"IF(Taxa_PivotTable!B79=\"\",\"\",Taxa_PivotTable!B79)","v":""},{"$f":"IF(ISNUMBER(VLOOKUP(B79,UKOptima!A:J,10,FALSE)),VLOOKUP(B79,UKOptima!A:J,10,FALSE),\"\")","v":""},{"$f":"IF(ISNUMBER(Taxa_PivotTable!C79),Taxa_PivotTable!C79,\"\")","v":""},"","","",{"$f":"IF(ISNUMBER(Taxa_PivotTable!D79),Taxa_PivotTable!D79,\"\")","v":""},"","","",{"$f":"IF(ISNUMBER(Taxa_PivotTable!E79),Taxa_PivotTable!E79,\"\")","v":""},"","","",{"$f":"IF(ISNUMBER(Taxa_PivotTable!F79),Taxa_PivotTable!F79,\"\")","v":""},"","","",{"$f":"IF(ISNUMBER(Taxa_PivotTable!G79),Taxa_PivotTable!G79,\"\")","v":""},"","","",{"$f":"IF(ISNUMBER(Taxa_PivotTable!H79),Taxa_PivotTable!H79,\"\")","v":""},"","","",{"$f":"IF(ISNUMBER(Taxa_PivotTable!I79),Taxa_PivotTable!I79,\"\")","v":""},"","","",{"$f":"IF(ISNUMBER(Taxa_PivotTable!J79),Taxa_PivotTable!J79,\"\")","v":""},"","","",{"$f":"IF(ISNUMBER(Taxa_PivotTable!K79),Taxa_PivotTable!K79,\"\")","v":""},"","",""]
[{"$f":"Taxa_PivotTable!A80","v":{"$error":"#N/A"}},{"$f":"IF(Taxa_PivotTable!B80=\"\",\"\",Taxa_PivotTable!B80)","v":""},{"$f":"IF(ISNUMBER(VLOOKUP(B80,UKOptima!A:J,10,FALSE)),VLOOKUP(B80,UKOptima!A:J,10,FALSE),\"\")","v":""},{"$f":"IF(ISNUMBER(Taxa_PivotTable!C80),Taxa_PivotTable!C80,\"\")","v":""},"","","",{"$f":"IF(ISNUMBER(Taxa_PivotTable!D80),Taxa_PivotTable!D80,\"\")","v":""},"","","",{"$f":"IF(ISNUMBER(Taxa_PivotTable!E80),Taxa_PivotTable!E80,\"\")","v":""},"","","",{"$f":"IF(ISNUMBER(Taxa_PivotTable!F80),Taxa_PivotTable!F80,\"\")","v":""},"","","",{"$f":"IF(ISNUMBER(Taxa_PivotTable!G80),Taxa_PivotTable!G80,\"\")","v":""},"","","",{"$f":"IF(ISNUMBER(Taxa_PivotTable!H80),Taxa_PivotTable!H80,\"\")","v":""},"","","",{"$f":"IF(ISNUMBER(Taxa_PivotTable!I80),Taxa_PivotTable!I80,\"\")","v":""},"","","",{"$f":"IF(ISNUMBER(Taxa_PivotTable!J80),Taxa_PivotTable!J80,\"\")","v":""},"","","",{"$f":"IF(ISNUMBER(Taxa_PivotTable!K80),Taxa_PivotTable!K80,\"\")","v":""},"","",""]
[{"$f":"Taxa_PivotTable!A81","v":{"$error":"#N/A"}},{"$f":"IF(Taxa_PivotTable!B81=\"\",\"\",Taxa_PivotTable!B81)","v":""},{"$f":"IF(ISNUMBER(VLOOKUP(B81,UKOptima!A:J,10,FALSE)),VLOOKUP(B81,UKOptima!A:J,10,FALSE),\"\")","v":""},{"$f":"IF(ISNUMBER(Taxa_PivotTable!C81),Taxa_PivotTable!C81,\"\")","v":""},{"$f":"IF(ISNUMBER(D81),LOG(ROUND(D81,6)),\"\")","v":""},"",{"$f":"IF(AND(ISNUMBER(D81),LEFT($B81,2)=\"01\"),D81/10^6,\"\")","v":""},{"$f":"IF(ISNUMBER(Taxa_PivotTable!D81),Taxa_PivotTable!D81,\"\")","v":""},{"$f":"IF(ISNUMBER(H81),LOG(ROUND(H81,6)),\"\")","v":""},"",{"$f":"IF(AND(ISNUMBER(H81),LEFT($B81,2)=\"01\"),H81/10^6,\"\")","v":""},{"$f":"IF(ISNUMBER(Taxa_PivotTable!E81),Taxa_PivotTable!E81,\"\")","v":""},{"$f":"IF(ISNUMBER(L81),LOG(ROUND(L81,6)),\"\")","v":""},"",{"$f":"IF(AND(ISNUMBER(L81),LEFT($B81,2)=\"01\"),L81/10^6,\"\")","v":""},{"$f":"IF(ISNUMBER(Taxa_PivotTable!F81),Taxa_PivotTable!F81,\"\")","v":""},{"$f":"IF(ISNUMBER(P81),LOG(ROUND(P81,6)),\"\")","v":""},"",{"$f":"IF(AND(ISNUMBER(P81),LEFT($B81,2)=\"01\"),P81/10^6,\"\")","v":""},{"$f":"IF(ISNUMBER(Taxa_PivotTable!G81),Taxa_PivotTable!G81,\"\")","v":""},{"$f":"IF(ISNUMBER(T81),LOG(ROUND(T81,6)),\"\")","v":""},"",{"$f":"IF(AND(ISNUMBER(T81),LEFT($B81,2)=\"01\"),T81/10^6,\"\")","v":""},{"$f":"IF(ISNUMBER(Taxa_PivotTable!H81),Taxa_PivotTable!H81,\"\")","v":""},"","",{"$f":"IF(AND(ISNUMBER(X81),LEFT($B81,2)=\"01\"),X81/10^6,\"\")","v":""},{"$f":"IF(ISNUMBER(Taxa_PivotTable!I81),Taxa_PivotTable!I81,\"\")","v":""},"","",{"$f":"IF(AND(ISNUMBER(AB81),LEFT($B81,2)=\"01\"),AB81/10^6,\"\")","v":""},{"$f":"IF(ISNUMBER(Taxa_PivotTable!J81),Taxa_PivotTable!J81,\"\")","v":""},"","",{"$f":"IF(AND(ISNUMBER(AF81),LEFT($B81,2)=\"01\"),AF81/10^6,\"\")","v":""},{"$f":"IF(ISNUMBER(Taxa_PivotTable!K81),Taxa_PivotTable!K81,\"\")","v":""},"","",{"$f":"IF(AND(ISNUMBER(AJ81),LEFT($B81,2)=\"01\"),AJ81/10^6,\"\")","v":""}]
[{"$f":"Taxa_PivotTable!A82","v":{"$error":"#N/A"}},{"$f":"IF(Taxa_PivotTable!B82=\"\",\"\",Taxa_PivotTable!B82)","v":""},{"$f":"IF(ISNUMBER(VLOOKUP(B82,UKOptima!A:J,10,FALSE)),VLOOKUP(B82,UKOptima!A:J,10,FALSE),\"\")","v":""},{"$f":"IF(ISNUMBER(Taxa_PivotTable!C82),Taxa_PivotTable!C82,\"\")","v":""},"","","",{"$f":"IF(ISNUMBER(Taxa_PivotTable!D82),Taxa_PivotTable!D82,\"\")","v":""},{"$f":"IF(ISNUMBER(H82),LOG(ROUND(H82,6)),\"\")","v":""},"",{"$f":"IF(AND(ISNUMBER(H82),LEFT($B82,2)=\"01\"),H82/10^6,\"\")","v":""},{"$f":"IF(ISNUMBER(Taxa_PivotTable!E82),Taxa_PivotTable!E82,\"\")","v":""},{"$f":"IF(ISNUMBER(L82),LOG(ROUND(L82,6)),\"\")","v":""},"",{"$f":"IF(AND(ISNUMBER(L82),LEFT($B82,2)=\"01\"),L82/10^6,\"\")","v":""},{"$f":"IF(ISNUMBER(Taxa_PivotTable!F82),Taxa_PivotTable!F82,\"\")","v":""},"","","",{"$f":"IF(ISNUMBER(Taxa_PivotTable!G82),Taxa_PivotTable!G82,\"\")","v":""},"","","",{"$f":"IF(ISNUMBER(Taxa_PivotTable!H82),Taxa_PivotTable!H82,\"\")","v":""},"","","",{"$f":"IF(ISNUMBER(Taxa_PivotTable!I82),Taxa_PivotTable!I82,\"\")","v":""},"","","",{"$f":"IF(ISNUMBER(Taxa_PivotTable!J82),Taxa_PivotTable!J82,\"\")","v":""},"","","",{"$f":"IF(ISNUMBER(Taxa_PivotTable!K82),Taxa_PivotTable!K82,\"\")","v":""},"","",""]
[{"$f":"Taxa_PivotTable!A83","v":{"$error":"#N/A"}},{"$f":"IF(Taxa_PivotTable!B83=\"\",\"\",Taxa_PivotTable!B83)","v":""},{"$f":"IF(ISNUMBER(VLOOKUP(B83,UKOptima!A:J,10,FALSE)),VLOOKUP(B83,UKOptima!A:J,10,FALSE),\"\")","v":""},{"$f":"IF(ISNUMBER(Taxa_PivotTable!C83),Taxa_PivotTable!C83,\"\")","v":""},"","","",{"$f":"IF(ISNUMBER(Taxa_PivotTable!D83),Taxa_PivotTable!D83,\"\")","v":""},"","","",{"$f":"IF(ISNUMBER(Taxa_PivotTable!E83),Taxa_PivotTable!E83,\"\")","v":""},"","","",{"$f":"IF(ISNUMBER(Taxa_PivotTable!F83),Taxa_PivotTable!F83,\"\")","v":""},"","","",{"$f":"IF(ISNUMBER(Taxa_PivotTable!G83),Taxa_PivotTable!G83,\"\")","v":""},"","","",{"$f":"IF(ISNUMBER(Taxa_PivotTable!H83),Taxa_PivotTable!H83,\"\")","v":""},"","","",{"$f":"IF(ISNUMBER(Taxa_PivotTable!I83),Taxa_PivotTable!I83,\"\")","v":""},"","","",{"$f":"IF(ISNUMBER(Taxa_PivotTable!J83),Taxa_PivotTable!J83,\"\")","v":""},"","","",{"$f":"IF(ISNUMBER(Taxa_PivotTable!K83),Taxa_PivotTable!K83,\"\")","v":""},"","",""]
[{"$f":"Taxa_PivotTable!A84","v":{"$error":"#N/A"}},{"$f":"IF(Taxa_PivotTable!B84=\"\",\"\",Taxa_PivotTable!B84)","v":""},{"$f":"IF(ISNUMBER(VLOOKUP(B84,UKOptima!A:J,10,FALSE)),VLOOKUP(B84,UKOptima!A:J,10,FALSE),\"\")","v":""},{"$f":"IF(ISNUMBER(Taxa_PivotTable!C84),Taxa_PivotTable!C84,\"\")","v":""},"","","",{"$f":"IF(ISNUMBER(Taxa_PivotTable!D84),Taxa_PivotTable!D84,\"\")","v":""},"","","",{"$f":"IF(ISNUMBER(Taxa_PivotTable!E84),Taxa_PivotTable!E84,\"\")","v":""},"","","",{"$f":"IF(ISNUMBER(Taxa_PivotTable!F84),Taxa_PivotTable!F84,\"\")","v":""},"","","",{"$f":"IF(ISNUMBER(Taxa_PivotTable!G84),Taxa_PivotTable!G84,\"\")","v":""},"","","",{"$f":"IF(ISNUMBER(Taxa_PivotTable!H84),Taxa_PivotTable!H84,\"\")","v":""},"","","",{"$f":"IF(ISNUMBER(Taxa_PivotTable!I84),Taxa_PivotTable!I84,\"\")","v":""},"","","",{"$f":"IF(ISNUMBER(Taxa_PivotTable!J84),Taxa_PivotTable!J84,\"\")","v":""},"","","",{"$f":"IF(ISNUMBER(Taxa_PivotTable!K84),Taxa_PivotTable!K84,\"\")","v":""},"","",""]
[{"$f":"Taxa_PivotTable!A85","v":{"$error":"#N/A"}},{"$f":"IF(Taxa_PivotTable!B85=\"\",\"\",Taxa_PivotTable!B85)","v":""},{"$f":"IF(ISNUMBER(VLOOKUP(B85,UKOptima!A:J,10,FALSE)),VLOOKUP(B85,UKOptima!A:J,10,FALSE),\"\")","v":""},{"$f":"IF(ISNUMBER(Taxa_PivotTable!C85),Taxa_PivotTable!C85,\"\")","v":""},"","","",{"$f":"IF(ISNUMBER(Taxa_PivotTable!D85),Taxa_PivotTable!D85,\"\")","v":""},"","","",{"$f":"IF(ISNUMBER(Taxa_PivotTable!E85),Taxa_PivotTable!E85,\"\")","v":""},"","","",{"$f":"IF(ISNUMBER(Taxa_PivotTable!F85),Taxa_PivotTable!F85,\"\")","v":""},"","","",{"$f":"IF(ISNUMBER(Taxa_PivotTable!G85),Taxa_PivotTable!G85,\"\")","v":""},"","","",{"$f":"IF(ISNUMBER(Taxa_PivotTable!H85),Taxa_PivotTable!H85,\"\")","v":""},"",{"$f":"IF(COUNT(Y85,$C85)=2,(Y85)*$C85,\"\")","v":""},"",{"$f":"IF(ISNUMBER(Taxa_PivotTable!I85),Taxa_PivotTable!I85,\"\")","v":""},"",{"$f":"IF(COUNT(AC85,$C85)=2,(AC85)*$C85,\"\")","v":""},"",{"$f":"IF(ISNUMBER(Taxa_PivotTable!J85),Taxa_PivotTable!J85,\"\")","v":""},"",{"$f":"IF(COUNT(AG85,$C85)=2,(AG85)*$C85,\"\")","v":""},"",{"$f":"IF(ISNUMBER(Taxa_PivotTable!K85),Taxa_PivotTable!K85,\"\")","v":""},"",{"$f":"IF(COUNT(AK85,$C85)=2,(AK85)*$C85,\"\")","v":""},""]
[{"$f":"Taxa_PivotTable!A86","v":{"$error":"#N/A"}},{"$f":"IF(Taxa_PivotTable!B86=\"\",\"\",Taxa_PivotTable!B86)","v":""},{"$f":"IF(ISNUMBER(VLOOKUP(B86,UKOptima!A:J,10,FALSE)),VLOOKUP(B86,UKOptima!A:J,10,FALSE),\"\")","v":""},{"$f":"IF(ISNUMBER(Taxa_PivotTable!C86),Taxa_PivotTable!C86,\"\")","v":""},"","","",{"$f":"IF(ISNUMBER(Taxa_PivotTable!D86),Taxa_PivotTable!D86,\"\")","v":""},"","","",{"$f":"IF(ISNUMBER(Taxa_PivotTable!E86),Taxa_PivotTable!E86,\"\")","v":""},"","","",{"$f":"IF(ISNUMBER(Taxa_PivotTable!F86),Taxa_PivotTable!F86,\"\")","v":""},"","","",{"$f":"IF(ISNUMBER(Taxa_PivotTable!G86),Taxa_PivotTable!G86,\"\")","v":""},"","","",{"$f":"IF(ISNUMBER(Taxa_PivotTable!H86),Taxa_PivotTable!H86,\"\")","v":""},{"$f":"IF(ISNUMBER(X86),LOG(ROUND(X86,6)),\"\")","v":""},"","",{"$f":"IF(ISNUMBER(Taxa_PivotTable!I86),Taxa_PivotTable!I86,\"\")","v":""},{"$f":"IF(ISNUMBER(AB86),LOG(ROUND(AB86,6)),\"\")","v":""},"","",{"$f":"IF(ISNUMBER(Taxa_PivotTable!J86),Taxa_PivotTable!J86,\"\")","v":""},{"$f":"IF(ISNUMBER(AF86),LOG(ROUND(AF86,6)),\"\")","v":""},"","",{"$f":"IF(ISNUMBER(Taxa_PivotTable!K86),Taxa_PivotTable!K86,\"\")","v":""},{"$f":"IF(ISNUMBER(AJ86),LOG(ROUND(AJ86,6)),\"\")","v":""},"",""]
[{"$f":"Taxa_PivotTable!A87","v":{"$error":"#N/A"}},{"$f":"IF(Taxa_PivotTable!B87=\"\",\"\",Taxa_PivotTable!B87)","v":""},{"$f":"IF(ISNUMBER(VLOOKUP(B87,UKOptima!A:J,10,FALSE)),VLOOKUP(B87,UKOptima!A:J,10,FALSE),\"\")","v":""},{"$f":"IF(ISNUMBER(Taxa_PivotTable!C87),Taxa_PivotTable!C87,\"\")","v":""},"","","",{"$f":"IF(ISNUMBER(Taxa_PivotTable!D87),Taxa_PivotTable!D87,\"\")","v":""},"","","",{"$f":"IF(ISNUMBER(Taxa_PivotTable!E87),Taxa_PivotTable!E87,\"\")","v":""},"","","",{"$f":"IF(ISNUMBER(Taxa_PivotTable!F87),Taxa_PivotTable!F87,\"\")","v":""},"","","",{"$f":"IF(ISNUMBER(Taxa_PivotTable!G87),Taxa_PivotTable!G87,\"\")","v":""},"","","",{"$f":"IF(ISNUMBER(Taxa_PivotTable!H87),Taxa_PivotTable!H87,\"\")","v":""},"","","",{"$f":"IF(ISNUMBER(Taxa_PivotTable!I87),Taxa_PivotTable!I87,\"\")","v":""},"","","",{"$f":"IF(ISNUMBER(Taxa_PivotTable!J87),Taxa_PivotTable!J87,\"\")","v":""},"","","",{"$f":"IF(ISNUMBER(Taxa_PivotTable!K87),Taxa_PivotTable!K87,\"\")","v":""},"","",""]
[{"$f":"Taxa_PivotTable!A88","v":{"$error":"#N/A"}},{"$f":"IF(Taxa_PivotTable!B88=\"\",\"\",Taxa_PivotTable!B88)","v":""},{"$f":"IF(ISNUMBER(VLOOKUP(B88,UKOptima!A:J,10,FALSE)),VLOOKUP(B88,UKOptima!A:J,10,FALSE),\"\")","v":""},{"$f":"IF(ISNUMBER(Taxa_PivotTable!C88),Taxa_PivotTable!C88,\"\")","v":""},"","","",{"$f":"IF(ISNUMBER(Taxa_PivotTable!D88),Taxa_PivotTable!D88,\"\")","v":""},"","","",{"$f":"IF(ISNUMBER(Taxa_PivotTable!E88),Taxa_PivotTable!E88,\"\")","v":""},"","","",{"$f":"IF(ISNUMBER(Taxa_PivotTable!F88),Taxa_PivotTable!F88,\"\")","v":""},"","","",{"$f":"IF(ISNUMBER(Taxa_PivotTable!G88),Taxa_PivotTable!G88,\"\")","v":""},"","","",{"$f":"IF(ISNUMBER(Taxa_PivotTable!H88),Taxa_PivotTable!H88,\"\")","v":""},"","","",{"$f":"IF(ISNUMBER(Taxa_PivotTable!I88),Taxa_PivotTable!I88,\"\")","v":""},"","","",{"$f":"IF(ISNUMBER(Taxa_PivotTable!J88),Taxa_PivotTable!J88,\"\")","v":""},"","","",{"$f":"IF(ISNUMBER(Taxa_PivotTable!K88),Taxa_PivotTable!K88,\"\")","v":""},"","",""]
[{"$f":"Taxa_PivotTable!A89","v":{"$error":"#N/A"}},{"$f":"IF(Taxa_PivotTable!B89=\"\",\"\",Taxa_PivotTable!B89)","v":""},{"$f":"IF(ISNUMBER(VLOOKUP(B89,UKOptima!A:J,10,FALSE)),VLOOKUP(B89,UKOptima!A:J,10,FALSE),\"\")","v":""},{"$f":"IF(ISNUMBER(Taxa_PivotTable!C89),Taxa_PivotTable!C89,\"\")","v":""},"","","",{"$f":"IF(ISNUMBER(Taxa_PivotTable!D89),Taxa_PivotTable!D89,\"\")","v":""},"","","",{"$f":"IF(ISNUMBER(Taxa_PivotTable!E89),Taxa_PivotTable!E89,\"\")","v":""},"","","",{"$f":"IF(ISNUMBER(Taxa_PivotTable!F89),Taxa_PivotTable!F89,\"\")","v":""},"","","",{"$f":"IF(ISNUMBER(Taxa_PivotTable!G89),Taxa_PivotTable!G89,\"\")","v":""},"","","",{"$f":"IF(ISNUMBER(Taxa_PivotTable!H89),Taxa_PivotTable!H89,\"\")","v":""},"","","",{"$f":"IF(ISNUMBER(Taxa_PivotTable!I89),Taxa_PivotTable!I89,\"\")","v":""},"","","",{"$f":"IF(ISNUMBER(Taxa_PivotTable!J89),Taxa_PivotTable!J89,\"\")","v":""},"","","",{"$f":"IF(ISNUMBER(Taxa_PivotTable!K89),Taxa_PivotTable!K89,\"\")","v":""},"","",""]
[{"$f":"Taxa_PivotTable!A90","v":{"$error":"#N/A"}},{"$f":"IF(Taxa_PivotTable!B90=\"\",\"\",Taxa_PivotTable!B90)","v":""},{"$f":"IF(ISNUMBER(VLOOKUP(B90,UKOptima!A:J,10,FALSE)),VLOOKUP(B90,UKOptima!A:J,10,FALSE),\"\")","v":""},{"$f":"IF(ISNUMBER(Taxa_PivotTable!C90),Taxa_PivotTable!C90,\"\")","v":""},"","","",{"$f":"IF(ISNUMBER(Taxa_PivotTable!D90),Taxa_PivotTable!D90,\"\")","v":""},"","","",{"$f":"IF(ISNUMBER(Taxa_PivotTable!E90),Taxa_PivotTable!E90,\"\")","v":""},"","","",{"$f":"IF(ISNUMBER(Taxa_PivotTable!F90),Taxa_PivotTable!F90,\"\")","v":""},"","","",{"$f":"IF(ISNUMBER(Taxa_PivotTable!G90),Taxa_PivotTable!G90,\"\")","v":""},"","","",{"$f":"IF(ISNUMBER(Taxa_PivotTable!H90),Taxa_PivotTable!H90,\"\")","v":""},"","","",{"$f":"IF(ISNUMBER(Taxa_PivotTable!I90),Taxa_PivotTable!I90,\"\")","v":""},"","","",{"$f":"IF(ISNUMBER(Taxa_PivotTable!J90),Taxa_PivotTable!J90,\"\")","v":""},"","","",{"$f":"IF(ISNUMBER(Taxa_PivotTable!K90),Taxa_PivotTable!K90,\"\")","v":""},"","",""]
[{"$f":"Taxa_PivotTable!A91","v":{"$error":"#N/A"}},{"$f":"IF(Taxa_PivotTable!B91=\"\",\"\",Taxa_PivotTable!B91)","v":""},{"$f":"IF(ISNUMBER(VLOOKUP(B91,UKOptima!A:J,10,FALSE)),VLOOKUP(B91,UKOptima!A:J,10,FALSE),\"\")","v":""},{"$f":"IF(ISNUMBER(Taxa_PivotTable!C91),Taxa_PivotTable!C91,\"\")","v":""},"","","",{"$f":"IF(ISNUMBER(Taxa_PivotTable!D91),Taxa_PivotTable!D91,\"\")","v":""},"","","",{"$f":"IF(ISNUMBER(Taxa_PivotTable!E91),Taxa_PivotTable!E91,\"\")","v":""},"","","",{"$f":"IF(ISNUMBER(Taxa_PivotTable!F91),Taxa_PivotTable!F91,\"\")","v":""},"","","",{"$f":"IF(ISNUMBER(Taxa_PivotTable!G91),Taxa_PivotTable!G91,\"\")","v":""},"","","",{"$f":"IF(ISNUMBER(Taxa_PivotTable!H91),Taxa_PivotTable!H91,\"\")","v":""},"","","",{"$f":"IF(ISNUMBER(Taxa_PivotTable!I91),Taxa_PivotTable!I91,\"\")","v":""},"","","",{"$f":"IF(ISNUMBER(Taxa_PivotTable!J91),Taxa_PivotTable!J91,\"\")","v":""},"","","",{"$f":"IF(ISNUMBER(Taxa_PivotTable!K91),Taxa_PivotTable!K91,\"\")","v":""},"","",""]
[{"$f":"Taxa_PivotTable!A92","v":{"$error":"#N/A"}},{"$f":"IF(Taxa_PivotTable!B92=\"\",\"\",Taxa_PivotTable!B92)","v":""},{"$f":"IF(ISNUMBER(VLOOKUP(B92,UKOptima!A:J,10,FALSE)),VLOOKUP(B92,UKOptima!A:J,10,FALSE),\"\")","v":""},{"$f":"IF(ISNUMBER(Taxa_PivotTable!C92),Taxa_PivotTable!C92,\"\")","v":""},"","","",{"$f":"IF(ISNUMBER(Taxa_PivotTable!D92),Taxa_PivotTable!D92,\"\")","v":""},"","","",{"$f":"IF(ISNUMBER(Taxa_PivotTable!E92),Taxa_PivotTable!E92,\"\")","v":""},"","","",{"$f":"IF(ISNUMBER(Taxa_PivotTable!F92),Taxa_PivotTable!F92,\"\")","v":""},"","","",{"$f":"IF(ISNUMBER(Taxa_PivotTable!G92),Taxa_PivotTable!G92,\"\")","v":""},"","","",{"$f":"IF(ISNUMBER(Taxa_PivotTable!H92),Taxa_PivotTable!H92,\"\")","v":""},"","","",{"$f":"IF(ISNUMBER(Taxa_PivotTable!I92),Taxa_PivotTable!I92,\"\")","v":""},"","","",{"$f":"IF(ISNUMBER(Taxa_PivotTable!J92),Taxa_PivotTable!J92,\"\")","v":""},"","","",{"$f":"IF(ISNUMBER(Taxa_PivotTable!K92),Taxa_PivotTable!K92,\"\")","v":""},"","",""]
[{"$f":"Taxa_PivotTable!A93","v":{"$error":"#N/A"}},{"$f":"IF(Taxa_PivotTable!B93=\"\",\"\",Taxa_PivotTable!B93)","v":""},{"$f":"IF(ISNUMBER(VLOOKUP(B93,UKOptima!A:J,10,FALSE)),VLOOKUP(B93,UKOptima!A:J,10,FALSE),\"\")","v":""},{"$f":"IF(ISNUMBER(Taxa_PivotTable!C93),Taxa_PivotTable!C93,\"\")","v":""},"","","",{"$f":"IF(ISNUMBER(Taxa_PivotTable!D93),Taxa_PivotTable!D93,\"\")","v":""},"","","",{"$f":"IF(ISNUMBER(Taxa_PivotTable!E93),Taxa_PivotTable!E93,\"\")","v":""},"","","",{"$f":"IF(ISNUMBER(Taxa_PivotTable!F93),Taxa_PivotTable!F93,\"\")","v":""},"","","",{"$f":"IF(ISNUMBER(Taxa_PivotTable!G93),Taxa_PivotTable!G93,\"\")","v":""},"","","",{"$f":"IF(ISNUMBER(Taxa_PivotTable!H93),Taxa_PivotTable!H93,\"\")","v":""},"","","",{"$f":"IF(ISNUMBER(Taxa_PivotTable!I93),Taxa_PivotTable!I93,\"\")","v":""},"","","",{"$f":"IF(ISNUMBER(Taxa_PivotTable!J93),Taxa_PivotTable!J93,\"\")","v":""},"","","",{"$f":"IF(ISNUMBER(Taxa_PivotTable!K93),Taxa_PivotTable!K93,\"\")","v":""},"","",""]
[{"$f":"Taxa_PivotTable!A94","v":{"$error":"#N/A"}},{"$f":"IF(Taxa_PivotTable!B94=\"\",\"\",Taxa_PivotTable!B94)","v":""},{"$f":"IF(ISNUMBER(VLOOKUP(B94,UKOptima!A:J,10,FALSE)),VLOOKUP(B94,UKOptima!A:J,10,FALSE),\"\")","v":""},{"$f":"IF(ISNUMBER(Taxa_PivotTable!C94),Taxa_PivotTable!C94,\"\")","v":""},"","","",{"$f":"IF(ISNUMBER(Taxa_PivotTable!D94),Taxa_PivotTable!D94,\"\")","v":""},"","","",{"$f":"IF(ISNUMBER(Taxa_PivotTable!E94),Taxa_PivotTable!E94,\"\")","v":""},"","","",{"$f":"IF(ISNUMBER(Taxa_PivotTable!F94),Taxa_PivotTable!F94,\"\")","v":""},"","","",{"$f":"IF(ISNUMBER(Taxa_PivotTable!G94),Taxa_PivotTable!G94,\"\")","v":""},"","","",{"$f":"IF(ISNUMBER(Taxa_PivotTable!H94),Taxa_PivotTable!H94,\"\")","v":""},"","","",{"$f":"IF(ISNUMBER(Taxa_PivotTable!I94),Taxa_PivotTable!I94,\"\")","v":""},"","","",{"$f":"IF(ISNUMBER(Taxa_PivotTable!J94),Taxa_PivotTable!J94,\"\")","v":""},"","","",{"$f":"IF(ISNUMBER(Taxa_PivotTable!K94),Taxa_PivotTable!K94,\"\")","v":""},"","",""]
[{"$f":"Taxa_PivotTable!A95","v":{"$error":"#N/A"}},{"$f":"IF(Taxa_PivotTable!B95=\"\",\"\",Taxa_PivotTable!B95)","v":""},{"$f":"IF(ISNUMBER(VLOOKUP(B95,UKOptima!A:J,10,FALSE)),VLOOKUP(B95,UKOptima!A:J,10,FALSE),\"\")","v":""},{"$f":"IF(ISNUMBER(Taxa_PivotTable!C95),Taxa_PivotTable!C95,\"\")","v":""},"","","",{"$f":"IF(ISNUMBER(Taxa_PivotTable!D95),Taxa_PivotTable!D95,\"\")","v":""},"","","",{"$f":"IF(ISNUMBER(Taxa_PivotTable!E95),Taxa_PivotTable!E95,\"\")","v":""},"","","",{"$f":"IF(ISNUMBER(Taxa_PivotTable!F95),Taxa_PivotTable!F95,\"\")","v":""},"","","",{"$f":"IF(ISNUMBER(Taxa_PivotTable!G95),Taxa_PivotTable!G95,\"\")","v":""},"","","",{"$f":"IF(ISNUMBER(Taxa_PivotTable!H95),Taxa_PivotTable!H95,\"\")","v":""},"","","",{"$f":"IF(ISNUMBER(Taxa_PivotTable!I95),Taxa_PivotTable!I95,\"\")","v":""},"","","",{"$f":"IF(ISNUMBER(Taxa_PivotTable!J95),Taxa_PivotTable!J95,\"\")","v":""},"","","",{"$f":"IF(ISNUMBER(Taxa_PivotTable!K95),Taxa_PivotTable!K95,\"\")","v":""},"","",""]
[{"$f":"Taxa_PivotTable!A96","v":{"$error":"#N/A"}},{"$f":"IF(Taxa_PivotTable!B96=\"\",\"\",Taxa_PivotTable!B96)","v":""},{"$f":"IF(ISNUMBER(VLOOKUP(B96,UKOptima!A:J,10,FALSE)),VLOOKUP(B96,UKOptima!A:J,10,FALSE),\"\")","v":""},{"$f":"IF(ISNUMBER(Taxa_PivotTable!C96),Taxa_PivotTable!C96,\"\")","v":""},"","","",{"$f":"IF(ISNUMBER(Taxa_PivotTable!D96),Taxa_PivotTable!D96,\"\")","v":""},"","","",{"$f":"IF(ISNUMBER(Taxa_PivotTable!E96),Taxa_PivotTable!E96,\"\")","v":""},"","","",{"$f":"IF(ISNUMBER(Taxa_PivotTable!F96),Taxa_PivotTable!F96,\"\")","v":""},"","","",{"$f":"IF(ISNUMBER(Taxa_PivotTable!G96),Taxa_PivotTable!G96,\"\")","v":""},"","","",{"$f":"IF(ISNUMBER(Taxa_PivotTable!H96),Taxa_PivotTable!H96,\"\")","v":""},"","","",{"$f":"IF(ISNUMBER(Taxa_PivotTable!I96),Taxa_PivotTable!I96,\"\")","v":""},"","","",{"$f":"IF(ISNUMBER(Taxa_PivotTable!J96),Taxa_PivotTable!J96,\"\")","v":""},"","","",{"$f":"IF(ISNUMBER(Taxa_PivotTable!K96),Taxa_PivotTable!K96,\"\")","v":""},"","",""]
[{"$f":"Taxa_PivotTable!A97","v":{"$error":"#N/A"}},{"$f":"IF(Taxa_PivotTable!B97=\"\",\"\",Taxa_PivotTable!B97)","v":""},{"$f":"IF(ISNUMBER(VLOOKUP(B97,UKOptima!A:J,10,FALSE)),VLOOKUP(B97,UKOptima!A:J,10,FALSE),\"\")","v":""},{"$f":"IF(ISNUMBER(Taxa_PivotTable!C97),Taxa_PivotTable!C97,\"\")","v":""},"","","",{"$f":"IF(ISNUMBER(Taxa_PivotTable!D97),Taxa_PivotTable!D97,\"\")","v":""},"","","",{"$f":"IF(ISNUMBER(Taxa_PivotTable!E97),Taxa_PivotTable!E97,\"\")","v":""},"","","",{"$f":"IF(ISNUMBER(Taxa_PivotTable!F97),Taxa_PivotTable!F97,\"\")","v":""},"","","",{"$f":"IF(ISNUMBER(Taxa_PivotTable!G97),Taxa_PivotTable!G97,\"\")","v":""},"","","",{"$f":"IF(ISNUMBER(Taxa_PivotTable!H97),Taxa_PivotTable!H97,\"\")","v":""},"","","",{"$f":"IF(ISNUMBER(Taxa_PivotTable!I97),Taxa_PivotTable!I97,\"\")","v":""},"","","",{"$f":"IF(ISNUMBER(Taxa_PivotTable!J97),Taxa_PivotTable!J97,\"\")","v":""},"","","",{"$f":"IF(ISNUMBER(Taxa_PivotTable!K97),Taxa_PivotTable!K97,\"\")","v":""},"","",""]
[{"$f":"Taxa_PivotTable!A98","v":{"$error":"#N/A"}},{"$f":"IF(Taxa_PivotTable!B98=\"\",\"\",Taxa_PivotTable!B98)","v":""},{"$f":"IF(ISNUMBER(VLOOKUP(B98,UKOptima!A:J,10,FALSE)),VLOOKUP(B98,UKOptima!A:J,10,FALSE),\"\")","v":""},{"$f":"IF(ISNUMBER(Taxa_PivotTable!C98),Taxa_PivotTable!C98,\"\")","v":""},"","","",{"$f":"IF(ISNUMBER(Taxa_PivotTable!D98),Taxa_PivotTable!D98,\"\")","v":""},"","","",{"$f":"IF(ISNUMBER(Taxa_PivotTable!E98),Taxa_PivotTable!E98,\"\")","v":""},"","","",{"$f":"IF(ISNUMBER(Taxa_PivotTable!F98),Taxa_PivotTable!F98,\"\")","v":""},"","","",{"$f":"IF(ISNUMBER(Taxa_PivotTable!G98),Taxa_PivotTable!G98,\"\")","v":""},"","","",{"$f":"IF(ISNUMBER(Taxa_PivotTable!H98),Taxa_PivotTable!H98,\"\")","v":""},"","","",{"$f":"IF(ISNUMBER(Taxa_PivotTable!I98),Taxa_PivotTable!I98,\"\")","v":""},"","","",{"$f":"IF(ISNUMBER(Taxa_PivotTable!J98),Taxa_PivotTable!J98,\"\")","v":""},"","","",{"$f":"IF(ISNUMBER(Taxa_PivotTable!K98),Taxa_PivotTable!K98,\"\")","v":""},"","",""]
[{"$f":"Taxa_PivotTable!A99","v":{"$error":"#N/A"}},{"$f":"IF(Taxa_PivotTable!B99=\"\",\"\",Taxa_PivotTable!B99)","v":""},{"$f":"IF(ISNUMBER(VLOOKUP(B99,UKOptima!A:J,10,FALSE)),VLOOKUP(B99,UKOptima!A:J,10,FALSE),\"\")","v":""},{"$f":"IF(ISNUMBER(Taxa_PivotTable!C99),Taxa_PivotTable!C99,\"\")","v":""},"","","",{"$f":"IF(ISNUMBER(Taxa_PivotTable!D99),Taxa_PivotTable!D99,\"\")","v":""},"","","",{"$f":"IF(ISNUMBER(Taxa_PivotTable!E99),Taxa_PivotTable!E99,\"\")","v":""},"","","",{"$f":"IF(ISNUMBER(Taxa_PivotTable!F99),Taxa_PivotTable!F99,\"\")","v":""},"","","",{"$f":"IF(ISNUMBER(Taxa_PivotTable!G99),Taxa_PivotTable!G99,\"\")","v":""},"","","",{"$f":"IF(ISNUMBER(Taxa_PivotTable!H99),Taxa_PivotTable!H99,\"\")","v":""},"","","",{"$f":"IF(ISNUMBER(Taxa_PivotTable!I99),Taxa_PivotTable!I99,\"\")","v":""},"","","",{"$f":"IF(ISNUMBER(Taxa_PivotTable!J99),Taxa_PivotTable!J99,\"\")","v":""},"","","",{"$f":"IF(ISNUMBER(Taxa_PivotTable!K99),Taxa_PivotTable!K99,\"\")","v":""},"","",""]
[{"$f":"Taxa_PivotTable!A100","v":{"$error":"#N/A"}},{"$f":"IF(Taxa_PivotTable!B100=\"\",\"\",Taxa_PivotTable!B100)","v":""},{"$f":"IF(ISNUMBER(VLOOKUP(B100,UKOptima!A:J,10,FALSE)),VLOOKUP(B100,UKOptima!A:J,10,FALSE),\"\")","v":""},{"$f":"IF(ISNUMBER(Taxa_PivotTable!C100),Taxa_PivotTable!C100,\"\")","v":""},"","","",{"$f":"IF(ISNUMBER(Taxa_PivotTable!D100),Taxa_PivotTable!D100,\"\")","v":""},"","","",{"$f":"IF(ISNUMBER(Taxa_PivotTable!E100),Taxa_PivotTable!E100,\"\")","v":""},"","","",{"$f":"IF(ISNUMBER(Taxa_PivotTable!F100),Taxa_PivotTable!F100,\"\")","v":""},"","","",{"$f":"IF(ISNUMBER(Taxa_PivotTable!G100),Taxa_PivotTable!G100,\"\")","v":""},"","","",{"$f":"IF(ISNUMBER(Taxa_PivotTable!H100),Taxa_PivotTable!H100,\"\")","v":""},"","","",{"$f":"IF(ISNUMBER(Taxa_PivotTable!I100),Taxa_PivotTable!I100,\"\")","v":""},"","","",{"$f":"IF(ISNUMBER(Taxa_PivotTable!J100),Taxa_PivotTable!J100,\"\")","v":""},"","","",{"$f":"IF(ISNUMBER(Taxa_PivotTable!K100),Taxa_PivotTable!K100,\"\")","v":""},"","",""]
[{"$f":"Taxa_PivotTable!A101","v":{"$error":"#N/A"}},{"$f":"IF(Taxa_PivotTable!B101=\"\",\"\",Taxa_PivotTable!B101)","v":""},{"$f":"IF(ISNUMBER(VLOOKUP(B101,UKOptima!A:J,10,FALSE)),VLOOKUP(B101,UKOptima!A:J,10,FALSE),\"\")","v":""},{"$f":"IF(ISNUMBER(Taxa_PivotTable!C101),Taxa_PivotTable!C101,\"\")","v":""},"","","",{"$f":"IF(ISNUMBER(Taxa_PivotTable!D101),Taxa_PivotTable!D101,\"\")","v":""},"","","",{"$f":"IF(ISNUMBER(Taxa_PivotTable!E101),Taxa_PivotTable!E101,\"\")","v":""},"","","",{"$f":"IF(ISNUMBER(Taxa_PivotTable!F101),Taxa_PivotTable!F101,\"\")","v":""},"","","",{"$f":"IF(ISNUMBER(Taxa_PivotTable!G101),Taxa_PivotTable!G101,\"\")","v":""},"","","",{"$f":"IF(ISNUMBER(Taxa_PivotTable!H101),Taxa_PivotTable!H101,\"\")","v":""},"","","",{"$f":"IF(ISNUMBER(Taxa_PivotTable!I101),Taxa_PivotTable!I101,\"\")","v":""},"","","",{"$f":"IF(ISNUMBER(Taxa_PivotTable!J101),Taxa_PivotTable!J101,\"\")","v":""},"","","",{"$f":"IF(ISNUMBER(Taxa_PivotTable!K101),Taxa_PivotTable!K101,\"\")","v":""},"","",""]
[{"$f":"Taxa_PivotTable!A102","v":{"$error":"#N/A"}},{"$f":"IF(Taxa_PivotTable!B102=\"\",\"\",Taxa_PivotTable!B102)","v":""},{"$f":"IF(ISNUMBER(VLOOKUP(B102,UKOptima!A:J,10,FALSE)),VLOOKUP(B102,UKOptima!A:J,10,FALSE),\"\")","v":""},{"$f":"IF(ISNUMBER(Taxa_PivotTable!C102),Taxa_PivotTable!C102,\"\")","v":""},"","","",{"$f":"IF(ISNUMBER(Taxa_PivotTable!D102),Taxa_PivotTable!D102,\"\")","v":""},"","","",{"$f":"IF(ISNUMBER(Taxa_PivotTable!E102),Taxa_PivotTable!E102,\"\")","v":""},"","","",{"$f":"IF(ISNUMBER(Taxa_PivotTable!F102),Taxa_PivotTable!F102,\"\")","v":""},"","","",{"$f":"IF(ISNUMBER(Taxa_PivotTable!G102),Taxa_PivotTable!G102,\"\")","v":""},"","","",{"$f":"IF(ISNUMBER(Taxa_PivotTable!H102),Taxa_PivotTable!H102,\"\")","v":""},"","","",{"$f":"IF(ISNUMBER(Taxa_PivotTable!I102),Taxa_PivotTable!I102,\"\")","v":""},"","","",{"$f":"IF(ISNUMBER(Taxa_PivotTable!J102),Taxa_PivotTable!J102,\"\")","v":""},"","","",{"$f":"IF(ISNUMBER(Taxa_PivotTable!K102),Taxa_PivotTable!K102,\"\")","v":""},"","",""]
[{"$f":"Taxa_PivotTable!A103","v":{"$error":"#N/A"}},{"$f":"IF(Taxa_PivotTable!B103=\"\",\"\",Taxa_PivotTable!B103)","v":""},{"$f":"IF(ISNUMBER(VLOOKUP(B103,UKOptima!A:J,10,FALSE)),VLOOKUP(B103,UKOptima!A:J,10,FALSE),\"\")","v":""},{"$f":"IF(ISNUMBER(Taxa_PivotTable!C103),Taxa_PivotTable!C103,\"\")","v":""},"","","",{"$f":"IF(ISNUMBER(Taxa_PivotTable!D103),Taxa_PivotTable!D103,\"\")","v":""},"","","",{"$f":"IF(ISNUMBER(Taxa_PivotTable!E103),Taxa_PivotTable!E103,\"\")","v":""},"","","",{"$f":"IF(ISNUMBER(Taxa_PivotTable!F103),Taxa_PivotTable!F103,\"\")","v":""},"","","",{"$f":"IF(ISNUMBER(Taxa_PivotTable!G103),Taxa_PivotTable!G103,\"\")","v":""},"","","",{"$f":"IF(ISNUMBER(Taxa_PivotTable!H103),Taxa_PivotTable!H103,\"\")","v":""},"","","",{"$f":"IF(ISNUMBER(Taxa_PivotTable!I103),Taxa_PivotTable!I103,\"\")","v":""},"","","",{"$f":"IF(ISNUMBER(Taxa_PivotTable!J103),Taxa_PivotTable!J103,\"\")","v":""},"","","",{"$f":"IF(ISNUMBER(Taxa_PivotTable!K103),Taxa_PivotTable!K103,\"\")","v":""},"","",""]
[{"$f":"Taxa_PivotTable!A104","v":{"$error":"#N/A"}},{"$f":"IF(Taxa_PivotTable!B104=\"\",\"\",Taxa_PivotTable!B104)","v":""},{"$f":"IF(ISNUMBER(VLOOKUP(B104,UKOptima!A:J,10,FALSE)),VLOOKUP(B104,UKOptima!A:J,10,FALSE),\"\")","v":""},{"$f":"IF(ISNUMBER(Taxa_PivotTable!C104),Taxa_PivotTable!C104,\"\")","v":""},"","","",{"$f":"IF(ISNUMBER(Taxa_PivotTable!D104),Taxa_PivotTable!D104,\"\")","v":""},"","","",{"$f":"IF(ISNUMBER(Taxa_PivotTable!E104),Taxa_PivotTable!E104,\"\")","v":""},"","","",{"$f":"IF(ISNUMBER(Taxa_PivotTable!F104),Taxa_PivotTable!F104,\"\")","v":""},"","","",{"$f":"IF(ISNUMBER(Taxa_PivotTable!G104),Taxa_PivotTable!G104,\"\")","v":""},"","","",{"$f":"IF(ISNUMBER(Taxa_PivotTable!H104),Taxa_PivotTable!H104,\"\")","v":""},"","","",{"$f":"IF(ISNUMBER(Taxa_PivotTable!I104),Taxa_PivotTable!I104,\"\")","v":""},"","","",{"$f":"IF(ISNUMBER(Taxa_PivotTable!J104),Taxa_PivotTable!J104,\"\")","v":""},"","","",{"$f":"IF(ISNUMBER(Taxa_PivotTable!K104),Taxa_PivotTable!K104,\"\")","v":""},"","",""]
[{"$f":"Taxa_PivotTable!A105","v":{"$error":"#N/A"}},{"$f":"IF(Taxa_PivotTable!B105=\"\",\"\",Taxa_PivotTable!B105)","v":""},{"$f":"IF(ISNUMBER(VLOOKUP(B105,UKOptima!A:J,10,FALSE)),VLOOKUP(B105,UKOptima!A:J,10,FALSE),\"\")","v":""},{"$f":"IF(ISNUMBER(Taxa_PivotTable!C105),Taxa_PivotTable!C105,\"\")","v":""},"","","",{"$f":"IF(ISNUMBER(Taxa_PivotTable!D105),Taxa_PivotTable!D105,\"\")","v":""},"","","",{"$f":"IF(ISNUMBER(Taxa_PivotTable!E105),Taxa_PivotTable!E105,\"\")","v":""},"","","",{"$f":"IF(ISNUMBER(Taxa_PivotTable!F105),Taxa_PivotTable!F105,\"\")","v":""},"","","",{"$f":"IF(ISNUMBER(Taxa_PivotTable!G105),Taxa_PivotTable!G105,\"\")","v":""},"","","",{"$f":"IF(ISNUMBER(Taxa_PivotTable!H105),Taxa_PivotTable!H105,\"\")","v":""},"","","",{"$f":"IF(ISNUMBER(Taxa_PivotTable!I105),Taxa_PivotTable!I105,\"\")","v":""},"","","",{"$f":"IF(ISNUMBER(Taxa_PivotTable!J105),Taxa_PivotTable!J105,\"\")","v":""},"","","",{"$f":"IF(ISNUMBER(Taxa_PivotTable!K105),Taxa_PivotTable!K105,\"\")","v":""},"","",""]
[{"$f":"Taxa_PivotTable!A106","v":{"$error":"#N/A"}},{"$f":"IF(Taxa_PivotTable!B106=\"\",\"\",Taxa_PivotTable!B106)","v":""},{"$f":"IF(ISNUMBER(VLOOKUP(B106,UKOptima!A:J,10,FALSE)),VLOOKUP(B106,UKOptima!A:J,10,FALSE),\"\")","v":""},{"$f":"IF(ISNUMBER(Taxa_PivotTable!C106),Taxa_PivotTable!C106,\"\")","v":""},"","","",{"$f":"IF(ISNUMBER(Taxa_PivotTable!D106),Taxa_PivotTable!D106,\"\")","v":""},"","","",{"$f":"IF(ISNUMBER(Taxa_PivotTable!E106),Taxa_PivotTable!E106,\"\")","v":""},"","","",{"$f":"IF(ISNUMBER(Taxa_PivotTable!F106),Taxa_PivotTable!F106,\"\")","v":""},"","","",{"$f":"IF(ISNUMBER(Taxa_PivotTable!G106),Taxa_PivotTable!G106,\"\")","v":""},"","","",{"$f":"IF(ISNUMBER(Taxa_PivotTable!H106),Taxa_PivotTable!H106,\"\")","v":""},"","","",{"$f":"IF(ISNUMBER(Taxa_PivotTable!I106),Taxa_PivotTable!I106,\"\")","v":""},"","","",{"$f":"IF(ISNUMBER(Taxa_PivotTable!J106),Taxa_PivotTable!J106,\"\")","v":""},"","","",{"$f":"IF(ISNUMBER(Taxa_PivotTable!K106),Taxa_PivotTable!K106,\"\")","v":""},"","",""]
[{"$f":"Taxa_PivotTable!A107","v":{"$error":"#N/A"}},{"$f":"IF(Taxa_PivotTable!B107=\"\",\"\",Taxa_PivotTable!B107)","v":""},{"$f":"IF(ISNUMBER(VLOOKUP(B107,UKOptima!A:J,10,FALSE)),VLOOKUP(B107,UKOptima!A:J,10,FALSE),\"\")","v":""},{"$f":"IF(ISNUMBER(Taxa_PivotTable!C107),Taxa_PivotTable!C107,\"\")","v":""},"","","",{"$f":"IF(ISNUMBER(Taxa_PivotTable!D107),Taxa_PivotTable!D107,\"\")","v":""},"","","",{"$f":"IF(ISNUMBER(Taxa_PivotTable!E107),Taxa_PivotTable!E107,\"\")","v":""},"","","",{"$f":"IF(ISNUMBER(Taxa_PivotTable!F107),Taxa_PivotTable!F107,\"\")","v":""},"","","",{"$f":"IF(ISNUMBER(Taxa_PivotTable!G107),Taxa_PivotTable!G107,\"\")","v":""},"","","",{"$f":"IF(ISNUMBER(Taxa_PivotTable!H107),Taxa_PivotTable!H107,\"\")","v":""},"","","",{"$f":"IF(ISNUMBER(Taxa_PivotTable!I107),Taxa_PivotTable!I107,\"\")","v":""},"","","",{"$f":"IF(ISNUMBER(Taxa_PivotTable!J107),Taxa_PivotTable!J107,\"\")","v":""},"","","",{"$f":"IF(ISNUMBER(Taxa_PivotTable!K107),Taxa_PivotTable!K107,\"\")","v":""},"","",""]
[{"$f":"Taxa_PivotTable!A108","v":{"$error":"#N/A"}},{"$f":"IF(Taxa_PivotTable!B108=\"\",\"\",Taxa_PivotTable!B108)","v":""},{"$f":"IF(ISNUMBER(VLOOKUP(B108,UKOptima!A:J,10,FALSE)),VLOOKUP(B108,UKOptima!A:J,10,FALSE),\"\")","v":""},{"$f":"IF(ISNUMBER(Taxa_PivotTable!C108),Taxa_PivotTable!C108,\"\")","v":""},"","","",{"$f":"IF(ISNUMBER(Taxa_PivotTable!D108),Taxa_PivotTable!D108,\"\")","v":""},"","","",{"$f":"IF(ISNUMBER(Taxa_PivotTable!E108),Taxa_PivotTable!E108,\"\")","v":""},"","","",{"$f":"IF(ISNUMBER(Taxa_PivotTable!F108),Taxa_PivotTable!F108,\"\")","v":""},"","","",{"$f":"IF(ISNUMBER(Taxa_PivotTable!G108),Taxa_PivotTable!G108,\"\")","v":""},"","","",{"$f":"IF(ISNUMBER(Taxa_PivotTable!H108),Taxa_PivotTable!H108,\"\")","v":""},"","","",{"$f":"IF(ISNUMBER(Taxa_PivotTable!I108),Taxa_PivotTable!I108,\"\")","v":""},"","","",{"$f":"IF(ISNUMBER(Taxa_PivotTable!J108),Taxa_PivotTable!J108,\"\")","v":""},"","","",{"$f":"IF(ISNUMBER(Taxa_PivotTable!K108),Taxa_PivotTable!K108,\"\")","v":""},"","",""]
[{"$f":"Taxa_PivotTable!A109","v":{"$error":"#N/A"}},{"$f":"IF(Taxa_PivotTable!B109=\"\",\"\",Taxa_PivotTable!B109)","v":""},{"$f":"IF(ISNUMBER(VLOOKUP(B109,UKOptima!A:J,10,FALSE)),VLOOKUP(B109,UKOptima!A:J,10,FALSE),\"\")","v":""},{"$f":"IF(ISNUMBER(Taxa_PivotTable!C109),Taxa_PivotTable!C109,\"\")","v":""},"","","",{"$f":"IF(ISNUMBER(Taxa_PivotTable!D109),Taxa_PivotTable!D109,\"\")","v":""},"","","",{"$f":"IF(ISNUMBER(Taxa_PivotTable!E109),Taxa_PivotTable!E109,\"\")","v":""},"","","",{"$f":"IF(ISNUMBER(Taxa_PivotTable!F109),Taxa_PivotTable!F109,\"\")","v":""},"","","",{"$f":"IF(ISNUMBER(Taxa_PivotTable!G109),Taxa_PivotTable!G109,\"\")","v":""},"","","",{"$f":"IF(ISNUMBER(Taxa_PivotTable!H109),Taxa_PivotTable!H109,\"\")","v":""},"","","",{"$f":"IF(ISNUMBER(Taxa_PivotTable!I109),Taxa_PivotTable!I109,\"\")","v":""},"","","",{"$f":"IF(ISNUMBER(Taxa_PivotTable!J109),Taxa_PivotTable!J109,\"\")","v":""},"","","",{"$f":"IF(ISNUMBER(Taxa_PivotTable!K109),Taxa_PivotTable!K109,\"\")","v":""},"","",""]
[{"$f":"Taxa_PivotTable!A110","v":{"$error":"#N/A"}},{"$f":"IF(Taxa_PivotTable!B110=\"\",\"\",Taxa_PivotTable!B110)","v":""},{"$f":"IF(ISNUMBER(VLOOKUP(B110,UKOptima!A:J,10,FALSE)),VLOOKUP(B110,UKOptima!A:J,10,FALSE),\"\")","v":""},{"$f":"IF(ISNUMBER(Taxa_PivotTable!C110),Taxa_PivotTable!C110,\"\")","v":""},"","","",{"$f":"IF(ISNUMBER(Taxa_PivotTable!D110),Taxa_PivotTable!D110,\"\")","v":""},"","","",{"$f":"IF(ISNUMBER(Taxa_PivotTable!E110),Taxa_PivotTable!E110,\"\")","v":""},"","","",{"$f":"IF(ISNUMBER(Taxa_PivotTable!F110),Taxa_PivotTable!F110,\"\")","v":""},"","","",{"$f":"IF(ISNUMBER(Taxa_PivotTable!G110),Taxa_PivotTable!G110,\"\")","v":""},"","","",{"$f":"IF(ISNUMBER(Taxa_PivotTable!H110),Taxa_PivotTable!H110,\"\")","v":""},"","","",{"$f":"IF(ISNUMBER(Taxa_PivotTable!I110),Taxa_PivotTable!I110,\"\")","v":""},"","","",{"$f":"IF(ISNUMBER(Taxa_PivotTable!J110),Taxa_PivotTable!J110,\"\")","v":""},"","","",{"$f":"IF(ISNUMBER(Taxa_PivotTable!K110),Taxa_PivotTable!K110,\"\")","v":""},"","",""]
[{"$f":"Taxa_PivotTable!A111","v":{"$error":"#N/A"}},{"$f":"IF(Taxa_PivotTable!B111=\"\",\"\",Taxa_PivotTable!B111)","v":""},{"$f":"IF(ISNUMBER(VLOOKUP(B111,UKOptima!A:J,10,FALSE)),VLOOKUP(B111,UKOptima!A:J,10,FALSE),\"\")","v":""},{"$f":"IF(ISNUMBER(Taxa_PivotTable!C111),Taxa_PivotTable!C111,\"\")","v":""},"","","",{"$f":"IF(ISNUMBER(Taxa_PivotTable!D111),Taxa_PivotTable!D111,\"\")","v":""},"","","",{"$f":"IF(ISNUMBER(Taxa_PivotTable!E111),Taxa_PivotTable!E111,\"\")","v":""},"","","",{"$f":"IF(ISNUMBER(Taxa_PivotTable!F111),Taxa_PivotTable!F111,\"\")","v":""},"","","",{"$f":"IF(ISNUMBER(Taxa_PivotTable!G111),Taxa_PivotTable!G111,\"\")","v":""},"","","",{"$f":"IF(ISNUMBER(Taxa_PivotTable!H111),Taxa_PivotTable!H111,\"\")","v":""},"","","",{"$f":"IF(ISNUMBER(Taxa_PivotTable!I111),Taxa_PivotTable!I111,\"\")","v":""},"","","",{"$f":"IF(ISNUMBER(Taxa_PivotTable!J111),Taxa_PivotTable!J111,\"\")","v":""},"","","",{"$f":"IF(ISNUMBER(Taxa_PivotTable!K111),Taxa_PivotTable!K111,\"\")","v":""},"","",""]
[{"$f":"Taxa_PivotTable!A112","v":{"$error":"#N/A"}},{"$f":"IF(Taxa_PivotTable!B112=\"\",\"\",Taxa_PivotTable!B112)","v":""},{"$f":"IF(ISNUMBER(VLOOKUP(B112,UKOptima!A:J,10,FALSE)),VLOOKUP(B112,UKOptima!A:J,10,FALSE),\"\")","v":""},{"$f":"IF(ISNUMBER(Taxa_PivotTable!C112),Taxa_PivotTable!C112,\"\")","v":""},"","","",{"$f":"IF(ISNUMBER(Taxa_PivotTable!D112),Taxa_PivotTable!D112,\"\")","v":""},"","","",{"$f":"IF(ISNUMBER(Taxa_PivotTable!E112),Taxa_PivotTable!E112,\"\")","v":""},"","","",{"$f":"IF(ISNUMBER(Taxa_PivotTable!F112),Taxa_PivotTable!F112,\"\")","v":""},"","","",{"$f":"IF(ISNUMBER(Taxa_PivotTable!G112),Taxa_PivotTable!G112,\"\")","v":""},"","","",{"$f":"IF(ISNUMBER(Taxa_PivotTable!H112),Taxa_PivotTable!H112,\"\")","v":""},"","","",{"$f":"IF(ISNUMBER(Taxa_PivotTable!I112),Taxa_PivotTable!I112,\"\")","v":""},"","","",{"$f":"IF(ISNUMBER(Taxa_PivotTable!J112),Taxa_PivotTable!J112,\"\")","v":""},"","","",{"$f":"IF(ISNUMBER(Taxa_PivotTable!K112),Taxa_PivotTable!K112,\"\")","v":""},"","",""]
[{"$f":"Taxa_PivotTable!A113","v":{"$error":"#N/A"}},{"$f":"IF(Taxa_PivotTable!B113=\"\",\"\",Taxa_PivotTable!B113)","v":""},{"$f":"IF(ISNUMBER(VLOOKUP(B113,UKOptima!A:J,10,FALSE)),VLOOKUP(B113,UKOptima!A:J,10,FALSE),\"\")","v":""},{"$f":"IF(ISNUMBER(Taxa_PivotTable!C113),Taxa_PivotTable!C113,\"\")","v":""},"","","",{"$f":"IF(ISNUMBER(Taxa_PivotTable!D113),Taxa_PivotTable!D113,\"\")","v":""},"","","",{"$f":"IF(ISNUMBER(Taxa_PivotTable!E113),Taxa_PivotTable!E113,\"\")","v":""},"","","",{"$f":"IF(ISNUMBER(Taxa_PivotTable!F113),Taxa_PivotTable!F113,\"\")","v":""},"","","",{"$f":"IF(ISNUMBER(Taxa_PivotTable!G113),Taxa_PivotTable!G113,\"\")","v":""},"","","",{"$f":"IF(ISNUMBER(Taxa_PivotTable!H113),Taxa_PivotTable!H113,\"\")","v":""},"","","",{"$f":"IF(ISNUMBER(Taxa_PivotTable!I113),Taxa_PivotTable!I113,\"\")","v":""},"","","",{"$f":"IF(ISNUMBER(Taxa_PivotTable!J113),Taxa_PivotTable!J113,\"\")","v":""},"","","",{"$f":"IF(ISNUMBER(Taxa_PivotTable!K113),Taxa_PivotTable!K113,\"\")","v":""},"","",""]
[{"$f":"Taxa_PivotTable!A114","v":{"$error":"#N/A"}},{"$f":"IF(Taxa_PivotTable!B114=\"\",\"\",Taxa_PivotTable!B114)","v":""},{"$f":"IF(ISNUMBER(VLOOKUP(B114,UKOptima!A:J,10,FALSE)),VLOOKUP(B114,UKOptima!A:J,10,FALSE),\"\")","v":""},{"$f":"IF(ISNUMBER(Taxa_PivotTable!C114),Taxa_PivotTable!C114,\"\")","v":""},"","","",{"$f":"IF(ISNUMBER(Taxa_PivotTable!D114),Taxa_PivotTable!D114,\"\")","v":""},"","","",{"$f":"IF(ISNUMBER(Taxa_PivotTable!E114),Taxa_PivotTable!E114,\"\")","v":""},"","","",{"$f":"IF(ISNUMBER(Taxa_PivotTable!F114),Taxa_PivotTable!F114,\"\")","v":""},"","","",{"$f":"IF(ISNUMBER(Taxa_PivotTable!G114),Taxa_PivotTable!G114,\"\")","v":""},"","","",{"$f":"IF(ISNUMBER(Taxa_PivotTable!H114),Taxa_PivotTable!H114,\"\")","v":""},"","","",{"$f":"IF(ISNUMBER(Taxa_PivotTable!I114),Taxa_PivotTable!I114,\"\")","v":""},"","","",{"$f":"IF(ISNUMBER(Taxa_PivotTable!J114),Taxa_PivotTable!J114,\"\")","v":""},"","","",{"$f":"IF(ISNUMBER(Taxa_PivotTable!K114),Taxa_PivotTable!K114,\"\")","v":""},"","",""]
[{"$f":"Taxa_PivotTable!A115","v":{"$error":"#N/A"}},{"$f":"IF(Taxa_PivotTable!B115=\"\",\"\",Taxa_PivotTable!B115)","v":""},{"$f":"IF(ISNUMBER(VLOOKUP(B115,UKOptima!A:J,10,FALSE)),VLOOKUP(B115,UKOptima!A:J,10,FALSE),\"\")","v":""},{"$f":"IF(ISNUMBER(Taxa_PivotTable!C115),Taxa_PivotTable!C115,\"\")","v":""},"","","",{"$f":"IF(ISNUMBER(Taxa_PivotTable!D115),Taxa_PivotTable!D115,\"\")","v":""},"","","",{"$f":"IF(ISNUMBER(Taxa_PivotTable!E115),Taxa_PivotTable!E115,\"\")","v":""},"","","",{"$f":"IF(ISNUMBER(Taxa_PivotTable!F115),Taxa_PivotTable!F115,\"\")","v":""},"","","",{"$f":"IF(ISNUMBER(Taxa_PivotTable!G115),Taxa_PivotTable!G115,\"\")","v":""},"","","",{"$f":"IF(ISNUMBER(Taxa_PivotTable!H115),Taxa_PivotTable!H115,\"\")","v":""},"","","",{"$f":"IF(ISNUMBER(Taxa_PivotTable!I115),Taxa_PivotTable!I115,\"\")","v":""},"","","",{"$f":"IF(ISNUMBER(Taxa_PivotTable!J115),Taxa_PivotTable!J115,\"\")","v":""},"","","",{"$f":"IF(ISNUMBER(Taxa_PivotTable!K115),Taxa_PivotTable!K115,\"\")","v":""},"","",""]
[{"$f":"Taxa_PivotTable!A116","v":{"$error":"#N/A"}},{"$f":"IF(Taxa_PivotTable!B116=\"\",\"\",Taxa_PivotTable!B116)","v":""},{"$f":"IF(ISNUMBER(VLOOKUP(B116,UKOptima!A:J,10,FALSE)),VLOOKUP(B116,UKOptima!A:J,10,FALSE),\"\")","v":""},{"$f":"IF(ISNUMBER(Taxa_PivotTable!C116),Taxa_PivotTable!C116,\"\")","v":""},"","","",{"$f":"IF(ISNUMBER(Taxa_PivotTable!D116),Taxa_PivotTable!D116,\"\")","v":""},"","","",{"$f":"IF(ISNUMBER(Taxa_PivotTable!E116),Taxa_PivotTable!E116,\"\")","v":""},"","","",{"$f":"IF(ISNUMBER(Taxa_PivotTable!F116),Taxa_PivotTable!F116,\"\")","v":""},"","","",{"$f":"IF(ISNUMBER(Taxa_PivotTable!G116),Taxa_PivotTable!G116,\"\")","v":""},"","","",{"$f":"IF(ISNUMBER(Taxa_PivotTable!H116),Taxa_PivotTable!H116,\"\")","v":""},"","","",{"$f":"IF(ISNUMBER(Taxa_PivotTable!I116),Taxa_PivotTable!I116,\"\")","v":""},"","","",{"$f":"IF(ISNUMBER(Taxa_PivotTable!J116),Taxa_PivotTable!J116,\"\")","v":""},"","","",{"$f":"IF(ISNUMBER(Taxa_PivotTable!K116),Taxa_PivotTable!K116,\"\")","v":""},"","",""]
[{"$f":"Taxa_PivotTable!A117","v":{"$error":"#N/A"}},{"$f":"IF(Taxa_PivotTable!B117=\"\",\"\",Taxa_PivotTable!B117)","v":""},{"$f":"IF(ISNUMBER(VLOOKUP(B117,UKOptima!A:J,10,FALSE)),VLOOKUP(B117,UKOptima!A:J,10,FALSE),\"\")","v":""},{"$f":"IF(ISNUMBER(Taxa_PivotTable!C117),Taxa_PivotTable!C117,\"\")","v":""},"",{"$f":"IF(COUNT(E117,$C117)=2,(E117)*$C117,\"\")","v":""},"",{"$f":"IF(ISNUMBER(Taxa_PivotTable!D117),Taxa_PivotTable!D117,\"\")","v":""},"",{"$f":"IF(COUNT(I117,$C117)=2,(I117)*$C117,\"\")","v":""},"",{"$f":"IF(ISNUMBER(Taxa_PivotTable!E117),Taxa_PivotTable!E117,\"\")","v":""},"",{"$f":"IF(COUNT(M117,$C117)=2,(M117)*$C117,\"\")","v":""},"",{"$f":"IF(ISNUMBER(Taxa_PivotTable!F117),Taxa_PivotTable!F117,\"\")","v":""},"",{"$f":"IF(COUNT(Q117,$C117)=2,(Q117)*$C117,\"\")","v":""},"",{"$f":"IF(ISNUMBER(Taxa_PivotTable!G117),Taxa_PivotTable!G117,\"\")","v":""},"",{"$f":"IF(COUNT(U117,$C117)=2,(U117)*$C117,\"\")","v":""},"",{"$f":"IF(ISNUMBER(Taxa_PivotTable!H117),Taxa_PivotTable!H117,\"\")","v":""},"","","",{"$f":"IF(ISNUMBER(Taxa_PivotTable!I117),Taxa_PivotTable!I117,\"\")","v":""},"","","",{"$f":"IF(ISNUMBER(Taxa_PivotTable!J117),Taxa_PivotTable!J117,\"\")","v":""},"","","",{"$f":"IF(ISNUMBER(Taxa_PivotTable!K117),Taxa_PivotTable!K117,\"\")","v":""},"","",""]
[{"$f":"Taxa_PivotTable!A118","v":{"$error":"#N/A"}},{"$f":"IF(Taxa_PivotTable!B118=\"\",\"\",Taxa_PivotTable!B118)","v":""},{"$f":"IF(ISNUMBER(VLOOKUP(B118,UKOptima!A:J,10,FALSE)),VLOOKUP(B118,UKOptima!A:J,10,FALSE),\"\")","v":""},{"$f":"IF(ISNUMBER(Taxa_PivotTable!C118),Taxa_PivotTable!C118,\"\")","v":""},"","","",{"$f":"IF(ISNUMBER(Taxa_PivotTable!D118),Taxa_PivotTable!D118,\"\")","v":""},"","","",{"$f":"IF(ISNUMBER(Taxa_PivotTable!E118),Taxa_PivotTable!E118,\"\")","v":""},"","","",{"$f":"IF(ISNUMBER(Taxa_PivotTable!F118),Taxa_PivotTable!F118,\"\")","v":""},"","","",{"$f":"IF(ISNUMBER(Taxa_PivotTable!G118),Taxa_PivotTable!G118,\"\")","v":""},"","","",{"$f":"IF(ISNUMBER(Taxa_PivotTable!H118),Taxa_PivotTable!H118,\"\")","v":""},"","","",{"$f":"IF(ISNUMBER(Taxa_PivotTable!I118),Taxa_PivotTable!I118,\"\")","v":""},"","","",{"$f":"IF(ISNUMBER(Taxa_PivotTable!J118),Taxa_PivotTable!J118,\"\")","v":""},"","","",{"$f":"IF(ISNUMBER(Taxa_PivotTable!K118),Taxa_PivotTable!K118,\"\")","v":""},"","",""]
[{"$f":"Taxa_PivotTable!A119","v":{"$error":"#N/A"}},{"$f":"IF(Taxa_PivotTable!B119=\"\",\"\",Taxa_PivotTable!B119)","v":""},{"$f":"IF(ISNUMBER(VLOOKUP(B119,UKOptima!A:J,10,FALSE)),VLOOKUP(B119,UKOptima!A:J,10,FALSE),\"\")","v":""},{"$f":"IF(ISNUMBER(Taxa_PivotTable!C119),Taxa_PivotTable!C119,\"\")","v":""},"","","",{"$f":"IF(ISNUMBER(Taxa_PivotTable!D119),Taxa_PivotTable!D119,\"\")","v":""},"","","",{"$f":"IF(ISNUMBER(Taxa_PivotTable!E119),Taxa_PivotTable!E119,\"\")","v":""},"","","",{"$f":"IF(ISNUMBER(Taxa_PivotTable!F119),Taxa_PivotTable!F119,\"\")","v":""},"","","",{"$f":"IF(ISNUMBER(Taxa_PivotTable!G119),Taxa_PivotTable!G119,\"\")","v":""},"","","",{"$f":"IF(ISNUMBER(Taxa_PivotTable!H119),Taxa_PivotTable!H119,\"\")","v":""},"","","",{"$f":"IF(ISNUMBER(Taxa_PivotTable!I119),Taxa_PivotTable!I119,\"\")","v":""},"","","",{"$f":"IF(ISNUMBER(Taxa_PivotTable!J119),Taxa_PivotTable!J119,\"\")","v":""},"","","",{"$f":"IF(ISNUMBER(Taxa_PivotTable!K119),Taxa_PivotTable!K119,\"\")","v":""},"","",""]
[{"$f":"Taxa_PivotTable!A120","v":{"$error":"#N/A"}},{"$f":"IF(Taxa_PivotTable!B120=\"\",\"\",Taxa_PivotTable!B120)","v":""},{"$f":"IF(ISNUMBER(VLOOKUP(B120,UKOptima!A:J,10,FALSE)),VLOOKUP(B120,UKOptima!A:J,10,FALSE),\"\")","v":""},{"$f":"IF(ISNUMBER(Taxa_PivotTable!C120),Taxa_PivotTable!C120,\"\")","v":""},"","","",{"$f":"IF(ISNUMBER(Taxa_PivotTable!D120),Taxa_PivotTable!D120,\"\")","v":""},"","","",{"$f":"IF(ISNUMBER(Taxa_PivotTable!E120),Taxa_PivotTable!E120,\"\")","v":""},"","","",{"$f":"IF(ISNUMBER(Taxa_PivotTable!F120),Taxa_PivotTable!F120,\"\")","v":""},"","","",{"$f":"IF(ISNUMBER(Taxa_PivotTable!G120),Taxa_PivotTable!G120,\"\")","v":""},"","","",{"$f":"IF(ISNUMBER(Taxa_PivotTable!H120),Taxa_PivotTable!H120,\"\")","v":""},"","","",{"$f":"IF(ISNUMBER(Taxa_PivotTable!I120),Taxa_PivotTable!I120,\"\")","v":""},"","","",{"$f":"IF(ISNUMBER(Taxa_PivotTable!J120),Taxa_PivotTable!J120,\"\")","v":""},"","","",{"$f":"IF(ISNUMBER(Taxa_PivotTable!K120),Taxa_PivotTable!K120,\"\")","v":""},"","",""]
[{"$f":"Taxa_PivotTable!A121","v":{"$error":"#N/A"}},{"$f":"IF(Taxa_PivotTable!B121=\"\",\"\",Taxa_PivotTable!B121)","v":""},{"$f":"IF(ISNUMBER(VLOOKUP(B121,UKOptima!A:J,10,FALSE)),VLOOKUP(B121,UKOptima!A:J,10,FALSE),\"\")","v":""},{"$f":"IF(ISNUMBER(Taxa_PivotTable!C121),Taxa_PivotTable!C121,\"\")","v":""},"","","",{"$f":"IF(ISNUMBER(Taxa_PivotTable!D121),Taxa_PivotTable!D121,\"\")","v":""},"","","",{"$f":"IF(ISNUMBER(Taxa_PivotTable!E121),Taxa_PivotTable!E121,\"\")","v":""},"","","",{"$f":"IF(ISNUMBER(Taxa_PivotTable!F121),Taxa_PivotTable!F121,\"\")","v":""},"","","",{"$f":"IF(ISNUMBER(Taxa_PivotTable!G121),Taxa_PivotTable!G121,\"\")","v":""},"","","",{"$f":"IF(ISNUMBER(Taxa_PivotTable!H121),Taxa_PivotTable!H121,\"\")","v":""},"","","",{"$f":"IF(ISNUMBER(Taxa_PivotTable!I121),Taxa_PivotTable!I121,\"\")","v":""},"","","",{"$f":"IF(ISNUMBER(Taxa_PivotTable!J121),Taxa_PivotTable!J121,\"\")","v":""},"","","",{"$f":"IF(ISNUMBER(Taxa_PivotTable!K121),Taxa_PivotTable!K121,\"\")","v":""},"","",""]
[{"$f":"Taxa_PivotTable!A122","v":{"$error":"#N/A"}},{"$f":"IF(Taxa_PivotTable!B122=\"\",\"\",Taxa_PivotTable!B122)","v":""},{"$f":"IF(ISNUMBER(VLOOKUP(B122,UKOptima!A:J,10,FALSE)),VLOOKUP(B122,UKOptima!A:J,10,FALSE),\"\")","v":""},{"$f":"IF(ISNUMBER(Taxa_PivotTable!C122),Taxa_PivotTable!C122,\"\")","v":""},"","","",{"$f":"IF(ISNUMBER(Taxa_PivotTable!D122),Taxa_PivotTable!D122,\"\")","v":""},"","","",{"$f":"IF(ISNUMBER(Taxa_PivotTable!E122),Taxa_PivotTable!E122,\"\")","v":""},"","","",{"$f":"IF(ISNUMBER(Taxa_PivotTable!F122),Taxa_PivotTable!F122,\"\")","v":""},"","","",{"$f":"IF(ISNUMBER(Taxa_PivotTable!G122),Taxa_PivotTable!G122,\"\")","v":""},"","","",{"$f":"IF(ISNUMBER(Taxa_PivotTable!H122),Taxa_PivotTable!H122,\"\")","v":""},"","","",{"$f":"IF(ISNUMBER(Taxa_PivotTable!I122),Taxa_PivotTable!I122,\"\")","v":""},"","","",{"$f":"IF(ISNUMBER(Taxa_PivotTable!J122),Taxa_PivotTable!J122,\"\")","v":""},"","","",{"$f":"IF(ISNUMBER(Taxa_PivotTable!K122),Taxa_PivotTable!K122,\"\")","v":""},"","",""]
[{"$f":"Taxa_PivotTable!A123","v":{"$error":"#N/A"}},{"$f":"IF(Taxa_PivotTable!B123=\"\",\"\",Taxa_PivotTable!B123)","v":""},{"$f":"IF(ISNUMBER(VLOOKUP(B123,UKOptima!A:J,10,FALSE)),VLOOKUP(B123,UKOptima!A:J,10,FALSE),\"\")","v":""},{"$f":"IF(ISNUMBER(Taxa_PivotTable!C123),Taxa_PivotTable!C123,\"\")","v":""},"","","",{"$f":"IF(ISNUMBER(Taxa_PivotTable!D123),Taxa_PivotTable!D123,\"\")","v":""},"","","",{"$f":"IF(ISNUMBER(Taxa_PivotTable!E123),Taxa_PivotTable!E123,\"\")","v":""},"","","",{"$f":"IF(ISNUMBER(Taxa_PivotTable!F123),Taxa_PivotTable!F123,\"\")","v":""},"","","",{"$f":"IF(ISNUMBER(Taxa_PivotTable!G123),Taxa_PivotTable!G123,\"\")","v":""},"","","",{"$f":"IF(ISNUMBER(Taxa_PivotTable!H123),Taxa_PivotTable!H123,\"\")","v":""},"","","",{"$f":"IF(ISNUMBER(Taxa_PivotTable!I123),Taxa_PivotTable!I123,\"\")","v":""},"","","",{"$f":"IF(ISNUMBER(Taxa_PivotTable!J123),Taxa_PivotTable!J123,\"\")","v":""},"","","",{"$f":"IF(ISNUMBER(Taxa_PivotTable!K123),Taxa_PivotTable!K123,\"\")","v":""},"","",""]
[{"$f":"Taxa_PivotTable!A124","v":{"$error":"#N/A"}},{"$f":"IF(Taxa_PivotTable!B124=\"\",\"\",Taxa_PivotTable!B124)","v":""},{"$f":"IF(ISNUMBER(VLOOKUP(B124,UKOptima!A:J,10,FALSE)),VLOOKUP(B124,UKOptima!A:J,10,FALSE),\"\")","v":""},{"$f":"IF(ISNUMBER(Taxa_PivotTable!C124),Taxa_PivotTable!C124,\"\")","v":""},"","","",{"$f":"IF(ISNUMBER(Taxa_PivotTable!D124),Taxa_PivotTable!D124,\"\")","v":""},"","","",{"$f":"IF(ISNUMBER(Taxa_PivotTable!E124),Taxa_PivotTable!E124,\"\")","v":""},"","","",{"$f":"IF(ISNUMBER(Taxa_PivotTable!F124),Taxa_PivotTable!F124,\"\")","v":""},"","","",{"$f":"IF(ISNUMBER(Taxa_PivotTable!G124),Taxa_PivotTable!G124,\"\")","v":""},"","","",{"$f":"IF(ISNUMBER(Taxa_PivotTable!H124),Taxa_PivotTable!H124,\"\")","v":""},"","","",{"$f":"IF(ISNUMBER(Taxa_PivotTable!I124),Taxa_PivotTable!I124,\"\")","v":""},"","","",{"$f":"IF(ISNUMBER(Taxa_PivotTable!J124),Taxa_PivotTable!J124,\"\")","v":""},"","","",{"$f":"IF(ISNUMBER(Taxa_PivotTable!K124),Taxa_PivotTable!K124,\"\")","v":""},"","",""]
[{"$f":"Taxa_PivotTable!A125","v":{"$error":"#N/A"}},{"$f":"IF(Taxa_PivotTable!B125=\"\",\"\",Taxa_PivotTable!B125)","v":""},{"$f":"IF(ISNUMBER(VLOOKUP(B125,UKOptima!A:J,10,FALSE)),VLOOKUP(B125,UKOptima!A:J,10,FALSE),\"\")","v":""},{"$f":"IF(ISNUMBER(Taxa_PivotTable!C125),Taxa_PivotTable!C125,\"\")","v":""},"","","",{"$f":"IF(ISNUMBER(Taxa_PivotTable!D125),Taxa_PivotTable!D125,\"\")","v":""},"","","",{"$f":"IF(ISNUMBER(Taxa_PivotTable!E125),Taxa_PivotTable!E125,\"\")","v":""},"","","",{"$f":"IF(ISNUMBER(Taxa_PivotTable!F125),Taxa_PivotTable!F125,\"\")","v":""},"","","",{"$f":"IF(ISNUMBER(Taxa_PivotTable!G125),Taxa_PivotTable!G125,\"\")","v":""},"","","",{"$f":"IF(ISNUMBER(Taxa_PivotTable!H125),Taxa_PivotTable!H125,\"\")","v":""},"","","",{"$f":"IF(ISNUMBER(Taxa_PivotTable!I125),Taxa_PivotTable!I125,\"\")","v":""},"","","",{"$f":"IF(ISNUMBER(Taxa_PivotTable!J125),Taxa_PivotTable!J125,\"\")","v":""},"","","",{"$f":"IF(ISNUMBER(Taxa_PivotTable!K125),Taxa_PivotTable!K125,\"\")","v":""},"","",""]
[{"$f":"Taxa_PivotTable!A126","v":{"$error":"#N/A"}},{"$f":"IF(Taxa_PivotTable!B126=\"\",\"\",Taxa_PivotTable!B126)","v":""},{"$f":"IF(ISNUMBER(VLOOKUP(B126,UKOptima!A:J,10,FALSE)),VLOOKUP(B126,UKOptima!A:J,10,FALSE),\"\")","v":""},{"$f":"IF(ISNUMBER(Taxa_PivotTable!C126),Taxa_PivotTable!C126,\"\")","v":""},"","","",{"$f":"IF(ISNUMBER(Taxa_PivotTable!D126),Taxa_PivotTable!D126,\"\")","v":""},"","","",{"$f":"IF(ISNUMBER(Taxa_PivotTable!E126),Taxa_PivotTable!E126,\"\")","v":""},"","","",{"$f":"IF(ISNUMBER(Taxa_PivotTable!F126),Taxa_PivotTable!F126,\"\")","v":""},"","","",{"$f":"IF(ISNUMBER(Taxa_PivotTable!G126),Taxa_PivotTable!G126,\"\")","v":""},"","","",{"$f":"IF(ISNUMBER(Taxa_PivotTable!H126),Taxa_PivotTable!H126,\"\")","v":""},"","","",{"$f":"IF(ISNUMBER(Taxa_PivotTable!I126),Taxa_PivotTable!I126,\"\")","v":""},"","","",{"$f":"IF(ISNUMBER(Taxa_PivotTable!J126),Taxa_PivotTable!J126,\"\")","v":""},"","","",{"$f":"IF(ISNUMBER(Taxa_PivotTable!K126),Taxa_PivotTable!K126,\"\")","v":""},"","",""]
[{"$f":"Taxa_PivotTable!A127","v":{"$error":"#N/A"}},{"$f":"IF(Taxa_PivotTable!B127=\"\",\"\",Taxa_PivotTable!B127)","v":""},{"$f":"IF(ISNUMBER(VLOOKUP(B127,UKOptima!A:J,10,FALSE)),VLOOKUP(B127,UKOptima!A:J,10,FALSE),\"\")","v":""},{"$f":"IF(ISNUMBER(Taxa_PivotTable!C127),Taxa_PivotTable!C127,\"\")","v":""},"","","",{"$f":"IF(ISNUMBER(Taxa_PivotTable!D127),Taxa_PivotTable!D127,\"\")","v":""},"","","",{"$f":"IF(ISNUMBER(Taxa_PivotTable!E127),Taxa_PivotTable!E127,\"\")","v":""},"","","",{"$f":"IF(ISNUMBER(Taxa_PivotTable!F127),Taxa_PivotTable!F127,\"\")","v":""},"","","",{"$f":"IF(ISNUMBER(Taxa_PivotTable!G127),Taxa_PivotTable!G127,\"\")","v":""},"","","",{"$f":"IF(ISNUMBER(Taxa_PivotTable!H127),Taxa_PivotTable!H127,\"\")","v":""},"","","",{"$f":"IF(ISNUMBER(Taxa_PivotTable!I127),Taxa_PivotTable!I127,\"\")","v":""},"","","",{"$f":"IF(ISNUMBER(Taxa_PivotTable!J127),Taxa_PivotTable!J127,\"\")","v":""},"","","",{"$f":"IF(ISNUMBER(Taxa_PivotTable!K127),Taxa_PivotTable!K127,\"\")","v":""},"","",""]
[{"$f":"Taxa_PivotTable!A128","v":{"$error":"#N/A"}},{"$f":"IF(Taxa_PivotTable!B128=\"\",\"\",Taxa_PivotTable!B128)","v":""},{"$f":"IF(ISNUMBER(VLOOKUP(B128,UKOptima!A:J,10,FALSE)),VLOOKUP(B128,UKOptima!A:J,10,FALSE),\"\")","v":""},{"$f":"IF(ISNUMBER(Taxa_PivotTable!C128),Taxa_PivotTable!C128,\"\")","v":""},"","","",{"$f":"IF(ISNUMBER(Taxa_PivotTable!D128),Taxa_PivotTable!D128,\"\")","v":""},"","","",{"$f":"IF(ISNUMBER(Taxa_PivotTable!E128),Taxa_PivotTable!E128,\"\")","v":""},"","","",{"$f":"IF(ISNUMBER(Taxa_PivotTable!F128),Taxa_PivotTable!F128,\"\")","v":""},"","","",{"$f":"IF(ISNUMBER(Taxa_PivotTable!G128),Taxa_PivotTable!G128,\"\")","v":""},"","","",{"$f":"IF(ISNUMBER(Taxa_PivotTable!H128),Taxa_PivotTable!H128,\"\")","v":""},"","","",{"$f":"IF(ISNUMBER(Taxa_PivotTable!I128),Taxa_PivotTable!I128,\"\")","v":""},"","","",{"$f":"IF(ISNUMBER(Taxa_PivotTable!J128),Taxa_PivotTable!J128,\"\")","v":""},"","","",{"$f":"IF(ISNUMBER(Taxa_PivotTable!K128),Taxa_PivotTable!K128,\"\")","v":""},"","",""]
[{"$f":"Taxa_PivotTable!A129","v":{"$error":"#N/A"}},{"$f":"IF(Taxa_PivotTable!B129=\"\",\"\",Taxa_PivotTable!B129)","v":""},{"$f":"IF(ISNUMBER(VLOOKUP(B129,UKOptima!A:J,10,FALSE)),VLOOKUP(B129,UKOptima!A:J,10,FALSE),\"\")","v":""},{"$f":"IF(ISNUMBER(Taxa_PivotTable!C129),Taxa_PivotTable!C129,\"\")","v":""},"","","",{"$f":"IF(ISNUMBER(Taxa_PivotTable!D129),Taxa_PivotTable!D129,\"\")","v":""},"","","",{"$f":"IF(ISNUMBER(Taxa_PivotTable!E129),Taxa_PivotTable!E129,\"\")","v":""},"","","",{"$f":"IF(ISNUMBER(Taxa_PivotTable!F129),Taxa_PivotTable!F129,\"\")","v":""},"","","",{"$f":"IF(ISNUMBER(Taxa_PivotTable!G129),Taxa_PivotTable!G129,\"\")","v":""},"","","",{"$f":"IF(ISNUMBER(Taxa_PivotTable!H129),Taxa_PivotTable!H129,\"\")","v":""},"","","",{"$f":"IF(ISNUMBER(Taxa_PivotTable!I129),Taxa_PivotTable!I129,\"\")","v":""},"","","",{"$f":"IF(ISNUMBER(Taxa_PivotTable!J129),Taxa_PivotTable!J129,\"\")","v":""},"","","",{"$f":"IF(ISNUMBER(Taxa_PivotTable!K129),Taxa_PivotTable!K129,\"\")","v":""},"","",""]
[{"$f":"Taxa_PivotTable!A130","v":{"$error":"#N/A"}},{"$f":"IF(Taxa_PivotTable!B130=\"\",\"\",Taxa_PivotTable!B130)","v":""},{"$f":"IF(ISNUMBER(VLOOKUP(B130,UKOptima!A:J,10,FALSE)),VLOOKUP(B130,UKOptima!A:J,10,FALSE),\"\")","v":""},{"$f":"IF(ISNUMBER(Taxa_PivotTable!C130),Taxa_PivotTable!C130,\"\")","v":""},"","","",{"$f":"IF(ISNUMBER(Taxa_PivotTable!D130),Taxa_PivotTable!D130,\"\")","v":""},"","","",{"$f":"IF(ISNUMBER(Taxa_PivotTable!E130),Taxa_PivotTable!E130,\"\")","v":""},"","","",{"$f":"IF(ISNUMBER(Taxa_PivotTable!F130),Taxa_PivotTable!F130,\"\")","v":""},"","","",{"$f":"IF(ISNUMBER(Taxa_PivotTable!G130),Taxa_PivotTable!G130,\"\")","v":""},"","","",{"$f":"IF(ISNUMBER(Taxa_PivotTable!H130),Taxa_PivotTable!H130,\"\")","v":""},"","","",{"$f":"IF(ISNUMBER(Taxa_PivotTable!I130),Taxa_PivotTable!I130,\"\")","v":""},"","","",{"$f":"IF(ISNUMBER(Taxa_PivotTable!J130),Taxa_PivotTable!J130,\"\")","v":""},"","","",{"$f":"IF(ISNUMBER(Taxa_PivotTable!K130),Taxa_PivotTable!K130,\"\")","v":""},"","",""]
[{"$f":"Taxa_PivotTable!A131","v":{"$error":"#N/A"}},{"$f":"IF(Taxa_PivotTable!B131=\"\",\"\",Taxa_PivotTable!B131)","v":""},{"$f":"IF(ISNUMBER(VLOOKUP(B131,UKOptima!A:J,10,FALSE)),VLOOKUP(B131,UKOptima!A:J,10,FALSE),\"\")","v":""},{"$f":"IF(ISNUMBER(Taxa_PivotTable!C131),Taxa_PivotTable!C131,\"\")","v":""},"","","",{"$f":"IF(ISNUMBER(Taxa_PivotTable!D131),Taxa_PivotTable!D131,\"\")","v":""},"","","",{"$f":"IF(ISNUMBER(Taxa_PivotTable!E131),Taxa_PivotTable!E131,\"\")","v":""},"","","",{"$f":"IF(ISNUMBER(Taxa_PivotTable!F131),Taxa_PivotTable!F131,\"\")","v":""},"","","",{"$f":"IF(ISNUMBER(Taxa_PivotTable!G131),Taxa_PivotTable!G131,\"\")","v":""},"","","",{"$f":"IF(ISNUMBER(Taxa_PivotTable!H131),Taxa_PivotTable!H131,\"\")","v":""},"","","",{"$f":"IF(ISNUMBER(Taxa_PivotTable!I131),Taxa_PivotTable!I131,\"\")","v":""},"","","",{"$f":"IF(ISNUMBER(Taxa_PivotTable!J131),Taxa_PivotTable!J131,\"\")","v":""},"","","",{"$f":"IF(ISNUMBER(Taxa_PivotTable!K131),Taxa_PivotTable!K131,\"\")","v":""},"","",""]
[{"$f":"Taxa_PivotTable!A132","v":{"$error":"#N/A"}},{"$f":"IF(Taxa_PivotTable!B132=\"\",\"\",Taxa_PivotTable!B132)","v":""},{"$f":"IF(ISNUMBER(VLOOKUP(B132,UKOptima!A:J,10,FALSE)),VLOOKUP(B132,UKOptima!A:J,10,FALSE),\"\")","v":""},{"$f":"IF(ISNUMBER(Taxa_PivotTable!C132),Taxa_PivotTable!C132,\"\")","v":""},"","","",{"$f":"IF(ISNUMBER(Taxa_PivotTable!D132),Taxa_PivotTable!D132,\"\")","v":""},"","","",{"$f":"IF(ISNUMBER(Taxa_PivotTable!E132),Taxa_PivotTable!E132,\"\")","v":""},"","","",{"$f":"IF(ISNUMBER(Taxa_PivotTable!F132),Taxa_PivotTable!F132,\"\")","v":""},"","","",{"$f":"IF(ISNUMBER(Taxa_PivotTable!G132),Taxa_PivotTable!G132,\"\")","v":""},"","","",{"$f":"IF(ISNUMBER(Taxa_PivotTable!H132),Taxa_PivotTable!H132,\"\")","v":""},"","","",{"$f":"IF(ISNUMBER(Taxa_PivotTable!I132),Taxa_PivotTable!I132,\"\")","v":""},"","","",{"$f":"IF(ISNUMBER(Taxa_PivotTable!J132),Taxa_PivotTable!J132,\"\")","v":""},"","","",{"$f":"IF(ISNUMBER(Taxa_PivotTable!K132),Taxa_PivotTable!K132,\"\")","v":""},"","",""]
[{"$f":"Taxa_PivotTable!A133","v":{"$error":"#N/A"}},{"$f":"IF(Taxa_PivotTable!B133=\"\",\"\",Taxa_PivotTable!B133)","v":""},{"$f":"IF(ISNUMBER(VLOOKUP(B133,UKOptima!A:J,10,FALSE)),VLOOKUP(B133,UKOptima!A:J,10,FALSE),\"\")","v":""},{"$f":"IF(ISNUMBER(Taxa_PivotTable!C133),Taxa_PivotTable!C133,\"\")","v":""},"","","",{"$f":"IF(ISNUMBER(Taxa_PivotTable!D133),Taxa_PivotTable!D133,\"\")","v":""},"","","",{"$f":"IF(ISNUMBER(Taxa_PivotTable!E133),Taxa_PivotTable!E133,\"\")","v":""},"","","",{"$f":"IF(ISNUMBER(Taxa_PivotTable!F133),Taxa_PivotTable!F133,\"\")","v":""},"","","",{"$f":"IF(ISNUMBER(Taxa_PivotTable!G133),Taxa_PivotTable!G133,\"\")","v":""},"","","",{"$f":"IF(ISNUMBER(Taxa_PivotTable!H133),Taxa_PivotTable!H133,\"\")","v":""},"","","",{"$f":"IF(ISNUMBER(Taxa_PivotTable!I133),Taxa_PivotTable!I133,\"\")","v":""},"","","",{"$f":"IF(ISNUMBER(Taxa_PivotTable!J133),Taxa_PivotTable!J133,\"\")","v":""},"","","",{"$f":"IF(ISNUMBER(Taxa_PivotTable!K133),Taxa_PivotTable!K133,\"\")","v":""},"","",""]
[{"$f":"Taxa_PivotTable!A134","v":{"$error":"#N/A"}},{"$f":"IF(Taxa_PivotTable!B134=\"\",\"\",Taxa_PivotTable!B134)","v":""},{"$f":"IF(ISNUMBER(VLOOKUP(B134,UKOptima!A:J,10,FALSE)),VLOOKUP(B134,UKOptima!A:J,10,FALSE),\"\")","v":""},{"$f":"IF(ISNUMBER(Taxa_PivotTable!C134),Taxa_PivotTable!C134,\"\")","v":""},"","","",{"$f":"IF(ISNUMBER(Taxa_PivotTable!D134),Taxa_PivotTable!D134,\"\")","v":""},"","","",{"$f":"IF(ISNUMBER(Taxa_PivotTable!E134),Taxa_PivotTable!E134,\"\")","v":""},"","","",{"$f":"IF(ISNUMBER(Taxa_PivotTable!F134),Taxa_PivotTable!F134,\"\")","v":""},"","","",{"$f":"IF(ISNUMBER(Taxa_PivotTable!G134),Taxa_PivotTable!G134,\"\")","v":""},"","","",{"$f":"IF(ISNUMBER(Taxa_PivotTable!H134),Taxa_PivotTable!H134,\"\")","v":""},"","","",{"$f":"IF(ISNUMBER(Taxa_PivotTable!I134),Taxa_PivotTable!I134,\"\")","v":""},"","","",{"$f":"IF(ISNUMBER(Taxa_PivotTable!J134),Taxa_PivotTable!J134,\"\")","v":""},"","","",{"$f":"IF(ISNUMBER(Taxa_PivotTable!K134),Taxa_PivotTable!K134,\"\")","v":""},"","",""]
[{"$f":"Taxa_PivotTable!A135","v":{"$error":"#N/A"}},{"$f":"IF(Taxa_PivotTable!B135=\"\",\"\",Taxa_PivotTable!B135)","v":""},{"$f":"IF(ISNUMBER(VLOOKUP(B135,UKOptima!A:J,10,FALSE)),VLOOKUP(B135,UKOptima!A:J,10,FALSE),\"\")","v":""},{"$f":"IF(ISNUMBER(Taxa_PivotTable!C135),Taxa_PivotTable!C135,\"\")","v":""},"","","",{"$f":"IF(ISNUMBER(Taxa_PivotTable!D135),Taxa_PivotTable!D135,\"\")","v":""},"","","",{"$f":"IF(ISNUMBER(Taxa_PivotTable!E135),Taxa_PivotTable!E135,\"\")","v":""},"","","",{"$f":"IF(ISNUMBER(Taxa_PivotTable!F135),Taxa_PivotTable!F135,\"\")","v":""},"","","",{"$f":"IF(ISNUMBER(Taxa_PivotTable!G135),Taxa_PivotTable!G135,\"\")","v":""},"","","",{"$f":"IF(ISNUMBER(Taxa_PivotTable!H135),Taxa_PivotTable!H135,\"\")","v":""},"","","",{"$f":"IF(ISNUMBER(Taxa_PivotTable!I135),Taxa_PivotTable!I135,\"\")","v":""},"","","",{"$f":"IF(ISNUMBER(Taxa_PivotTable!J135),Taxa_PivotTable!J135,\"\")","v":""},"","","",{"$f":"IF(ISNUMBER(Taxa_PivotTable!K135),Taxa_PivotTable!K135,\"\")","v":""},"","",""]
[{"$f":"Taxa_PivotTable!A136","v":{"$error":"#N/A"}},{"$f":"IF(Taxa_PivotTable!B136=\"\",\"\",Taxa_PivotTable!B136)","v":""},{"$f":"IF(ISNUMBER(VLOOKUP(B136,UKOptima!A:J,10,FALSE)),VLOOKUP(B136,UKOptima!A:J,10,FALSE),\"\")","v":""},{"$f":"IF(ISNUMBER(Taxa_PivotTable!C136),Taxa_PivotTable!C136,\"\")","v":""},"","","",{"$f":"IF(ISNUMBER(Taxa_PivotTable!D136),Taxa_PivotTable!D136,\"\")","v":""},"","","",{"$f":"IF(ISNUMBER(Taxa_PivotTable!E136),Taxa_PivotTable!E136,\"\")","v":""},"","","",{"$f":"IF(ISNUMBER(Taxa_PivotTable!F136),Taxa_PivotTable!F136,\"\")","v":""},"","","",{"$f":"IF(ISNUMBER(Taxa_PivotTable!G136),Taxa_PivotTable!G136,\"\")","v":""},"","","",{"$f":"IF(ISNUMBER(Taxa_PivotTable!H136),Taxa_PivotTable!H136,\"\")","v":""},"","","",{"$f":"IF(ISNUMBER(Taxa_PivotTable!I136),Taxa_PivotTable!I136,\"\")","v":""},"","","",{"$f":"IF(ISNUMBER(Taxa_PivotTable!J136),Taxa_PivotTable!J136,\"\")","v":""},"","","",{"$f":"IF(ISNUMBER(Taxa_PivotTable!K136),Taxa_PivotTable!K136,\"\")","v":""},"","",""]
[{"$f":"Taxa_PivotTable!A137","v":{"$error":"#N/A"}},{"$f":"IF(Taxa_PivotTable!B137=\"\",\"\",Taxa_PivotTable!B137)","v":""},{"$f":"IF(ISNUMBER(VLOOKUP(B137,UKOptima!A:J,10,FALSE)),VLOOKUP(B137,UKOptima!A:J,10,FALSE),\"\")","v":""},{"$f":"IF(ISNUMBER(Taxa_PivotTable!C137),Taxa_PivotTable!C137,\"\")","v":""},"","","",{"$f":"IF(ISNUMBER(Taxa_PivotTable!D137),Taxa_PivotTable!D137,\"\")","v":""},"","","",{"$f":"IF(ISNUMBER(Taxa_PivotTable!E137),Taxa_PivotTable!E137,\"\")","v":""},"","","",{"$f":"IF(ISNUMBER(Taxa_PivotTable!F137),Taxa_PivotTable!F137,\"\")","v":""},"","","",{"$f":"IF(ISNUMBER(Taxa_PivotTable!G137),Taxa_PivotTable!G137,\"\")","v":""},"","","",{"$f":"IF(ISNUMBER(Taxa_PivotTable!H137),Taxa_PivotTable!H137,\"\")","v":""},"","","",{"$f":"IF(ISNUMBER(Taxa_PivotTable!I137),Taxa_PivotTable!I137,\"\")","v":""},"","","",{"$f":"IF(ISNUMBER(Taxa_PivotTable!J137),Taxa_PivotTable!J137,\"\")","v":""},"","","",{"$f":"IF(ISNUMBER(Taxa_PivotTable!K137),Taxa_PivotTable!K137,\"\")","v":""},"","",""]
[{"$f":"Taxa_PivotTable!A138","v":{"$error":"#N/A"}},{"$f":"IF(Taxa_PivotTable!B138=\"\",\"\",Taxa_PivotTable!B138)","v":""},{"$f":"IF(ISNUMBER(VLOOKUP(B138,UKOptima!A:J,10,FALSE)),VLOOKUP(B138,UKOptima!A:J,10,FALSE),\"\")","v":""},{"$f":"IF(ISNUMBER(Taxa_PivotTable!C138),Taxa_PivotTable!C138,\"\")","v":""},"","","",{"$f":"IF(ISNUMBER(Taxa_PivotTable!D138),Taxa_PivotTable!D138,\"\")","v":""},"","","",{"$f":"IF(ISNUMBER(Taxa_PivotTable!E138),Taxa_PivotTable!E138,\"\")","v":""},"","","",{"$f":"IF(ISNUMBER(Taxa_PivotTable!F138),Taxa_PivotTable!F138,\"\")","v":""},"","","",{"$f":"IF(ISNUMBER(Taxa_PivotTable!G138),Taxa_PivotTable!G138,\"\")","v":""},"","","",{"$f":"IF(ISNUMBER(Taxa_PivotTable!H138),Taxa_PivotTable!H138,\"\")","v":""},"","","",{"$f":"IF(ISNUMBER(Taxa_PivotTable!I138),Taxa_PivotTable!I138,\"\")","v":""},"","","",{"$f":"IF(ISNUMBER(Taxa_PivotTable!J138),Taxa_PivotTable!J138,\"\")","v":""},"","","",{"$f":"IF(ISNUMBER(Taxa_PivotTable!K138),Taxa_PivotTable!K138,\"\")","v":""},"","",""]
[{"$f":"Taxa_PivotTable!A139","v":{"$error":"#N/A"}},{"$f":"IF(Taxa_PivotTable!B139=\"\",\"\",Taxa_PivotTable!B139)","v":""},{"$f":"IF(ISNUMBER(VLOOKUP(B139,UKOptima!A:J,10,FALSE)),VLOOKUP(B139,UKOptima!A:J,10,FALSE),\"\")","v":""},{"$f":"IF(ISNUMBER(Taxa_PivotTable!C139),Taxa_PivotTable!C139,\"\")","v":""},"","","",{"$f":"IF(ISNUMBER(Taxa_PivotTable!D139),Taxa_PivotTable!D139,\"\")","v":""},"","","",{"$f":"IF(ISNUMBER(Taxa_PivotTable!E139),Taxa_PivotTable!E139,\"\")","v":""},"","","",{"$f":"IF(ISNUMBER(Taxa_PivotTable!F139),Taxa_PivotTable!F139,\"\")","v":""},"","","",{"$f":"IF(ISNUMBER(Taxa_PivotTable!G139),Taxa_PivotTable!G139,\"\")","v":""},"","","",{"$f":"IF(ISNUMBER(Taxa_PivotTable!H139),Taxa_PivotTable!H139,\"\")","v":""},"","","",{"$f":"IF(ISNUMBER(Taxa_PivotTable!I139),Taxa_PivotTable!I139,\"\")","v":""},"","","",{"$f":"IF(ISNUMBER(Taxa_PivotTable!J139),Taxa_PivotTable!J139,\"\")","v":""},"","","",{"$f":"IF(ISNUMBER(Taxa_PivotTable!K139),Taxa_PivotTable!K139,\"\")","v":""},"","",""]
[{"$f":"Taxa_PivotTable!A140","v":{"$error":"#N/A"}},{"$f":"IF(Taxa_PivotTable!B140=\"\",\"\",Taxa_PivotTable!B140)","v":""},{"$f":"IF(ISNUMBER(VLOOKUP(B140,UKOptima!A:J,10,FALSE)),VLOOKUP(B140,UKOptima!A:J,10,FALSE),\"\")","v":""},{"$f":"IF(ISNUMBER(Taxa_PivotTable!C140),Taxa_PivotTable!C140,\"\")","v":""},"","","",{"$f":"IF(ISNUMBER(Taxa_PivotTable!D140),Taxa_PivotTable!D140,\"\")","v":""},"","","",{"$f":"IF(ISNUMBER(Taxa_PivotTable!E140),Taxa_PivotTable!E140,\"\")","v":""},"","","",{"$f":"IF(ISNUMBER(Taxa_PivotTable!F140),Taxa_PivotTable!F140,\"\")","v":""},"","","",{"$f":"IF(ISNUMBER(Taxa_PivotTable!G140),Taxa_PivotTable!G140,\"\")","v":""},"","","",{"$f":"IF(ISNUMBER(Taxa_PivotTable!H140),Taxa_PivotTable!H140,\"\")","v":""},"","","",{"$f":"IF(ISNUMBER(Taxa_PivotTable!I140),Taxa_PivotTable!I140,\"\")","v":""},"","","",{"$f":"IF(ISNUMBER(Taxa_PivotTable!J140),Taxa_PivotTable!J140,\"\")","v":""},"","","",{"$f":"IF(ISNUMBER(Taxa_PivotTable!K140),Taxa_PivotTable!K140,\"\")","v":""},"","",""]
[{"$f":"Taxa_PivotTable!A141","v":{"$error":"#N/A"}},{"$f":"IF(Taxa_PivotTable!B141=\"\",\"\",Taxa_PivotTable!B141)","v":""},{"$f":"IF(ISNUMBER(VLOOKUP(B141,UKOptima!A:J,10,FALSE)),VLOOKUP(B141,UKOptima!A:J,10,FALSE),\"\")","v":""},{"$f":"IF(ISNUMBER(Taxa_PivotTable!C141),Taxa_PivotTable!C141,\"\")","v":""},"","","",{"$f":"IF(ISNUMBER(Taxa_PivotTable!D141),Taxa_PivotTable!D141,\"\")","v":""},{"$f":"IF(ISNUMBER(H141),LOG(ROUND(H141,6)),\"\")","v":""},"",{"$f":"IF(AND(ISNUMBER(H141),LEFT($B141,2)=\"01\"),H141/10^6,\"\")","v":""},{"$f":"IF(ISNUMBER(Taxa_PivotTable!E141),Taxa_PivotTable!E141,\"\")","v":""},{"$f":"IF(ISNUMBER(L141),LOG(ROUND(L141,6)),\"\")","v":""},"",{"$f":"IF(AND(ISNUMBER(L141),LEFT($B141,2)=\"01\"),L141/10^6,\"\")","v":""},{"$f":"IF(ISNUMBER(Taxa_PivotTable!F141),Taxa_PivotTable!F141,\"\")","v":""},"","","",{"$f":"IF(ISNUMBER(Taxa_PivotTable!G141),Taxa_PivotTable!G141,\"\")","v":""},"","","",{"$f":"IF(ISNUMBER(Taxa_PivotTable!H141),Taxa_PivotTable!H141,\"\")","v":""},"","","",{"$f":"IF(ISNUMBER(Taxa_PivotTable!I141),Taxa_PivotTable!I141,\"\")","v":""},"","","",{"$f":"IF(ISNUMBER(Taxa_PivotTable!J141),Taxa_PivotTable!J141,\"\")","v":""},"","","",{"$f":"IF(ISNUMBER(Taxa_PivotTable!K141),Taxa_PivotTable!K141,\"\")","v":""},"","",""]
[{"$f":"Taxa_PivotTable!A142","v":{"$error":"#N/A"}},{"$f":"IF(Taxa_PivotTable!B142=\"\",\"\",Taxa_PivotTable!B142)","v":""},{"$f":"IF(ISNUMBER(VLOOKUP(B142,UKOptima!A:J,10,FALSE)),VLOOKUP(B142,UKOptima!A:J,10,FALSE),\"\")","v":""},{"$f":"IF(ISNUMBER(Taxa_PivotTable!C142),Taxa_PivotTable!C142,\"\")","v":""},"","","",{"$f":"IF(ISNUMBER(Taxa_PivotTable!D142),Taxa_PivotTable!D142,\"\")","v":""},"","","",{"$f":"IF(ISNUMBER(Taxa_PivotTable!E142),Taxa_PivotTable!E142,\"\")","v":""},"","","",{"$f":"IF(ISNUMBER(Taxa_PivotTable!F142),Taxa_PivotTable!F142,\"\")","v":""},"","","",{"$f":"IF(ISNUMBER(Taxa_PivotTable!G142),Taxa_PivotTable!G142,\"\")","v":""},"","","",{"$f":"IF(ISNUMBER(Taxa_PivotTable!H142),Taxa_PivotTable!H142,\"\")","v":""},"","","",{"$f":"IF(ISNUMBER(Taxa_PivotTable!I142),Taxa_PivotTable!I142,\"\")","v":""},"","","",{"$f":"IF(ISNUMBER(Taxa_PivotTable!J142),Taxa_PivotTable!J142,\"\")","v":""},"","","",{"$f":"IF(ISNUMBER(Taxa_PivotTable!K142),Taxa_PivotTable!K142,\"\")","v":""},"","",""]
[{"$f":"Taxa_PivotTable!A143","v":{"$error":"#N/A"}},{"$f":"IF(Taxa_PivotTable!B143=\"\",\"\",Taxa_PivotTable!B143)","v":""},{"$f":"IF(ISNUMBER(VLOOKUP(B143,UKOptima!A:J,10,FALSE)),VLOOKUP(B143,UKOptima!A:J,10,FALSE),\"\")","v":""},{"$f":"IF(ISNUMBER(Taxa_PivotTable!C143),Taxa_PivotTable!C143,\"\")","v":""},"","","",{"$f":"IF(ISNUMBER(Taxa_PivotTable!D143),Taxa_PivotTable!D143,\"\")","v":""},"","","",{"$f":"IF(ISNUMBER(Taxa_PivotTable!E143),Taxa_PivotTable!E143,\"\")","v":""},"","","",{"$f":"IF(ISNUMBER(Taxa_PivotTable!F143),Taxa_PivotTable!F143,\"\")","v":""},"","","",{"$f":"IF(ISNUMBER(Taxa_PivotTable!G143),Taxa_PivotTable!G143,\"\")","v":""},"","","",{"$f":"IF(ISNUMBER(Taxa_PivotTable!H143),Taxa_PivotTable!H143,\"\")","v":""},"","","",{"$f":"IF(ISNUMBER(Taxa_PivotTable!I143),Taxa_PivotTable!I143,\"\")","v":""},"","","",{"$f":"IF(ISNUMBER(Taxa_PivotTable!J143),Taxa_PivotTable!J143,\"\")","v":""},"","","",{"$f":"IF(ISNUMBER(Taxa_PivotTable!K143),Taxa_PivotTable!K143,\"\")","v":""},"","",""]
[{"$f":"Taxa_PivotTable!A144","v":{"$error":"#N/A"}},{"$f":"IF(Taxa_PivotTable!B144=\"\",\"\",Taxa_PivotTable!B144)","v":""},{"$f":"IF(ISNUMBER(VLOOKUP(B144,UKOptima!A:J,10,FALSE)),VLOOKUP(B144,UKOptima!A:J,10,FALSE),\"\")","v":""},{"$f":"IF(ISNUMBER(Taxa_PivotTable!C144),Taxa_PivotTable!C144,\"\")","v":""},"","","",{"$f":"IF(ISNUMBER(Taxa_PivotTable!D144),Taxa_PivotTable!D144,\"\")","v":""},"","","",{"$f":"IF(ISNUMBER(Taxa_PivotTable!E144),Taxa_PivotTable!E144,\"\")","v":""},"","","",{"$f":"IF(ISNUMBER(Taxa_PivotTable!F144),Taxa_PivotTable!F144,\"\")","v":""},"","","",{"$f":"IF(ISNUMBER(Taxa_PivotTable!G144),Taxa_PivotTable!G144,\"\")","v":""},"","","",{"$f":"IF(ISNUMBER(Taxa_PivotTable!H144),Taxa_PivotTable!H144,\"\")","v":""},"","","",{"$f":"IF(ISNUMBER(Taxa_PivotTable!I145),Taxa_PivotTable!I145,\"\")","v":""},"","","",{"$f":"IF(ISNUMBER(Taxa_PivotTable!J145),Taxa_PivotTable!J145,\"\")","v":""},"","","",{"$f":"IF(ISNUMBER(Taxa_PivotTable!K145),Taxa_PivotTable!K145,\"\")","v":""},"","",""]
[{"$f":"Taxa_PivotTable!A145","v":{"$error":"#N/A"}},{"$f":"IF(Taxa_PivotTable!B145=\"\",\"\",Taxa_PivotTable!B145)","v":""},{"$f":"IF(ISNUMBER(VLOOKUP(B145,UKOptima!A:J,10,FALSE)),VLOOKUP(B145,UKOptima!A:J,10,FALSE),\"\")","v":""},{"$f":"IF(ISNUMBER(Taxa_PivotTable!C145),Taxa_PivotTable!C145,\"\")","v":""},{"$f":"IF(ISNUMBER(D145),LOG(ROUND(D145,6)),\"\")","v":""},"",{"$f":"IF(AND(ISNUMBER(D145),LEFT($B145,2)=\"01\"),D145/10^6,\"\")","v":""},{"$f":"IF(ISNUMBER(Taxa_PivotTable!D145),Taxa_PivotTable!D145,\"\")","v":""},"","","",{"$f":"IF(ISNUMBER(Taxa_PivotTable!E145),Taxa_PivotTable!E145,\"\")","v":""},"","","",{"$f":"IF(ISNUMBER(Taxa_PivotTable!F145),Taxa_PivotTable!F145,\"\")","v":""},{"$f":"IF(ISNUMBER(P145),LOG(ROUND(P145,6)),\"\")","v":""},"",{"$f":"IF(AND(ISNUMBER(P145),LEFT($B145,2)=\"01\"),P145/10^6,\"\")","v":""},{"$f":"IF(ISNUMBER(Taxa_PivotTable!G145),Taxa_PivotTable!G145,\"\")","v":""},{"$f":"IF(ISNUMBER(T145),LOG(ROUND(T145,6)),\"\")","v":""},"",{"$f":"IF(AND(ISNUMBER(T145),LEFT($B145,2)=\"01\"),T145/10^6,\"\")","v":""},{"$f":"IF(ISNUMBER(Taxa_PivotTable!H145),Taxa_PivotTable!H145,\"\")","v":""},"","",{"$f":"IF(AND(ISNUMBER(X145),LEFT($B145,2)=\"01\"),X145/10^6,\"\")","v":""},{"$f":"IF(ISNUMBER(Taxa_PivotTable!#REF!),Taxa_PivotTable!#REF!,\"\")","v":""},"","",{"$f":"IF(AND(ISNUMBER(AB145),LEFT($B145,2)=\"01\"),AB145/10^6,\"\")","v":""},{"$f":"IF(ISNUMBER(Taxa_PivotTable!#REF!),Taxa_PivotTable!#REF!,\"\")","v":""},"","",{"$f":"IF(AND(ISNUMBER(AF145),LEFT($B145,2)=\"01\"),AF145/10^6,\"\")","v":""},{"$f":"IF(ISNUMBER(Taxa_PivotTable!#REF!),Taxa_PivotTable!#REF!,\"\")","v":""},"","",{"$f":"IF(AND(ISNUMBER(AJ145),LEFT($B145,2)=\"01\"),AJ145/10^6,\"\")","v":""}]
[{"$f":"Taxa_PivotTable!A146","v":{"$error":"#N/A"}},{"$f":"IF(Taxa_PivotTable!B146=\"\",\"\",Taxa_PivotTable!B146)","v":""},{"$f":"IF(ISNUMBER(VLOOKUP(B146,UKOptima!A:J,10,FALSE)),VLOOKUP(B146,UKOptima!A:J,10,FALSE),\"\")","v":""},{"$f":"IF(ISNUMBER(Taxa_PivotTable!C146),Taxa_PivotTable!C146,\"\")","v":""},"","","",{"$f":"IF(ISNUMBER(Taxa_PivotTable!D146),Taxa_PivotTable!D146,\"\")","v":""},"","","",{"$f":"IF(ISNUMBER(Taxa_PivotTable!E146),Taxa_PivotTable!E146,\"\")","v":""},"","","",{"$f":"IF(ISNUMBER(Taxa_PivotTable!F146),Taxa_PivotTable!F146,\"\")","v":""},"","","",{"$f":"IF(ISNUMBER(Taxa_PivotTable!G146),Taxa_PivotTable!G146,\"\")","v":""},"","","",{"$f":"IF(ISNUMBER(Taxa_PivotTable!H146),Taxa_PivotTable!H146,\"\")","v":""},"","","",{"$f":"IF(ISNUMBER(Taxa_PivotTable!I146),Taxa_PivotTable!I146,\"\")","v":""},"","","",{"$f":"IF(ISNUMBER(Taxa_PivotTable!J146),Taxa_PivotTable!J146,\"\")","v":""},"","","",{"$f":"IF(ISNUMBER(Taxa_PivotTable!K146),Taxa_PivotTable!K146,\"\")","v":""},"","",""]
[{"$f":"Taxa_PivotTable!A147","v":{"$error":"#N/A"}},{"$f":"IF(Taxa_PivotTable!B147=\"\",\"\",Taxa_PivotTable!B147)","v":""},{"$f":"IF(ISNUMBER(VLOOKUP(B147,UKOptima!A:J,10,FALSE)),VLOOKUP(B147,UKOptima!A:J,10,FALSE),\"\")","v":""},{"$f":"IF(ISNUMBER(Taxa_PivotTable!C147),Taxa_PivotTable!C147,\"\")","v":""},"","","",{"$f":"IF(ISNUMBER(Taxa_PivotTable!D147),Taxa_PivotTable!D147,\"\")","v":""},"","","",{"$f":"IF(ISNUMBER(Taxa_PivotTable!E147),Taxa_PivotTable!E147,\"\")","v":""},"","","",{"$f":"IF(ISNUMBER(Taxa_PivotTable!F147),Taxa_PivotTable!F147,\"\")","v":""},"","","",{"$f":"IF(ISNUMBER(Taxa_PivotTable!G147),Taxa_PivotTable!G147,\"\")","v":""},"","","",{"$f":"IF(ISNUMBER(Taxa_PivotTable!H147),Taxa_PivotTable!H147,\"\")","v":""},"","","",{"$f":"IF(ISNUMBER(Taxa_PivotTable!I147),Taxa_PivotTable!I147,\"\")","v":""},"","","",{"$f":"IF(ISNUMBER(Taxa_PivotTable!J147),Taxa_PivotTable!J147,\"\")","v":""},"","","",{"$f":"IF(ISNUMBER(Taxa_PivotTable!K147),Taxa_PivotTable!K147,\"\")","v":""},"","",""]
[{"$f":"Taxa_PivotTable!A148","v":{"$error":"#N/A"}},{"$f":"IF(Taxa_PivotTable!B148=\"\",\"\",Taxa_PivotTable!B148)","v":""},{"$f":"IF(ISNUMBER(VLOOKUP(B148,UKOptima!A:J,10,FALSE)),VLOOKUP(B148,UKOptima!A:J,10,FALSE),\"\")","v":""},{"$f":"IF(ISNUMBER(Taxa_PivotTable!C148),Taxa_PivotTable!C148,\"\")","v":""},"","","",{"$f":"IF(ISNUMBER(Taxa_PivotTable!D148),Taxa_PivotTable!D148,\"\")","v":""},"","","",{"$f":"IF(ISNUMBER(Taxa_PivotTable!E148),Taxa_PivotTable!E148,\"\")","v":""},"","","",{"$f":"IF(ISNUMBER(Taxa_PivotTable!F148),Taxa_PivotTable!F148,\"\")","v":""},"","","",{"$f":"IF(ISNUMBER(Taxa_PivotTable!G148),Taxa_PivotTable!G148,\"\")","v":""},"","","",{"$f":"IF(ISNUMBER(Taxa_PivotTable!H148),Taxa_PivotTable!H148,\"\")","v":""},"","","",{"$f":"IF(ISNUMBER(Taxa_PivotTable!I148),Taxa_PivotTable!I148,\"\")","v":""},"","","",{"$f":"IF(ISNUMBER(Taxa_PivotTable!J148),Taxa_PivotTable!J148,\"\")","v":""},"","","",{"$f":"IF(ISNUMBER(Taxa_PivotTable!K148),Taxa_PivotTable!K148,\"\")","v":""},"","",""]
[{"$f":"Taxa_PivotTable!A149","v":{"$error":"#N/A"}},{"$f":"IF(Taxa_PivotTable!B149=\"\",\"\",Taxa_PivotTable!B149)","v":""},{"$f":"IF(ISNUMBER(VLOOKUP(B149,UKOptima!A:J,10,FALSE)),VLOOKUP(B149,UKOptima!A:J,10,FALSE),\"\")","v":""},{"$f":"IF(ISNUMBER(Taxa_PivotTable!C149),Taxa_PivotTable!C149,\"\")","v":""},"","","",{"$f":"IF(ISNUMBER(Taxa_PivotTable!D149),Taxa_PivotTable!D149,\"\")","v":""},"","","",{"$f":"IF(ISNUMBER(Taxa_PivotTable!E149),Taxa_PivotTable!E149,\"\")","v":""},"","","",{"$f":"IF(ISNUMBER(Taxa_PivotTable!F149),Taxa_PivotTable!F149,\"\")","v":""},"","","",{"$f":"IF(ISNUMBER(Taxa_PivotTable!G149),Taxa_PivotTable!G149,\"\")","v":""},"","","",{"$f":"IF(ISNUMBER(Taxa_PivotTable!H149),Taxa_PivotTable!H149,\"\")","v":""},"",{"$f":"IF(COUNT(Y149,$C149)=2,(Y149)*$C149,\"\")","v":""},"",{"$f":"IF(ISNUMBER(Taxa_PivotTable!I149),Taxa_PivotTable!I149,\"\")","v":""},"",{"$f":"IF(COUNT(AC149,$C149)=2,(AC149)*$C149,\"\")","v":""},"",{"$f":"IF(ISNUMBER(Taxa_PivotTable!J149),Taxa_PivotTable!J149,\"\")","v":""},"",{"$f":"IF(COUNT(AG149,$C149)=2,(AG149)*$C149,\"\")","v":""},"",{"$f":"IF(ISNUMBER(Taxa_PivotTable!K149),Taxa_PivotTable!K149,\"\")","v":""},"",{"$f":"IF(COUNT(AK149,$C149)=2,(AK149)*$C149,\"\")","v":""},""]
[{"$f":"Taxa_PivotTable!A150","v":{"$error":"#N/A"}},{"$f":"IF(Taxa_PivotTable!B150=\"\",\"\",Taxa_PivotTable!B150)","v":""},{"$f":"IF(ISNUMBER(VLOOKUP(B150,UKOptima!A:J,10,FALSE)),VLOOKUP(B150,UKOptima!A:J,10,FALSE),\"\")","v":""},{"$f":"IF(ISNUMBER(Taxa_PivotTable!C150),Taxa_PivotTable!C150,\"\")","v":""},"","","",{"$f":"IF(ISNUMBER(Taxa_PivotTable!D150),Taxa_PivotTable!D150,\"\")","v":""},"","","",{"$f":"IF(ISNUMBER(Taxa_PivotTable!E150),Taxa_PivotTable!E150,\"\")","v":""},"","","",{"$f":"IF(ISNUMBER(Taxa_PivotTable!F150),Taxa_PivotTable!F150,\"\")","v":""},"","","",{"$f":"IF(ISNUMBER(Taxa_PivotTable!G150),Taxa_PivotTable!G150,\"\")","v":""},"","","",{"$f":"IF(ISNUMBER(Taxa_PivotTable!H150),Taxa_PivotTable!H150,\"\")","v":""},{"$f":"IF(ISNUMBER(X150),LOG(ROUND(X150,6)),\"\")","v":""},"","",{"$f":"IF(ISNUMBER(Taxa_PivotTable!I150),Taxa_PivotTable!I150,\"\")","v":""},{"$f":"IF(ISNUMBER(AB150),LOG(ROUND(AB150,6)),\"\")","v":""},"","",{"$f":"IF(ISNUMBER(Taxa_PivotTable!J150),Taxa_PivotTable!J150,\"\")","v":""},{"$f":"IF(ISNUMBER(AF150),LOG(ROUND(AF150,6)),\"\")","v":""},"","",{"$f":"IF(ISNUMBER(Taxa_PivotTable!K150),Taxa_PivotTable!K150,\"\")","v":""},{"$f":"IF(ISNUMBER(AJ150),LOG(ROUND(AJ150,6)),\"\")","v":""},"",""]
[{"$f":"Taxa_PivotTable!A151","v":{"$error":"#N/A"}},{"$f":"IF(Taxa_PivotTable!B151=\"\",\"\",Taxa_PivotTable!B151)","v":""},{"$f":"IF(ISNUMBER(VLOOKUP(B151,UKOptima!A:J,10,FALSE)),VLOOKUP(B151,UKOptima!A:J,10,FALSE),\"\")","v":""},{"$f":"IF(ISNUMBER(Taxa_PivotTable!C151),Taxa_PivotTable!C151,\"\")","v":""},{"$f":"IF(ISNUMBER(D151),LOG(ROUND(D151,6)),\"\")","v":""},"",{"$f":"IF(AND(ISNUMBER(D151),LEFT($B151,2)=\"01\"),D151/10^6,\"\")","v":""},{"$f":"IF(ISNUMBER(Taxa_PivotTable!D151),Taxa_PivotTable!D151,\"\")","v":""},{"$f":"IF(ISNUMBER(H151),LOG(ROUND(H151,6)),\"\")","v":""},"",{"$f":"IF(AND(ISNUMBER(H151),LEFT($B151,2)=\"01\"),H151/10^6,\"\")","v":""},{"$f":"IF(ISNUMBER(Taxa_PivotTable!E151),Taxa_PivotTable!E151,\"\")","v":""},{"$f":"IF(ISNUMBER(L151),LOG(ROUND(L151,6)),\"\")","v":""},"",{"$f":"IF(AND(ISNUMBER(L151),LEFT($B151,2)=\"01\"),L151/10^6,\"\")","v":""},{"$f":"IF(ISNUMBER(Taxa_PivotTable!F151),Taxa_PivotTable!F151,\"\")","v":""},{"$f":"IF(ISNUMBER(P151),LOG(ROUND(P151,6)),\"\")","v":""},"",{"$f":"IF(AND(ISNUMBER(P151),LEFT($B151,2)=\"01\"),P151/10^6,\"\")","v":""},{"$f":"IF(ISNUMBER(Taxa_PivotTable!G151),Taxa_PivotTable!G151,\"\")","v":""},{"$f":"IF(ISNUMBER(T151),LOG(ROUND(T151,6)),\"\")","v":""},"",{"$f":"IF(AND(ISNUMBER(T151),LEFT($B151,2)=\"01\"),T151/10^6,\"\")","v":""},{"$f":"IF(ISNUMBER(Taxa_PivotTable!H151),Taxa_PivotTable!H151,\"\")","v":""},"","",{"$f":"IF(AND(ISNUMBER(X151),LEFT($B151,2)=\"01\"),X151/10^6,\"\")","v":""},{"$f":"IF(ISNUMBER(Taxa_PivotTable!I151),Taxa_PivotTable!I151,\"\")","v":""},"","",{"$f":"IF(AND(ISNUMBER(AB151),LEFT($B151,2)=\"01\"),AB151/10^6,\"\")","v":""},{"$f":"IF(ISNUMBER(Taxa_PivotTable!J151),Taxa_PivotTable!J151,\"\")","v":""},"","",{"$f":"IF(AND(ISNUMBER(AF151),LEFT($B151,2)=\"01\"),AF151/10^6,\"\")","v":""},{"$f":"IF(ISNUMBER(Taxa_PivotTable!K151),Taxa_PivotTable!K151,\"\")","v":""},"","",{"$f":"IF(AND(ISNUMBER(AJ151),LEFT($B151,2)=\"01\"),AJ151/10^6,\"\")","v":""}]
[{"$f":"Taxa_PivotTable!A152","v":{"$error":"#N/A"}},{"$f":"IF(Taxa_PivotTable!B152=\"\",\"\",Taxa_PivotTable!B152)","v":""},{"$f":"IF(ISNUMBER(VLOOKUP(B152,UKOptima!A:J,10,FALSE)),VLOOKUP(B152,UKOptima!A:J,10,FALSE),\"\")","v":""},{"$f":"IF(ISNUMBER(Taxa_PivotTable!C152),Taxa_PivotTable!C152,\"\")","v":""},"","","",{"$f":"IF(ISNUMBER(Taxa_PivotTable!D152),Taxa_PivotTable!D152,\"\")","v":""},"","","",{"$f":"IF(ISNUMBER(Taxa_PivotTable!E152),Taxa_PivotTable!E152,\"\")","v":""},"","","",{"$f":"IF(ISNUMBER(Taxa_PivotTable!F152),Taxa_PivotTable!F152,\"\")","v":""},"","","",{"$f":"IF(ISNUMBER(Taxa_PivotTable!G152),Taxa_PivotTable!G152,\"\")","v":""},"","","",{"$f":"IF(ISNUMBER(Taxa_PivotTable!H152),Taxa_PivotTable!H152,\"\")","v":""},"","","",{"$f":"IF(ISNUMBER(Taxa_PivotTable!I152),Taxa_PivotTable!I152,\"\")","v":""},"","","",{"$f":"IF(ISNUMBER(Taxa_PivotTable!J152),Taxa_PivotTable!J152,\"\")","v":""},"","","",{"$f":"IF(ISNUMBER(Taxa_PivotTable!K152),Taxa_PivotTable!K152,\"\")","v":""},"","",""]
[{"$f":"Taxa_PivotTable!A153","v":{"$error":"#N/A"}},{"$f":"IF(Taxa_PivotTable!B153=\"\",\"\",Taxa_PivotTable!B153)","v":""},{"$f":"IF(ISNUMBER(VLOOKUP(B153,UKOptima!A:J,10,FALSE)),VLOOKUP(B153,UKOptima!A:J,10,FALSE),\"\")","v":""},{"$f":"IF(ISNUMBER(Taxa_PivotTable!C153),Taxa_PivotTable!C153,\"\")","v":""},"","","",{"$f":"IF(ISNUMBER(Taxa_PivotTable!D153),Taxa_PivotTable!D153,\"\")","v":""},"","","",{"$f":"IF(ISNUMBER(Taxa_PivotTable!E153),Taxa_PivotTable!E153,\"\")","v":""},"","","",{"$f":"IF(ISNUMBER(Taxa_PivotTable!F153),Taxa_PivotTable!F153,\"\")","v":""},"","","",{"$f":"IF(ISNUMBER(Taxa_PivotTable!G153),Taxa_PivotTable!G153,\"\")","v":""},"","","",{"$f":"IF(ISNUMBER(Taxa_PivotTable!H153),Taxa_PivotTable!H153,\"\")","v":""},"","","",{"$f":"IF(ISNUMBER(Taxa_PivotTable!I153),Taxa_PivotTable!I153,\"\")","v":""},"","","",{"$f":"IF(ISNUMBER(Taxa_PivotTable!J153),Taxa_PivotTable!J153,\"\")","v":""},"","","",{"$f":"IF(ISNUMBER(Taxa_PivotTable!K153),Taxa_PivotTable!K153,\"\")","v":""},"","",""]
[{"$f":"Taxa_PivotTable!A154","v":{"$error":"#N/A"}},{"$f":"IF(Taxa_PivotTable!B154=\"\",\"\",Taxa_PivotTable!B154)","v":""},{"$f":"IF(ISNUMBER(VLOOKUP(B154,UKOptima!A:J,10,FALSE)),VLOOKUP(B154,UKOptima!A:J,10,FALSE),\"\")","v":""},{"$f":"IF(ISNUMBER(Taxa_PivotTable!C154),Taxa_PivotTable!C154,\"\")","v":""},"","","",{"$f":"IF(ISNUMBER(Taxa_PivotTable!D154),Taxa_PivotTable!D154,\"\")","v":""},"","","",{"$f":"IF(ISNUMBER(Taxa_PivotTable!E154),Taxa_PivotTable!E154,\"\")","v":""},"","","",{"$f":"IF(ISNUMBER(Taxa_PivotTable!F154),Taxa_PivotTable!F154,\"\")","v":""},"","","",{"$f":"IF(ISNUMBER(Taxa_PivotTable!G154),Taxa_PivotTable!G154,\"\")","v":""},"","","",{"$f":"IF(ISNUMBER(Taxa_PivotTable!H154),Taxa_PivotTable!H154,\"\")","v":""},"","","",{"$f":"IF(ISNUMBER(Taxa_PivotTable!I154),Taxa_PivotTable!I154,\"\")","v":""},"","","",{"$f":"IF(ISNUMBER(Taxa_PivotTable!J154),Taxa_PivotTable!J154,\"\")","v":""},"","","",{"$f":"IF(ISNUMBER(Taxa_PivotTable!K154),Taxa_PivotTable!K154,\"\")","v":""},"","",""]
[{"$f":"Taxa_PivotTable!A155","v":{"$error":"#N/A"}},{"$f":"IF(Taxa_PivotTable!B155=\"\",\"\",Taxa_PivotTable!B155)","v":""},{"$f":"IF(ISNUMBER(VLOOKUP(B155,UKOptima!A:J,10,FALSE)),VLOOKUP(B155,UKOptima!A:J,10,FALSE),\"\")","v":""},{"$f":"IF(ISNUMBER(Taxa_PivotTable!C155),Taxa_PivotTable!C155,\"\")","v":""},"","","",{"$f":"IF(ISNUMBER(Taxa_PivotTable!D155),Taxa_PivotTable!D155,\"\")","v":""},"","","",{"$f":"IF(ISNUMBER(Taxa_PivotTable!E155),Taxa_PivotTable!E155,\"\")","v":""},"","","",{"$f":"IF(ISNUMBER(Taxa_PivotTable!F155),Taxa_PivotTable!F155,\"\")","v":""},"","","",{"$f":"IF(ISNUMBER(Taxa_PivotTable!G155),Taxa_PivotTable!G155,\"\")","v":""},"","","",{"$f":"IF(ISNUMBER(Taxa_PivotTable!H155),Taxa_PivotTable!H155,\"\")","v":""},"","","",{"$f":"IF(ISNUMBER(Taxa_PivotTable!I155),Taxa_PivotTable!I155,\"\")","v":""},"","","",{"$f":"IF(ISNUMBER(Taxa_PivotTable!J155),Taxa_PivotTable!J155,\"\")","v":""},"","","",{"$f":"IF(ISNUMBER(Taxa_PivotTable!K155),Taxa_PivotTable!K155,\"\")","v":""},"","",""]
[{"$f":"Taxa_PivotTable!A156","v":{"$error":"#N/A"}},{"$f":"IF(Taxa_PivotTable!B156=\"\",\"\",Taxa_PivotTable!B156)","v":""},{"$f":"IF(ISNUMBER(VLOOKUP(B156,UKOptima!A:J,10,FALSE)),VLOOKUP(B156,UKOptima!A:J,10,FALSE),\"\")","v":""},{"$f":"IF(ISNUMBER(Taxa_PivotTable!C156),Taxa_PivotTable!C156,\"\")","v":""},"","","",{"$f":"IF(ISNUMBER(Taxa_PivotTable!D156),Taxa_PivotTable!D156,\"\")","v":""},"","","",{"$f":"IF(ISNUMBER(Taxa_PivotTable!E156),Taxa_PivotTable!E156,\"\")","v":""},"","","",{"$f":"IF(ISNUMBER(Taxa_PivotTable!F156),Taxa_PivotTable!F156,\"\")","v":""},"","","",{"$f":"IF(ISNUMBER(Taxa_PivotTable!G156),Taxa_PivotTable!G156,\"\")","v":""},"","","",{"$f":"IF(ISNUMBER(Taxa_PivotTable!H156),Taxa_PivotTable!H156,\"\")","v":""},"","","",{"$f":"IF(ISNUMBER(Taxa_PivotTable!I156),Taxa_PivotTable!I156,\"\")","v":""},"","","",{"$f":"IF(ISNUMBER(Taxa_PivotTable!J156),Taxa_PivotTable!J156,\"\")","v":""},"","","",{"$f":"IF(ISNUMBER(Taxa_PivotTable!K156),Taxa_PivotTable!K156,\"\")","v":""},"","",""]
[{"$f":"Taxa_PivotTable!A157","v":{"$error":"#N/A"}},{"$f":"IF(Taxa_PivotTable!B157=\"\",\"\",Taxa_PivotTable!B157)","v":""},{"$f":"IF(ISNUMBER(VLOOKUP(B157,UKOptima!A:J,10,FALSE)),VLOOKUP(B157,UKOptima!A:J,10,FALSE),\"\")","v":""},{"$f":"IF(ISNUMBER(Taxa_PivotTable!C157),Taxa_PivotTable!C157,\"\")","v":""},"","","",{"$f":"IF(ISNUMBER(Taxa_PivotTable!D157),Taxa_PivotTable!D157,\"\")","v":""},"","","",{"$f":"IF(ISNUMBER(Taxa_PivotTable!E157),Taxa_PivotTable!E157,\"\")","v":""},"","","",{"$f":"IF(ISNUMBER(Taxa_PivotTable!F157),Taxa_PivotTable!F157,\"\")","v":""},"","","",{"$f":"IF(ISNUMBER(Taxa_PivotTable!G157),Taxa_PivotTable!G157,\"\")","v":""},"","","",{"$f":"IF(ISNUMBER(Taxa_PivotTable!H157),Taxa_PivotTable!H157,\"\")","v":""},"","","",{"$f":"IF(ISNUMBER(Taxa_PivotTable!I157),Taxa_PivotTable!I157,\"\")","v":""},"","","",{"$f":"IF(ISNUMBER(Taxa_PivotTable!J157),Taxa_PivotTable!J157,\"\")","v":""},"","","",{"$f":"IF(ISNUMBER(Taxa_PivotTable!K157),Taxa_PivotTable!K157,\"\")","v":""},"","",""]
[{"$f":"Taxa_PivotTable!A158","v":{"$error":"#N/A"}},{"$f":"IF(Taxa_PivotTable!B158=\"\",\"\",Taxa_PivotTable!B158)","v":""},{"$f":"IF(ISNUMBER(VLOOKUP(B158,UKOptima!A:J,10,FALSE)),VLOOKUP(B158,UKOptima!A:J,10,FALSE),\"\")","v":""},{"$f":"IF(ISNUMBER(Taxa_PivotTable!C158),Taxa_PivotTable!C158,\"\")","v":""},"","","",{"$f":"IF(ISNUMBER(Taxa_PivotTable!D158),Taxa_PivotTable!D158,\"\")","v":""},"","","",{"$f":"IF(ISNUMBER(Taxa_PivotTable!E158),Taxa_PivotTable!E158,\"\")","v":""},"","","",{"$f":"IF(ISNUMBER(Taxa_PivotTable!F158),Taxa_PivotTable!F158,\"\")","v":""},"","","",{"$f":"IF(ISNUMBER(Taxa_PivotTable!G158),Taxa_PivotTable!G158,\"\")","v":""},"","","",{"$f":"IF(ISNUMBER(Taxa_PivotTable!H158),Taxa_PivotTable!H158,\"\")","v":""},"","","",{"$f":"IF(ISNUMBER(Taxa_PivotTable!I158),Taxa_PivotTable!I158,\"\")","v":""},"","","",{"$f":"IF(ISNUMBER(Taxa_PivotTable!J158),Taxa_PivotTable!J158,\"\")","v":""},"","","",{"$f":"IF(ISNUMBER(Taxa_PivotTable!K158),Taxa_PivotTable!K158,\"\")","v":""},"","",""]
[{"$f":"Taxa_PivotTable!A159","v":{"$error":"#N/A"}},{"$f":"IF(Taxa_PivotTable!B159=\"\",\"\",Taxa_PivotTable!B159)","v":""},{"$f":"IF(ISNUMBER(VLOOKUP(B159,UKOptima!A:J,10,FALSE)),VLOOKUP(B159,UKOptima!A:J,10,FALSE),\"\")","v":""},{"$f":"IF(ISNUMBER(Taxa_PivotTable!C159),Taxa_PivotTable!C159,\"\")","v":""},"","","",{"$f":"IF(ISNUMBER(Taxa_PivotTable!D159),Taxa_PivotTable!D159,\"\")","v":""},"","","",{"$f":"IF(ISNUMBER(Taxa_PivotTable!E159),Taxa_PivotTable!E159,\"\")","v":""},"","","",{"$f":"IF(ISNUMBER(Taxa_PivotTable!F159),Taxa_PivotTable!F159,\"\")","v":""},"","","",{"$f":"IF(ISNUMBER(Taxa_PivotTable!G159),Taxa_PivotTable!G159,\"\")","v":""},"","","",{"$f":"IF(ISNUMBER(Taxa_PivotTable!H159),Taxa_PivotTable!H159,\"\")","v":""},"","","",{"$f":"IF(ISNUMBER(Taxa_PivotTable!I159),Taxa_PivotTable!I159,\"\")","v":""},"","","",{"$f":"IF(ISNUMBER(Taxa_PivotTable!J159),Taxa_PivotTable!J159,\"\")","v":""},"","","",{"$f":"IF(ISNUMBER(Taxa_PivotTable!K159),Taxa_PivotTable!K159,\"\")","v":""},"","",""]
[{"$f":"Taxa_PivotTable!A160","v":{"$error":"#N/A"}},{"$f":"IF(Taxa_PivotTable!B160=\"\",\"\",Taxa_PivotTable!B160)","v":""},{"$f":"IF(ISNUMBER(VLOOKUP(B160,UKOptima!A:J,10,FALSE)),VLOOKUP(B160,UKOptima!A:J,10,FALSE),\"\")","v":""},{"$f":"IF(ISNUMBER(Taxa_PivotTable!C160),Taxa_PivotTable!C160,\"\")","v":""},"","","",{"$f":"IF(ISNUMBER(Taxa_PivotTable!D160),Taxa_PivotTable!D160,\"\")","v":""},"","","",{"$f":"IF(ISNUMBER(Taxa_PivotTable!E160),Taxa_PivotTable!E160,\"\")","v":""},"","","",{"$f":"IF(ISNUMBER(Taxa_PivotTable!F160),Taxa_PivotTable!F160,\"\")","v":""},"","","",{"$f":"IF(ISNUMBER(Taxa_PivotTable!G160),Taxa_PivotTable!G160,\"\")","v":""},"","","",{"$f":"IF(ISNUMBER(Taxa_PivotTable!H160),Taxa_PivotTable!H160,\"\")","v":""},"","","",{"$f":"IF(ISNUMBER(Taxa_PivotTable!I160),Taxa_PivotTable!I160,\"\")","v":""},"","","",{"$f":"IF(ISNUMBER(Taxa_PivotTable!J160),Taxa_PivotTable!J160,\"\")","v":""},"","","",{"$f":"IF(ISNUMBER(Taxa_PivotTable!K160),Taxa_PivotTable!K160,\"\")","v":""},"","",""]
[{"$f":"Taxa_PivotTable!A161","v":{"$error":"#N/A"}},{"$f":"IF(Taxa_PivotTable!B161=\"\",\"\",Taxa_PivotTable!B161)","v":""},{"$f":"IF(ISNUMBER(VLOOKUP(B161,UKOptima!A:J,10,FALSE)),VLOOKUP(B161,UKOptima!A:J,10,FALSE),\"\")","v":""},{"$f":"IF(ISNUMBER(Taxa_PivotTable!C161),Taxa_PivotTable!C161,\"\")","v":""},"","","",{"$f":"IF(ISNUMBER(Taxa_PivotTable!D161),Taxa_PivotTable!D161,\"\")","v":""},"","","",{"$f":"IF(ISNUMBER(Taxa_PivotTable!E161),Taxa_PivotTable!E161,\"\")","v":""},"","","",{"$f":"IF(ISNUMBER(Taxa_PivotTable!F161),Taxa_PivotTable!F161,\"\")","v":""},"","","",{"$f":"IF(ISNUMBER(Taxa_PivotTable!G161),Taxa_PivotTable!G161,\"\")","v":""},"","","",{"$f":"IF(ISNUMBER(Taxa_PivotTable!H161),Taxa_PivotTable!H161,\"\")","v":""},"","","",{"$f":"IF(ISNUMBER(Taxa_PivotTable!I161),Taxa_PivotTable!I161,\"\")","v":""},"","","",{"$f":"IF(ISNUMBER(Taxa_PivotTable!J161),Taxa_PivotTable!J161,\"\")","v":""},"","","",{"$f":"IF(ISNUMBER(Taxa_PivotTable!K161),Taxa_PivotTable!K161,\"\")","v":""},"","",""]
[{"$f":"Taxa_PivotTable!A162","v":{"$error":"#N/A"}},{"$f":"IF(Taxa_PivotTable!B162=\"\",\"\",Taxa_PivotTable!B162)","v":""},{"$f":"IF(ISNUMBER(VLOOKUP(B162,UKOptima!A:J,10,FALSE)),VLOOKUP(B162,UKOptima!A:J,10,FALSE),\"\")","v":""},{"$f":"IF(ISNUMBER(Taxa_PivotTable!C162),Taxa_PivotTable!C162,\"\")","v":""},"","","",{"$f":"IF(ISNUMBER(Taxa_PivotTable!D162),Taxa_PivotTable!D162,\"\")","v":""},"","","",{"$f":"IF(ISNUMBER(Taxa_PivotTable!E162),Taxa_PivotTable!E162,\"\")","v":""},"","","",{"$f":"IF(ISNUMBER(Taxa_PivotTable!F162),Taxa_PivotTable!F162,\"\")","v":""},"","","",{"$f":"IF(ISNUMBER(Taxa_PivotTable!G162),Taxa_PivotTable!G162,\"\")","v":""},"","","",{"$f":"IF(ISNUMBER(Taxa_PivotTable!H162),Taxa_PivotTable!H162,\"\")","v":""},"","","",{"$f":"IF(ISNUMBER(Taxa_PivotTable!I162),Taxa_PivotTable!I162,\"\")","v":""},"","","",{"$f":"IF(ISNUMBER(Taxa_PivotTable!J162),Taxa_PivotTable!J162,\"\")","v":""},"","","",{"$f":"IF(ISNUMBER(Taxa_PivotTable!K162),Taxa_PivotTable!K162,\"\")","v":""},"","",""]
[{"$f":"Taxa_PivotTable!A163","v":{"$error":"#N/A"}},{"$f":"IF(Taxa_PivotTable!B163=\"\",\"\",Taxa_PivotTable!B163)","v":""},{"$f":"IF(ISNUMBER(VLOOKUP(B163,UKOptima!A:J,10,FALSE)),VLOOKUP(B163,UKOptima!A:J,10,FALSE),\"\")","v":""},{"$f":"IF(ISNUMBER(Taxa_PivotTable!C163),Taxa_PivotTable!C163,\"\")","v":""},"","","",{"$f":"IF(ISNUMBER(Taxa_PivotTable!D163),Taxa_PivotTable!D163,\"\")","v":""},"","","",{"$f":"IF(ISNUMBER(Taxa_PivotTable!E163),Taxa_PivotTable!E163,\"\")","v":""},"","","",{"$f":"IF(ISNUMBER(Taxa_PivotTable!F163),Taxa_PivotTable!F163,\"\")","v":""},"","","",{"$f":"IF(ISNUMBER(Taxa_PivotTable!G163),Taxa_PivotTable!G163,\"\")","v":""},"","","",{"$f":"IF(ISNUMBER(Taxa_PivotTable!H163),Taxa_PivotTable!H163,\"\")","v":""},"","","",{"$f":"IF(ISNUMBER(Taxa_PivotTable!I163),Taxa_PivotTable!I163,\"\")","v":""},"","","",{"$f":"IF(ISNUMBER(Taxa_PivotTable!J163),Taxa_PivotTable!J163,\"\")","v":""},"","","",{"$f":"IF(ISNUMBER(Taxa_PivotTable!K163),Taxa_PivotTable!K163,\"\")","v":""},"","",""]
[{"$f":"Taxa_PivotTable!A164","v":{"$error":"#N/A"}},{"$f":"IF(Taxa_PivotTable!B164=\"\",\"\",Taxa_PivotTable!B164)","v":""},{"$f":"IF(ISNUMBER(VLOOKUP(B164,UKOptima!A:J,10,FALSE)),VLOOKUP(B164,UKOptima!A:J,10,FALSE),\"\")","v":""},{"$f":"IF(ISNUMBER(Taxa_PivotTable!C164),Taxa_PivotTable!C164,\"\")","v":""},"","","",{"$f":"IF(ISNUMBER(Taxa_PivotTable!D164),Taxa_PivotTable!D164,\"\")","v":""},"","","",{"$f":"IF(ISNUMBER(Taxa_PivotTable!E164),Taxa_PivotTable!E164,\"\")","v":""},"","","",{"$f":"IF(ISNUMBER(Taxa_PivotTable!F164),Taxa_PivotTable!F164,\"\")","v":""},"","","",{"$f":"IF(ISNUMBER(Taxa_PivotTable!G164),Taxa_PivotTable!G164,\"\")","v":""},"","","",{"$f":"IF(ISNUMBER(Taxa_PivotTable!H164),Taxa_PivotTable!H164,\"\")","v":""},"","","",{"$f":"IF(ISNUMBER(Taxa_PivotTable!I164),Taxa_PivotTable!I164,\"\")","v":""},"","","",{"$f":"IF(ISNUMBER(Taxa_PivotTable!J164),Taxa_PivotTable!J164,\"\")","v":""},"","","",{"$f":"IF(ISNUMBER(Taxa_PivotTable!K164),Taxa_PivotTable!K164,\"\")","v":""},"","",""]
[{"$f":"Taxa_PivotTable!A165","v":{"$error":"#N/A"}},{"$f":"IF(Taxa_PivotTable!B165=\"\",\"\",Taxa_PivotTable!B165)","v":""},{"$f":"IF(ISNUMBER(VLOOKUP(B165,UKOptima!A:J,10,FALSE)),VLOOKUP(B165,UKOptima!A:J,10,FALSE),\"\")","v":""},{"$f":"IF(ISNUMBER(Taxa_PivotTable!C165),Taxa_PivotTable!C165,\"\")","v":""},"","","",{"$f":"IF(ISNUMBER(Taxa_PivotTable!D165),Taxa_PivotTable!D165,\"\")","v":""},"","","",{"$f":"IF(ISNUMBER(Taxa_PivotTable!E165),Taxa_PivotTable!E165,\"\")","v":""},"","","",{"$f":"IF(ISNUMBER(Taxa_PivotTable!F165),Taxa_PivotTable!F165,\"\")","v":""},"","","",{"$f":"IF(ISNUMBER(Taxa_PivotTable!G165),Taxa_PivotTable!G165,\"\")","v":""},"","","",{"$f":"IF(ISNUMBER(Taxa_PivotTable!H165),Taxa_PivotTable!H165,\"\")","v":""},"","","",{"$f":"IF(ISNUMBER(Taxa_PivotTable!I165),Taxa_PivotTable!I165,\"\")","v":""},"","","",{"$f":"IF(ISNUMBER(Taxa_PivotTable!J165),Taxa_PivotTable!J165,\"\")","v":""},"","","",{"$f":"IF(ISNUMBER(Taxa_PivotTable!K165),Taxa_PivotTable!K165,\"\")","v":""},"","",""]
[{"$f":"Taxa_PivotTable!A166","v":{"$error":"#N/A"}},{"$f":"IF(Taxa_PivotTable!B166=\"\",\"\",Taxa_PivotTable!B166)","v":""},{"$f":"IF(ISNUMBER(VLOOKUP(B166,UKOptima!A:J,10,FALSE)),VLOOKUP(B166,UKOptima!A:J,10,FALSE),\"\")","v":""},{"$f":"IF(ISNUMBER(Taxa_PivotTable!C166),Taxa_PivotTable!C166,\"\")","v":""},"","","",{"$f":"IF(ISNUMBER(Taxa_PivotTable!D166),Taxa_PivotTable!D166,\"\")","v":""},"","","",{"$f":"IF(ISNUMBER(Taxa_PivotTable!E166),Taxa_PivotTable!E166,\"\")","v":""},"","","",{"$f":"IF(ISNUMBER(Taxa_PivotTable!F166),Taxa_PivotTable!F166,\"\")","v":""},"","","",{"$f":"IF(ISNUMBER(Taxa_PivotTable!G166),Taxa_PivotTable!G166,\"\")","v":""},"","","",{"$f":"IF(ISNUMBER(Taxa_PivotTable!H166),Taxa_PivotTable!H166,\"\")","v":""},"","","",{"$f":"IF(ISNUMBER(Taxa_PivotTable!I166),Taxa_PivotTable!I166,\"\")","v":""},"","","",{"$f":"IF(ISNUMBER(Taxa_PivotTable!J166),Taxa_PivotTable!J166,\"\")","v":""},"","","",{"$f":"IF(ISNUMBER(Taxa_PivotTable!K166),Taxa_PivotTable!K166,\"\")","v":""},"","",""]
[{"$f":"Taxa_PivotTable!A167","v":{"$error":"#N/A"}},{"$f":"IF(Taxa_PivotTable!B167=\"\",\"\",Taxa_PivotTable!B167)","v":""},{"$f":"IF(ISNUMBER(VLOOKUP(B167,UKOptima!A:J,10,FALSE)),VLOOKUP(B167,UKOptima!A:J,10,FALSE),\"\")","v":""},{"$f":"IF(ISNUMBER(Taxa_PivotTable!C167),Taxa_PivotTable!C167,\"\")","v":""},"","","",{"$f":"IF(ISNUMBER(Taxa_PivotTable!D167),Taxa_PivotTable!D167,\"\")","v":""},"","","",{"$f":"IF(ISNUMBER(Taxa_PivotTable!E167),Taxa_PivotTable!E167,\"\")","v":""},"","","",{"$f":"IF(ISNUMBER(Taxa_PivotTable!F167),Taxa_PivotTable!F167,\"\")","v":""},"","","",{"$f":"IF(ISNUMBER(Taxa_PivotTable!G167),Taxa_PivotTable!G167,\"\")","v":""},"","","",{"$f":"IF(ISNUMBER(Taxa_PivotTable!H167),Taxa_PivotTable!H167,\"\")","v":""},"","","",{"$f":"IF(ISNUMBER(Taxa_PivotTable!I167),Taxa_PivotTable!I167,\"\")","v":""},"","","",{"$f":"IF(ISNUMBER(Taxa_PivotTable!J167),Taxa_PivotTable!J167,\"\")","v":""},"","","",{"$f":"IF(ISNUMBER(Taxa_PivotTable!K167),Taxa_PivotTable!K167,\"\")","v":""},"","",""]
[{"$f":"Taxa_PivotTable!A168","v":{"$error":"#N/A"}},{"$f":"IF(Taxa_PivotTable!B168=\"\",\"\",Taxa_PivotTable!B168)","v":""},{"$f":"IF(ISNUMBER(VLOOKUP(B168,UKOptima!A:J,10,FALSE)),VLOOKUP(B168,UKOptima!A:J,10,FALSE),\"\")","v":""},{"$f":"IF(ISNUMBER(Taxa_PivotTable!C168),Taxa_PivotTable!C168,\"\")","v":""},"","","",{"$f":"IF(ISNUMBER(Taxa_PivotTable!D168),Taxa_PivotTable!D168,\"\")","v":""},"","","",{"$f":"IF(ISNUMBER(Taxa_PivotTable!E168),Taxa_PivotTable!E168,\"\")","v":""},"","","",{"$f":"IF(ISNUMBER(Taxa_PivotTable!F168),Taxa_PivotTable!F168,\"\")","v":""},"","","",{"$f":"IF(ISNUMBER(Taxa_PivotTable!G168),Taxa_PivotTable!G168,\"\")","v":""},"","","",{"$f":"IF(ISNUMBER(Taxa_PivotTable!H168),Taxa_PivotTable!H168,\"\")","v":""},"","","",{"$f":"IF(ISNUMBER(Taxa_PivotTable!I168),Taxa_PivotTable!I168,\"\")","v":""},"","","",{"$f":"IF(ISNUMBER(Taxa_PivotTable!J168),Taxa_PivotTable!J168,\"\")","v":""},"","","",{"$f":"IF(ISNUMBER(Taxa_PivotTable!K168),Taxa_PivotTable!K168,\"\")","v":""},"","",""]
[{"$f":"Taxa_PivotTable!A169","v":{"$error":"#N/A"}},{"$f":"IF(Taxa_PivotTable!B169=\"\",\"\",Taxa_PivotTable!B169)","v":""},{"$f":"IF(ISNUMBER(VLOOKUP(B169,UKOptima!A:J,10,FALSE)),VLOOKUP(B169,UKOptima!A:J,10,FALSE),\"\")","v":""},{"$f":"IF(ISNUMBER(Taxa_PivotTable!C169),Taxa_PivotTable!C169,\"\")","v":""},"","","",{"$f":"IF(ISNUMBER(Taxa_PivotTable!D169),Taxa_PivotTable!D169,\"\")","v":""},"","","",{"$f":"IF(ISNUMBER(Taxa_PivotTable!E169),Taxa_PivotTable!E169,\"\")","v":""},"","","",{"$f":"IF(ISNUMBER(Taxa_PivotTable!F169),Taxa_PivotTable!F169,\"\")","v":""},"","","",{"$f":"IF(ISNUMBER(Taxa_PivotTable!G169),Taxa_PivotTable!G169,\"\")","v":""},"","","",{"$f":"IF(ISNUMBER(Taxa_PivotTable!H169),Taxa_PivotTable!H169,\"\")","v":""},"","","",{"$f":"IF(ISNUMBER(Taxa_PivotTable!I169),Taxa_PivotTable!I169,\"\")","v":""},"","","",{"$f":"IF(ISNUMBER(Taxa_PivotTable!J169),Taxa_PivotTable!J169,\"\")","v":""},"","","",{"$f":"IF(ISNUMBER(Taxa_PivotTable!K169),Taxa_PivotTable!K169,\"\")","v":""},"","",""]
[{"$f":"Taxa_PivotTable!A170","v":{"$error":"#N/A"}},{"$f":"IF(Taxa_PivotTable!B170=\"\",\"\",Taxa_PivotTable!B170)","v":""},{"$f":"IF(ISNUMBER(VLOOKUP(B170,UKOptima!A:J,10,FALSE)),VLOOKUP(B170,UKOptima!A:J,10,FALSE),\"\")","v":""},{"$f":"IF(ISNUMBER(Taxa_PivotTable!C170),Taxa_PivotTable!C170,\"\")","v":""},"","","",{"$f":"IF(ISNUMBER(Taxa_PivotTable!D170),Taxa_PivotTable!D170,\"\")","v":""},"","","",{"$f":"IF(ISNUMBER(Taxa_PivotTable!E170),Taxa_PivotTable!E170,\"\")","v":""},"","","",{"$f":"IF(ISNUMBER(Taxa_PivotTable!F170),Taxa_PivotTable!F170,\"\")","v":""},"","","",{"$f":"IF(ISNUMBER(Taxa_PivotTable!G170),Taxa_PivotTable!G170,\"\")","v":""},"","","",{"$f":"IF(ISNUMBER(Taxa_PivotTable!H170),Taxa_PivotTable!H170,\"\")","v":""},"","","",{"$f":"IF(ISNUMBER(Taxa_PivotTable!I170),Taxa_PivotTable!I170,\"\")","v":""},"","","",{"$f":"IF(ISNUMBER(Taxa_PivotTable!J170),Taxa_PivotTable!J170,\"\")","v":""},"","","",{"$f":"IF(ISNUMBER(Taxa_PivotTable!K170),Taxa_PivotTable!K170,\"\")","v":""},"","",""]
[{"$f":"Taxa_PivotTable!A171","v":{"$error":"#N/A"}},{"$f":"IF(Taxa_PivotTable!B171=\"\",\"\",Taxa_PivotTable!B171)","v":""},{"$f":"IF(ISNUMBER(VLOOKUP(B171,UKOptima!A:J,10,FALSE)),VLOOKUP(B171,UKOptima!A:J,10,FALSE),\"\")","v":""},{"$f":"IF(ISNUMBER(Taxa_PivotTable!C171),Taxa_PivotTable!C171,\"\")","v":""},"","","",{"$f":"IF(ISNUMBER(Taxa_PivotTable!D171),Taxa_PivotTable!D171,\"\")","v":""},"","","",{"$f":"IF(ISNUMBER(Taxa_PivotTable!E171),Taxa_PivotTable!E171,\"\")","v":""},"","","",{"$f":"IF(ISNUMBER(Taxa_PivotTable!F171),Taxa_PivotTable!F171,\"\")","v":""},"","","",{"$f":"IF(ISNUMBER(Taxa_PivotTable!G171),Taxa_PivotTable!G171,\"\")","v":""},"","","",{"$f":"IF(ISNUMBER(Taxa_PivotTable!H171),Taxa_PivotTable!H171,\"\")","v":""},"","","",{"$f":"IF(ISNUMBER(Taxa_PivotTable!I171),Taxa_PivotTable!I171,\"\")","v":""},"","","",{"$f":"IF(ISNUMBER(Taxa_PivotTable!J171),Taxa_PivotTable!J171,\"\")","v":""},"","","",{"$f":"IF(ISNUMBER(Taxa_PivotTable!K171),Taxa_PivotTable!K171,\"\")","v":""},"","",""]
[{"$f":"Taxa_PivotTable!A172","v":{"$error":"#N/A"}},{"$f":"IF(Taxa_PivotTable!B172=\"\",\"\",Taxa_PivotTable!B172)","v":""},{"$f":"IF(ISNUMBER(VLOOKUP(B172,UKOptima!A:J,10,FALSE)),VLOOKUP(B172,UKOptima!A:J,10,FALSE),\"\")","v":""},{"$f":"IF(ISNUMBER(Taxa_PivotTable!C172),Taxa_PivotTable!C172,\"\")","v":""},"","","",{"$f":"IF(ISNUMBER(Taxa_PivotTable!D172),Taxa_PivotTable!D172,\"\")","v":""},"","","",{"$f":"IF(ISNUMBER(Taxa_PivotTable!E172),Taxa_PivotTable!E172,\"\")","v":""},"","","",{"$f":"IF(ISNUMBER(Taxa_PivotTable!F172),Taxa_PivotTable!F172,\"\")","v":""},"","","",{"$f":"IF(ISNUMBER(Taxa_PivotTable!G172),Taxa_PivotTable!G172,\"\")","v":""},"","","",{"$f":"IF(ISNUMBER(Taxa_PivotTable!H172),Taxa_PivotTable!H172,\"\")","v":""},"","","",{"$f":"IF(ISNUMBER(Taxa_PivotTable!I172),Taxa_PivotTable!I172,\"\")","v":""},"","","",{"$f":"IF(ISNUMBER(Taxa_PivotTable!J172),Taxa_PivotTable!J172,\"\")","v":""},"","","",{"$f":"IF(ISNUMBER(Taxa_PivotTable!K172),Taxa_PivotTable!K172,\"\")","v":""},"","",""]
[{"$f":"Taxa_PivotTable!A173","v":{"$error":"#N/A"}},{"$f":"IF(Taxa_PivotTable!B173=\"\",\"\",Taxa_PivotTable!B173)","v":""},{"$f":"IF(ISNUMBER(VLOOKUP(B173,UKOptima!A:J,10,FALSE)),VLOOKUP(B173,UKOptima!A:J,10,FALSE),\"\")","v":""},{"$f":"IF(ISNUMBER(Taxa_PivotTable!C173),Taxa_PivotTable!C173,\"\")","v":""},"","","",{"$f":"IF(ISNUMBER(Taxa_PivotTable!D173),Taxa_PivotTable!D173,\"\")","v":""},"","","",{"$f":"IF(ISNUMBER(Taxa_PivotTable!E173),Taxa_PivotTable!E173,\"\")","v":""},"","","",{"$f":"IF(ISNUMBER(Taxa_PivotTable!F173),Taxa_PivotTable!F173,\"\")","v":""},"","","",{"$f":"IF(ISNUMBER(Taxa_PivotTable!G173),Taxa_PivotTable!G173,\"\")","v":""},"","","",{"$f":"IF(ISNUMBER(Taxa_PivotTable!H173),Taxa_PivotTable!H173,\"\")","v":""},"","","",{"$f":"IF(ISNUMBER(Taxa_PivotTable!I173),Taxa_PivotTable!I173,\"\")","v":""},"","","",{"$f":"IF(ISNUMBER(Taxa_PivotTable!J173),Taxa_PivotTable!J173,\"\")","v":""},"","","",{"$f":"IF(ISNUMBER(Taxa_PivotTable!K173),Taxa_PivotTable!K173,\"\")","v":""},"","",""]
[{"$f":"Taxa_PivotTable!A174","v":{"$error":"#N/A"}},{"$f":"IF(Taxa_PivotTable!B174=\"\",\"\",Taxa_PivotTable!B174)","v":""},{"$f":"IF(ISNUMBER(VLOOKUP(B174,UKOptima!A:J,10,FALSE)),VLOOKUP(B174,UKOptima!A:J,10,FALSE),\"\")","v":""},{"$f":"IF(ISNUMBER(Taxa_PivotTable!C174),Taxa_PivotTable!C174,\"\")","v":""},"","","",{"$f":"IF(ISNUMBER(Taxa_PivotTable!D174),Taxa_PivotTable!D174,\"\")","v":""},"","","",{"$f":"IF(ISNUMBER(Taxa_PivotTable!E174),Taxa_PivotTable!E174,\"\")","v":""},"","","",{"$f":"IF(ISNUMBER(Taxa_PivotTable!F174),Taxa_PivotTable!F174,\"\")","v":""},"","","",{"$f":"IF(ISNUMBER(Taxa_PivotTable!G174),Taxa_PivotTable!G174,\"\")","v":""},"","","",{"$f":"IF(ISNUMBER(Taxa_PivotTable!H174),Taxa_PivotTable!H174,\"\")","v":""},"","","",{"$f":"IF(ISNUMBER(Taxa_PivotTable!I174),Taxa_PivotTable!I174,\"\")","v":""},"","","",{"$f":"IF(ISNUMBER(Taxa_PivotTable!J174),Taxa_PivotTable!J174,\"\")","v":""},"","","",{"$f":"IF(ISNUMBER(Taxa_PivotTable!K174),Taxa_PivotTable!K174,\"\")","v":""},"","",""]
[{"$f":"Taxa_PivotTable!A175","v":{"$error":"#N/A"}},{"$f":"IF(Taxa_PivotTable!B175=\"\",\"\",Taxa_PivotTable!B175)","v":""},{"$f":"IF(ISNUMBER(VLOOKUP(B175,UKOptima!A:J,10,FALSE)),VLOOKUP(B175,UKOptima!A:J,10,FALSE),\"\")","v":""},{"$f":"IF(ISNUMBER(Taxa_PivotTable!C175),Taxa_PivotTable!C175,\"\")","v":""},"","","",{"$f":"IF(ISNUMBER(Taxa_PivotTable!D175),Taxa_PivotTable!D175,\"\")","v":""},"","","",{"$f":"IF(ISNUMBER(Taxa_PivotTable!E175),Taxa_PivotTable!E175,\"\")","v":""},"","","",{"$f":"IF(ISNUMBER(Taxa_PivotTable!F175),Taxa_PivotTable!F175,\"\")","v":""},"","","",{"$f":"IF(ISNUMBER(Taxa_PivotTable!G175),Taxa_PivotTable!G175,\"\")","v":""},"","","",{"$f":"IF(ISNUMBER(Taxa_PivotTable!H175),Taxa_PivotTable!H175,\"\")","v":""},"","","",{"$f":"IF(ISNUMBER(Taxa_PivotTable!I175),Taxa_PivotTable!I175,\"\")","v":""},"","","",{"$f":"IF(ISNUMBER(Taxa_PivotTable!J175),Taxa_PivotTable!J175,\"\")","v":""},"","","",{"$f":"IF(ISNUMBER(Taxa_PivotTable!K175),Taxa_PivotTable!K175,\"\")","v":""},"","",""]
[{"$f":"Taxa_PivotTable!A176","v":{"$error":"#N/A"}},{"$f":"IF(Taxa_PivotTable!B176=\"\",\"\",Taxa_PivotTable!B176)","v":""},{"$f":"IF(ISNUMBER(VLOOKUP(B176,UKOptima!A:J,10,FALSE)),VLOOKUP(B176,UKOptima!A:J,10,FALSE),\"\")","v":""},{"$f":"IF(ISNUMBER(Taxa_PivotTable!C176),Taxa_PivotTable!C176,\"\")","v":""},"","","",{"$f":"IF(ISNUMBER(Taxa_PivotTable!D176),Taxa_PivotTable!D176,\"\")","v":""},"","","",{"$f":"IF(ISNUMBER(Taxa_PivotTable!E176),Taxa_PivotTable!E176,\"\")","v":""},"","","",{"$f":"IF(ISNUMBER(Taxa_PivotTable!F176),Taxa_PivotTable!F176,\"\")","v":""},"","","",{"$f":"IF(ISNUMBER(Taxa_PivotTable!G176),Taxa_PivotTable!G176,\"\")","v":""},"","","",{"$f":"IF(ISNUMBER(Taxa_PivotTable!H176),Taxa_PivotTable!H176,\"\")","v":""},"","","",{"$f":"IF(ISNUMBER(Taxa_PivotTable!I176),Taxa_PivotTable!I176,\"\")","v":""},"","","",{"$f":"IF(ISNUMBER(Taxa_PivotTable!J176),Taxa_PivotTable!J176,\"\")","v":""},"","","",{"$f":"IF(ISNUMBER(Taxa_PivotTable!K176),Taxa_PivotTable!K176,\"\")","v":""},"","",""]
[{"$f":"Taxa_PivotTable!A177","v":{"$error":"#N/A"}},{"$f":"IF(Taxa_PivotTable!B177=\"\",\"\",Taxa_PivotTable!B177)","v":""},{"$f":"IF(ISNUMBER(VLOOKUP(B177,UKOptima!A:J,10,FALSE)),VLOOKUP(B177,UKOptima!A:J,10,FALSE),\"\")","v":""},{"$f":"IF(ISNUMBER(Taxa_PivotTable!C177),Taxa_PivotTable!C177,\"\")","v":""},"","","",{"$f":"IF(ISNUMBER(Taxa_PivotTable!D177),Taxa_PivotTable!D177,\"\")","v":""},"","","",{"$f":"IF(ISNUMBER(Taxa_PivotTable!E177),Taxa_PivotTable!E177,\"\")","v":""},"","","",{"$f":"IF(ISNUMBER(Taxa_PivotTable!F177),Taxa_PivotTable!F177,\"\")","v":""},"","","",{"$f":"IF(ISNUMBER(Taxa_PivotTable!G177),Taxa_PivotTable!G177,\"\")","v":""},"","","",{"$f":"IF(ISNUMBER(Taxa_PivotTable!H177),Taxa_PivotTable!H177,\"\")","v":""},"","","",{"$f":"IF(ISNUMBER(Taxa_PivotTable!I177),Taxa_PivotTable!I177,\"\")","v":""},"","","",{"$f":"IF(ISNUMBER(Taxa_PivotTable!J177),Taxa_PivotTable!J177,\"\")","v":""},"","","",{"$f":"IF(ISNUMBER(Taxa_PivotTable!K177),Taxa_PivotTable!K177,\"\")","v":""},"","",""]
[{"$f":"Taxa_PivotTable!A178","v":{"$error":"#N/A"}},{"$f":"IF(Taxa_PivotTable!B178=\"\",\"\",Taxa_PivotTable!B178)","v":""},{"$f":"IF(ISNUMBER(VLOOKUP(B178,UKOptima!A:J,10,FALSE)),VLOOKUP(B178,UKOptima!A:J,10,FALSE),\"\")","v":""},{"$f":"IF(ISNUMBER(Taxa_PivotTable!C178),Taxa_PivotTable!C178,\"\")","v":""},"","","",{"$f":"IF(ISNUMBER(Taxa_PivotTable!D178),Taxa_PivotTable!D178,\"\")","v":""},"","","",{"$f":"IF(ISNUMBER(Taxa_PivotTable!E178),Taxa_PivotTable!E178,\"\")","v":""},"","","",{"$f":"IF(ISNUMBER(Taxa_PivotTable!F178),Taxa_PivotTable!F178,\"\")","v":""},"","","",{"$f":"IF(ISNUMBER(Taxa_PivotTable!G178),Taxa_PivotTable!G178,\"\")","v":""},"","","",{"$f":"IF(ISNUMBER(Taxa_PivotTable!H178),Taxa_PivotTable!H178,\"\")","v":""},"","","",{"$f":"IF(ISNUMBER(Taxa_PivotTable!I178),Taxa_PivotTable!I178,\"\")","v":""},"","","",{"$f":"IF(ISNUMBER(Taxa_PivotTable!J178),Taxa_PivotTable!J178,\"\")","v":""},"","","",{"$f":"IF(ISNUMBER(Taxa_PivotTable!K178),Taxa_PivotTable!K178,\"\")","v":""},"","",""]
[{"$f":"Taxa_PivotTable!A179","v":{"$error":"#N/A"}},{"$f":"IF(Taxa_PivotTable!B179=\"\",\"\",Taxa_PivotTable!B179)","v":""},{"$f":"IF(ISNUMBER(VLOOKUP(B179,UKOptima!A:J,10,FALSE)),VLOOKUP(B179,UKOptima!A:J,10,FALSE),\"\")","v":""},{"$f":"IF(ISNUMBER(Taxa_PivotTable!C179),Taxa_PivotTable!C179,\"\")","v":""},"","","",{"$f":"IF(ISNUMBER(Taxa_PivotTable!D179),Taxa_PivotTable!D179,\"\")","v":""},"","","",{"$f":"IF(ISNUMBER(Taxa_PivotTable!E179),Taxa_PivotTable!E179,\"\")","v":""},"","","",{"$f":"IF(ISNUMBER(Taxa_PivotTable!F179),Taxa_PivotTable!F179,\"\")","v":""},"","","",{"$f":"IF(ISNUMBER(Taxa_PivotTable!G179),Taxa_PivotTable!G179,\"\")","v":""},"","","",{"$f":"IF(ISNUMBER(Taxa_PivotTable!H179),Taxa_PivotTable!H179,\"\")","v":""},"","","",{"$f":"IF(ISNUMBER(Taxa_PivotTable!I179),Taxa_PivotTable!I179,\"\")","v":""},"","","",{"$f":"IF(ISNUMBER(Taxa_PivotTable!J179),Taxa_PivotTable!J179,\"\")","v":""},"","","",{"$f":"IF(ISNUMBER(Taxa_PivotTable!K179),Taxa_PivotTable!K179,\"\")","v":""},"","",""]
[{"$f":"Taxa_PivotTable!A180","v":{"$error":"#N/A"}},{"$f":"IF(Taxa_PivotTable!B180=\"\",\"\",Taxa_PivotTable!B180)","v":""},{"$f":"IF(ISNUMBER(VLOOKUP(B180,UKOptima!A:J,10,FALSE)),VLOOKUP(B180,UKOptima!A:J,10,FALSE),\"\")","v":""},{"$f":"IF(ISNUMBER(Taxa_PivotTable!C180),Taxa_PivotTable!C180,\"\")","v":""},"","","",{"$f":"IF(ISNUMBER(Taxa_PivotTable!D180),Taxa_PivotTable!D180,\"\")","v":""},"","","",{"$f":"IF(ISNUMBER(Taxa_PivotTable!E180),Taxa_PivotTable!E180,\"\")","v":""},"","","",{"$f":"IF(ISNUMBER(Taxa_PivotTable!F180),Taxa_PivotTable!F180,\"\")","v":""},"","","",{"$f":"IF(ISNUMBER(Taxa_PivotTable!G180),Taxa_PivotTable!G180,\"\")","v":""},"","","",{"$f":"IF(ISNUMBER(Taxa_PivotTable!H180),Taxa_PivotTable!H180,\"\")","v":""},"","","",{"$f":"IF(ISNUMBER(Taxa_PivotTable!I180),Taxa_PivotTable!I180,\"\")","v":""},"","","",{"$f":"IF(ISNUMBER(Taxa_PivotTable!J180),Taxa_PivotTable!J180,\"\")","v":""},"","","",{"$f":"IF(ISNUMBER(Taxa_PivotTable!K180),Taxa_PivotTable!K180,\"\")","v":""},"","",""]
[{"$f":"Taxa_PivotTable!A181","v":{"$error":"#N/A"}},{"$f":"IF(Taxa_PivotTable!B181=\"\",\"\",Taxa_PivotTable!B181)","v":""},{"$f":"IF(ISNUMBER(VLOOKUP(B181,UKOptima!A:J,10,FALSE)),VLOOKUP(B181,UKOptima!A:J,10,FALSE),\"\")","v":""},{"$f":"IF(ISNUMBER(Taxa_PivotTable!C181),Taxa_PivotTable!C181,\"\")","v":""},"",{"$f":"IF(COUNT(E181,$C181)=2,(E181)*$C181,\"\")","v":""},"",{"$f":"IF(ISNUMBER(Taxa_PivotTable!D181),Taxa_PivotTable!D181,\"\")","v":""},"",{"$f":"IF(COUNT(I181,$C181)=2,(I181)*$C181,\"\")","v":""},"",{"$f":"IF(ISNUMBER(Taxa_PivotTable!E181),Taxa_PivotTable!E181,\"\")","v":""},"",{"$f":"IF(COUNT(M181,$C181)=2,(M181)*$C181,\"\")","v":""},"",{"$f":"IF(ISNUMBER(Taxa_PivotTable!F181),Taxa_PivotTable!F181,\"\")","v":""},"",{"$f":"IF(COUNT(Q181,$C181)=2,(Q181)*$C181,\"\")","v":""},"",{"$f":"IF(ISNUMBER(Taxa_PivotTable!G181),Taxa_PivotTable!G181,\"\")","v":""},"",{"$f":"IF(COUNT(U181,$C181)=2,(U181)*$C181,\"\")","v":""},"",{"$f":"IF(ISNUMBER(Taxa_PivotTable!H181),Taxa_PivotTable!H181,\"\")","v":""},"","","",{"$f":"IF(ISNUMBER(Taxa_PivotTable!I181),Taxa_PivotTable!I181,\"\")","v":""},"","","",{"$f":"IF(ISNUMBER(Taxa_PivotTable!J181),Taxa_PivotTable!J181,\"\")","v":""},"","","",{"$f":"IF(ISNUMBER(Taxa_PivotTable!K181),Taxa_PivotTable!K181,\"\")","v":""},"","",""]
[{"$f":"Taxa_PivotTable!A182","v":{"$error":"#N/A"}},{"$f":"IF(Taxa_PivotTable!B182=\"\",\"\",Taxa_PivotTable!B182)","v":""},{"$f":"IF(ISNUMBER(VLOOKUP(B182,UKOptima!A:J,10,FALSE)),VLOOKUP(B182,UKOptima!A:J,10,FALSE),\"\")","v":""},{"$f":"IF(ISNUMBER(Taxa_PivotTable!C182),Taxa_PivotTable!C182,\"\")","v":""},"","","",{"$f":"IF(ISNUMBER(Taxa_PivotTable!D182),Taxa_PivotTable!D182,\"\")","v":""},"","","",{"$f":"IF(ISNUMBER(Taxa_PivotTable!E182),Taxa_PivotTable!E182,\"\")","v":""},"","","",{"$f":"IF(ISNUMBER(Taxa_PivotTable!F182),Taxa_PivotTable!F182,\"\")","v":""},"","","",{"$f":"IF(ISNUMBER(Taxa_PivotTable!G182),Taxa_PivotTable!G182,\"\")","v":""},"","","",{"$f":"IF(ISNUMBER(Taxa_PivotTable!H182),Taxa_PivotTable!H182,\"\")","v":""},"","","",{"$f":"IF(ISNUMBER(Taxa_PivotTable!I182),Taxa_PivotTable!I182,\"\")","v":""},"","","",{"$f":"IF(ISNUMBER(Taxa_PivotTable!J182),Taxa_PivotTable!J182,\"\")","v":""},"","","",{"$f":"IF(ISNUMBER(Taxa_PivotTable!K182),Taxa_PivotTable!K182,\"\")","v":""},"","",""]
[{"$f":"Taxa_PivotTable!A183","v":{"$error":"#N/A"}},{"$f":"IF(Taxa_PivotTable!B183=\"\",\"\",Taxa_PivotTable!B183)","v":""},{"$f":"IF(ISNUMBER(VLOOKUP(B183,UKOptima!A:J,10,FALSE)),VLOOKUP(B183,UKOptima!A:J,10,FALSE),\"\")","v":""},{"$f":"IF(ISNUMBER(Taxa_PivotTable!C183),Taxa_PivotTable!C183,\"\")","v":""},"","","",{"$f":"IF(ISNUMBER(Taxa_PivotTable!D183),Taxa_PivotTable!D183,\"\")","v":""},"","","",{"$f":"IF(ISNUMBER(Taxa_PivotTable!E183),Taxa_PivotTable!E183,\"\")","v":""},"","","",{"$f":"IF(ISNUMBER(Taxa_PivotTable!F183),Taxa_PivotTable!F183,\"\")","v":""},"","","",{"$f":"IF(ISNUMBER(Taxa_PivotTable!G183),Taxa_PivotTable!G183,\"\")","v":""},"","","",{"$f":"IF(ISNUMBER(Taxa_PivotTable!H183),Taxa_PivotTable!H183,\"\")","v":""},"","","",{"$f":"IF(ISNUMBER(Taxa_PivotTable!I183),Taxa_PivotTable!I183,\"\")","v":""},"","","",{"$f":"IF(ISNUMBER(Taxa_PivotTable!J183),Taxa_PivotTable!J183,\"\")","v":""},"","","",{"$f":"IF(ISNUMBER(Taxa_PivotTable!K183),Taxa_PivotTable!K183,\"\")","v":""},"","",""]
[{"$f":"Taxa_PivotTable!A184","v":{"$error":"#N/A"}},{"$f":"IF(Taxa_PivotTable!B184=\"\",\"\",Taxa_PivotTable!B184)","v":""},{"$f":"IF(ISNUMBER(VLOOKUP(B184,UKOptima!A:J,10,FALSE)),VLOOKUP(B184,UKOptima!A:J,10,FALSE),\"\")","v":""},{"$f":"IF(ISNUMBER(Taxa_PivotTable!C184),Taxa_PivotTable!C184,\"\")","v":""},"","","",{"$f":"IF(ISNUMBER(Taxa_PivotTable!D184),Taxa_PivotTable!D184,\"\")","v":""},"","","",{"$f":"IF(ISNUMBER(Taxa_PivotTable!E184),Taxa_PivotTable!E184,\"\")","v":""},"","","",{"$f":"IF(ISNUMBER(Taxa_PivotTable!F184),Taxa_PivotTable!F184,\"\")","v":""},"","","",{"$f":"IF(ISNUMBER(Taxa_PivotTable!G184),Taxa_PivotTable!G184,\"\")","v":""},"","","",{"$f":"IF(ISNUMBER(Taxa_PivotTable!H184),Taxa_PivotTable!H184,\"\")","v":""},"","","",{"$f":"IF(ISNUMBER(Taxa_PivotTable!I184),Taxa_PivotTable!I184,\"\")","v":""},"","","",{"$f":"IF(ISNUMBER(Taxa_PivotTable!J184),Taxa_PivotTable!J184,\"\")","v":""},"","","",{"$f":"IF(ISNUMBER(Taxa_PivotTable!K184),Taxa_PivotTable!K184,\"\")","v":""},"","",""]
[{"$f":"Taxa_PivotTable!A185","v":{"$error":"#N/A"}},{"$f":"IF(Taxa_PivotTable!B185=\"\",\"\",Taxa_PivotTable!B185)","v":""},{"$f":"IF(ISNUMBER(VLOOKUP(B185,UKOptima!A:J,10,FALSE)),VLOOKUP(B185,UKOptima!A:J,10,FALSE),\"\")","v":""},{"$f":"IF(ISNUMBER(Taxa_PivotTable!C185),Taxa_PivotTable!C185,\"\")","v":""},"","","",{"$f":"IF(ISNUMBER(Taxa_PivotTable!D185),Taxa_PivotTable!D185,\"\")","v":""},"","","",{"$f":"IF(ISNUMBER(Taxa_PivotTable!E185),Taxa_PivotTable!E185,\"\")","v":""},"","","",{"$f":"IF(ISNUMBER(Taxa_PivotTable!F185),Taxa_PivotTable!F185,\"\")","v":""},"","","",{"$f":"IF(ISNUMBER(Taxa_PivotTable!G185),Taxa_PivotTable!G185,\"\")","v":""},"","","",{"$f":"IF(ISNUMBER(Taxa_PivotTable!H185),Taxa_PivotTable!H185,\"\")","v":""},"","","",{"$f":"IF(ISNUMBER(Taxa_PivotTable!I185),Taxa_PivotTable!I185,\"\")","v":""},"","","",{"$f":"IF(ISNUMBER(Taxa_PivotTable!J185),Taxa_PivotTable!J185,\"\")","v":""},"","","",{"$f":"IF(ISNUMBER(Taxa_PivotTable!K185),Taxa_PivotTable!K185,\"\")","v":""},"","",""]
[{"$f":"Taxa_PivotTable!A186","v":{"$error":"#N/A"}},{"$f":"IF(Taxa_PivotTable!B186=\"\",\"\",Taxa_PivotTable!B186)","v":""},{"$f":"IF(ISNUMBER(VLOOKUP(B186,UKOptima!A:J,10,FALSE)),VLOOKUP(B186,UKOptima!A:J,10,FALSE),\"\")","v":""},{"$f":"IF(ISNUMBER(Taxa_PivotTable!C186),Taxa_PivotTable!C186,\"\")","v":""},"","","",{"$f":"IF(ISNUMBER(Taxa_PivotTable!D186),Taxa_PivotTable!D186,\"\")","v":""},"","","",{"$f":"IF(ISNUMBER(Taxa_PivotTable!E186),Taxa_PivotTable!E186,\"\")","v":""},"","","",{"$f":"IF(ISNUMBER(Taxa_PivotTable!F186),Taxa_PivotTable!F186,\"\")","v":""},"","","",{"$f":"IF(ISNUMBER(Taxa_PivotTable!G186),Taxa_PivotTable!G186,\"\")","v":""},"","","",{"$f":"IF(ISNUMBER(Taxa_PivotTable!H186),Taxa_PivotTable!H186,\"\")","v":""},"","","",{"$f":"IF(ISNUMBER(Taxa_PivotTable!I186),Taxa_PivotTable!I186,\"\")","v":""},"","","",{"$f":"IF(ISNUMBER(Taxa_PivotTable!J186),Taxa_PivotTable!J186,\"\")","v":""},"","","",{"$f":"IF(ISNUMBER(Taxa_PivotTable!K186),Taxa_PivotTable!K186,\"\")","v":""},"","",""]
[{"$f":"Taxa_PivotTable!A187","v":{"$error":"#N/A"}},{"$f":"IF(Taxa_PivotTable!B187=\"\",\"\",Taxa_PivotTable!B187)","v":""},{"$f":"IF(ISNUMBER(VLOOKUP(B187,UKOptima!A:J,10,FALSE)),VLOOKUP(B187,UKOptima!A:J,10,FALSE),\"\")","v":""},{"$f":"IF(ISNUMBER(Taxa_PivotTable!C187),Taxa_PivotTable!C187,\"\")","v":""},"","","",{"$f":"IF(ISNUMBER(Taxa_PivotTable!D187),Taxa_PivotTable!D187,\"\")","v":""},"","","",{"$f":"IF(ISNUMBER(Taxa_PivotTable!E187),Taxa_PivotTable!E187,\"\")","v":""},"","","",{"$f":"IF(ISNUMBER(Taxa_PivotTable!F187),Taxa_PivotTable!F187,\"\")","v":""},"","","",{"$f":"IF(ISNUMBER(Taxa_PivotTable!G187),Taxa_PivotTable!G187,\"\")","v":""},"","","",{"$f":"IF(ISNUMBER(Taxa_PivotTable!H187),Taxa_PivotTable!H187,\"\")","v":""},"","","",{"$f":"IF(ISNUMBER(Taxa_PivotTable!I187),Taxa_PivotTable!I187,\"\")","v":""},"","","",{"$f":"IF(ISNUMBER(Taxa_PivotTable!J187),Taxa_PivotTable!J187,\"\")","v":""},"","","",{"$f":"IF(ISNUMBER(Taxa_PivotTable!K187),Taxa_PivotTable!K187,\"\")","v":""},"","",""]
[{"$f":"Taxa_PivotTable!A188","v":{"$error":"#N/A"}},{"$f":"IF(Taxa_PivotTable!B188=\"\",\"\",Taxa_PivotTable!B188)","v":""},{"$f":"IF(ISNUMBER(VLOOKUP(B188,UKOptima!A:J,10,FALSE)),VLOOKUP(B188,UKOptima!A:J,10,FALSE),\"\")","v":""},{"$f":"IF(ISNUMBER(Taxa_PivotTable!C188),Taxa_PivotTable!C188,\"\")","v":""},"","","",{"$f":"IF(ISNUMBER(Taxa_PivotTable!D188),Taxa_PivotTable!D188,\"\")","v":""},"","","",{"$f":"IF(ISNUMBER(Taxa_PivotTable!E188),Taxa_PivotTable!E188,\"\")","v":""},"","","",{"$f":"IF(ISNUMBER(Taxa_PivotTable!F188),Taxa_PivotTable!F188,\"\")","v":""},"","","",{"$f":"IF(ISNUMBER(Taxa_PivotTable!G188),Taxa_PivotTable!G188,\"\")","v":""},"","","",{"$f":"IF(ISNUMBER(Taxa_PivotTable!H188),Taxa_PivotTable!H188,\"\")","v":""},"","","",{"$f":"IF(ISNUMBER(Taxa_PivotTable!I188),Taxa_PivotTable!I188,\"\")","v":""},"","","",{"$f":"IF(ISNUMBER(Taxa_PivotTable!J188),Taxa_PivotTable!J188,\"\")","v":""},"","","",{"$f":"IF(ISNUMBER(Taxa_PivotTable!K188),Taxa_PivotTable!K188,\"\")","v":""},"","",""]
[{"$f":"Taxa_PivotTable!A189","v":{"$error":"#N/A"}},{"$f":"IF(Taxa_PivotTable!B189=\"\",\"\",Taxa_PivotTable!B189)","v":""},{"$f":"IF(ISNUMBER(VLOOKUP(B189,UKOptima!A:J,10,FALSE)),VLOOKUP(B189,UKOptima!A:J,10,FALSE),\"\")","v":""},{"$f":"IF(ISNUMBER(Taxa_PivotTable!C189),Taxa_PivotTable!C189,\"\")","v":""},"","","",{"$f":"IF(ISNUMBER(Taxa_PivotTable!D189),Taxa_PivotTable!D189,\"\")","v":""},"","","",{"$f":"IF(ISNUMBER(Taxa_PivotTable!E189),Taxa_PivotTable!E189,\"\")","v":""},"","","",{"$f":"IF(ISNUMBER(Taxa_PivotTable!F189),Taxa_PivotTable!F189,\"\")","v":""},"","","",{"$f":"IF(ISNUMBER(Taxa_PivotTable!G189),Taxa_PivotTable!G189,\"\")","v":""},"","","",{"$f":"IF(ISNUMBER(Taxa_PivotTable!H189),Taxa_PivotTable!H189,\"\")","v":""},"","","",{"$f":"IF(ISNUMBER(Taxa_PivotTable!I189),Taxa_PivotTable!I189,\"\")","v":""},"","","",{"$f":"IF(ISNUMBER(Taxa_PivotTable!J189),Taxa_PivotTable!J189,\"\")","v":""},"","","",{"$f":"IF(ISNUMBER(Taxa_PivotTable!K189),Taxa_PivotTable!K189,\"\")","v":""},"","",""]
[{"$f":"Taxa_PivotTable!A190","v":{"$error":"#N/A"}},{"$f":"IF(Taxa_PivotTable!B190=\"\",\"\",Taxa_PivotTable!B190)","v":""},{"$f":"IF(ISNUMBER(VLOOKUP(B190,UKOptima!A:J,10,FALSE)),VLOOKUP(B190,UKOptima!A:J,10,FALSE),\"\")","v":""},{"$f":"IF(ISNUMBER(Taxa_PivotTable!C190),Taxa_PivotTable!C190,\"\")","v":""},"","","",{"$f":"IF(ISNUMBER(Taxa_PivotTable!D190),Taxa_PivotTable!D190,\"\")","v":""},"","","",{"$f":"IF(ISNUMBER(Taxa_PivotTable!E190),Taxa_PivotTable!E190,\"\")","v":""},"","","",{"$f":"IF(ISNUMBER(Taxa_PivotTable!F190),Taxa_PivotTable!F190,\"\")","v":""},"","","",{"$f":"IF(ISNUMBER(Taxa_PivotTable!G190),Taxa_PivotTable!G190,\"\")","v":""},"","","",{"$f":"IF(ISNUMBER(Taxa_PivotTable!H190),Taxa_PivotTable!H190,\"\")","v":""},"","","",{"$f":"IF(ISNUMBER(Taxa_PivotTable!I190),Taxa_PivotTable!I190,\"\")","v":""},"","","",{"$f":"IF(ISNUMBER(Taxa_PivotTable!J190),Taxa_PivotTable!J190,\"\")","v":""},"","","",{"$f":"IF(ISNUMBER(Taxa_PivotTable!K190),Taxa_PivotTable!K190,\"\")","v":""},"","",""]
[{"$f":"Taxa_PivotTable!A191","v":{"$error":"#N/A"}},{"$f":"IF(Taxa_PivotTable!B191=\"\",\"\",Taxa_PivotTable!B191)","v":""},{"$f":"IF(ISNUMBER(VLOOKUP(B191,UKOptima!A:J,10,FALSE)),VLOOKUP(B191,UKOptima!A:J,10,FALSE),\"\")","v":""},{"$f":"IF(ISNUMBER(Taxa_PivotTable!C191),Taxa_PivotTable!C191,\"\")","v":""},"","","",{"$f":"IF(ISNUMBER(Taxa_PivotTable!D191),Taxa_PivotTable!D191,\"\")","v":""},"","","",{"$f":"IF(ISNUMBER(Taxa_PivotTable!E191),Taxa_PivotTable!E191,\"\")","v":""},"","","",{"$f":"IF(ISNUMBER(Taxa_PivotTable!F191),Taxa_PivotTable!F191,\"\")","v":""},"","","",{"$f":"IF(ISNUMBER(Taxa_PivotTable!G191),Taxa_PivotTable!G191,\"\")","v":""},"","","",{"$f":"IF(ISNUMBER(Taxa_PivotTable!H191),Taxa_PivotTable!H191,\"\")","v":""},"","","",{"$f":"IF(ISNUMBER(Taxa_PivotTable!I191),Taxa_PivotTable!I191,\"\")","v":""},"","","",{"$f":"IF(ISNUMBER(Taxa_PivotTable!J191),Taxa_PivotTable!J191,\"\")","v":""},"","","",{"$f":"IF(ISNUMBER(Taxa_PivotTable!K191),Taxa_PivotTable!K191,\"\")","v":""},"","",""]
[{"$f":"Taxa_PivotTable!A192","v":{"$error":"#N/A"}},{"$f":"IF(Taxa_PivotTable!B192=\"\",\"\",Taxa_PivotTable!B192)","v":""},{"$f":"IF(ISNUMBER(VLOOKUP(B192,UKOptima!A:J,10,FALSE)),VLOOKUP(B192,UKOptima!A:J,10,FALSE),\"\")","v":""},{"$f":"IF(ISNUMBER(Taxa_PivotTable!C192),Taxa_PivotTable!C192,\"\")","v":""},"","","",{"$f":"IF(ISNUMBER(Taxa_PivotTable!D192),Taxa_PivotTable!D192,\"\")","v":""},"","","",{"$f":"IF(ISNUMBER(Taxa_PivotTable!E192),Taxa_PivotTable!E192,\"\")","v":""},"","","",{"$f":"IF(ISNUMBER(Taxa_PivotTable!F192),Taxa_PivotTable!F192,\"\")","v":""},"","","",{"$f":"IF(ISNUMBER(Taxa_PivotTable!G192),Taxa_PivotTable!G192,\"\")","v":""},"","","",{"$f":"IF(ISNUMBER(Taxa_PivotTable!H192),Taxa_PivotTable!H192,\"\")","v":""},"","","",{"$f":"IF(ISNUMBER(Taxa_PivotTable!I192),Taxa_PivotTable!I192,\"\")","v":""},"","","",{"$f":"IF(ISNUMBER(Taxa_PivotTable!J192),Taxa_PivotTable!J192,\"\")","v":""},"","","",{"$f":"IF(ISNUMBER(Taxa_PivotTable!K192),Taxa_PivotTable!K192,\"\")","v":""},"","",""]
[{"$f":"Taxa_PivotTable!A193","v":{"$error":"#N/A"}},{"$f":"IF(Taxa_PivotTable!B193=\"\",\"\",Taxa_PivotTable!B193)","v":""},{"$f":"IF(ISNUMBER(VLOOKUP(B193,UKOptima!A:J,10,FALSE)),VLOOKUP(B193,UKOptima!A:J,10,FALSE),\"\")","v":""},{"$f":"IF(ISNUMBER(Taxa_PivotTable!C193),Taxa_PivotTable!C193,\"\")","v":""},"","","",{"$f":"IF(ISNUMBER(Taxa_PivotTable!D193),Taxa_PivotTable!D193,\"\")","v":""},"","","",{"$f":"IF(ISNUMBER(Taxa_PivotTable!E193),Taxa_PivotTable!E193,\"\")","v":""},"","","",{"$f":"IF(ISNUMBER(Taxa_PivotTable!F193),Taxa_PivotTable!F193,\"\")","v":""},"","","",{"$f":"IF(ISNUMBER(Taxa_PivotTable!G193),Taxa_PivotTable!G193,\"\")","v":""},"","","",{"$f":"IF(ISNUMBER(Taxa_PivotTable!H193),Taxa_PivotTable!H193,\"\")","v":""},"","","",{"$f":"IF(ISNUMBER(Taxa_PivotTable!I193),Taxa_PivotTable!I193,\"\")","v":""},"","","",{"$f":"IF(ISNUMBER(Taxa_PivotTable!J193),Taxa_PivotTable!J193,\"\")","v":""},"","","",{"$f":"IF(ISNUMBER(Taxa_PivotTable!K193),Taxa_PivotTable!K193,\"\")","v":""},"","",""]
[{"$f":"Taxa_PivotTable!A194","v":{"$error":"#N/A"}},{"$f":"IF(Taxa_PivotTable!B194=\"\",\"\",Taxa_PivotTable!B194)","v":""},{"$f":"IF(ISNUMBER(VLOOKUP(B194,UKOptima!A:J,10,FALSE)),VLOOKUP(B194,UKOptima!A:J,10,FALSE),\"\")","v":""},{"$f":"IF(ISNUMBER(Taxa_PivotTable!C194),Taxa_PivotTable!C194,\"\")","v":""},"","","",{"$f":"IF(ISNUMBER(Taxa_PivotTable!D194),Taxa_PivotTable!D194,\"\")","v":""},"","","",{"$f":"IF(ISNUMBER(Taxa_PivotTable!E194),Taxa_PivotTable!E194,\"\")","v":""},"","","",{"$f":"IF(ISNUMBER(Taxa_PivotTable!F194),Taxa_PivotTable!F194,\"\")","v":""},"","","",{"$f":"IF(ISNUMBER(Taxa_PivotTable!G194),Taxa_PivotTable!G194,\"\")","v":""},"","","",{"$f":"IF(ISNUMBER(Taxa_PivotTable!H194),Taxa_PivotTable!H194,\"\")","v":""},"","","",{"$f":"IF(ISNUMBER(Taxa_PivotTable!I194),Taxa_PivotTable!I194,\"\")","v":""},"","","",{"$f":"IF(ISNUMBER(Taxa_PivotTable!J194),Taxa_PivotTable!J194,\"\")","v":""},"","","",{"$f":"IF(ISNUMBER(Taxa_PivotTable!K194),Taxa_PivotTable!K194,\"\")","v":""},"","",""]
[{"$f":"Taxa_PivotTable!A195","v":{"$error":"#N/A"}},{"$f":"IF(Taxa_PivotTable!B195=\"\",\"\",Taxa_PivotTable!B195)","v":""},{"$f":"IF(ISNUMBER(VLOOKUP(B195,UKOptima!A:J,10,FALSE)),VLOOKUP(B195,UKOptima!A:J,10,FALSE),\"\")","v":""},{"$f":"IF(ISNUMBER(Taxa_PivotTable!C195),Taxa_PivotTable!C195,\"\")","v":""},"","","",{"$f":"IF(ISNUMBER(Taxa_PivotTable!D195),Taxa_PivotTable!D195,\"\")","v":""},"","","",{"$f":"IF(ISNUMBER(Taxa_PivotTable!E195),Taxa_PivotTable!E195,\"\")","v":""},"","","",{"$f":"IF(ISNUMBER(Taxa_PivotTable!F195),Taxa_PivotTable!F195,\"\")","v":""},"","","",{"$f":"IF(ISNUMBER(Taxa_PivotTable!G195),Taxa_PivotTable!G195,\"\")","v":""},"","","",{"$f":"IF(ISNUMBER(Taxa_PivotTable!H195),Taxa_PivotTable!H195,\"\")","v":""},"","","",{"$f":"IF(ISNUMBER(Taxa_PivotTable!I195),Taxa_PivotTable!I195,\"\")","v":""},"","","",{"$f":"IF(ISNUMBER(Taxa_PivotTable!J195),Taxa_PivotTable!J195,\"\")","v":""},"","","",{"$f":"IF(ISNUMBER(Taxa_PivotTable!K195),Taxa_PivotTable!K195,\"\")","v":""},"","",""]
[{"$f":"Taxa_PivotTable!A196","v":{"$error":"#N/A"}},{"$f":"IF(Taxa_PivotTable!B196=\"\",\"\",Taxa_PivotTable!B196)","v":""},{"$f":"IF(ISNUMBER(VLOOKUP(B196,UKOptima!A:J,10,FALSE)),VLOOKUP(B196,UKOptima!A:J,10,FALSE),\"\")","v":""},{"$f":"IF(ISNUMBER(Taxa_PivotTable!C196),Taxa_PivotTable!C196,\"\")","v":""},"","","",{"$f":"IF(ISNUMBER(Taxa_PivotTable!D196),Taxa_PivotTable!D196,\"\")","v":""},"","","",{"$f":"IF(ISNUMBER(Taxa_PivotTable!E196),Taxa_PivotTable!E196,\"\")","v":""},"","","",{"$f":"IF(ISNUMBER(Taxa_PivotTable!F196),Taxa_PivotTable!F196,\"\")","v":""},"","","",{"$f":"IF(ISNUMBER(Taxa_PivotTable!G196),Taxa_PivotTable!G196,\"\")","v":""},"","","",{"$f":"IF(ISNUMBER(Taxa_PivotTable!H196),Taxa_PivotTable!H196,\"\")","v":""},"","","",{"$f":"IF(ISNUMBER(Taxa_PivotTable!I196),Taxa_PivotTable!I196,\"\")","v":""},"","","",{"$f":"IF(ISNUMBER(Taxa_PivotTable!J196),Taxa_PivotTable!J196,\"\")","v":""},"","","",{"$f":"IF(ISNUMBER(Taxa_PivotTable!K196),Taxa_PivotTable!K196,\"\")","v":""},"","",""]
[{"$f":"Taxa_PivotTable!A197","v":{"$error":"#N/A"}},{"$f":"IF(Taxa_PivotTable!B197=\"\",\"\",Taxa_PivotTable!B197)","v":""},{"$f":"IF(ISNUMBER(VLOOKUP(B197,UKOptima!A:J,10,FALSE)),VLOOKUP(B197,UKOptima!A:J,10,FALSE),\"\")","v":""},{"$f":"IF(ISNUMBER(Taxa_PivotTable!C197),Taxa_PivotTable!C197,\"\")","v":""},"","","",{"$f":"IF(ISNUMBER(Taxa_PivotTable!D197),Taxa_PivotTable!D197,\"\")","v":""},"","","",{"$f":"IF(ISNUMBER(Taxa_PivotTable!E197),Taxa_PivotTable!E197,\"\")","v":""},"","","",{"$f":"IF(ISNUMBER(Taxa_PivotTable!F197),Taxa_PivotTable!F197,\"\")","v":""},"","","",{"$f":"IF(ISNUMBER(Taxa_PivotTable!G197),Taxa_PivotTable!G197,\"\")","v":""},"","","",{"$f":"IF(ISNUMBER(Taxa_PivotTable!H197),Taxa_PivotTable!H197,\"\")","v":""},"","","",{"$f":"IF(ISNUMBER(Taxa_PivotTable!I197),Taxa_PivotTable!I197,\"\")","v":""},"","","",{"$f":"IF(ISNUMBER(Taxa_PivotTable!J197),Taxa_PivotTable!J197,\"\")","v":""},"","","",{"$f":"IF(ISNUMBER(Taxa_PivotTable!K197),Taxa_PivotTable!K197,\"\")","v":""},"","",""]
[{"$f":"Taxa_PivotTable!A198","v":{"$error":"#N/A"}},{"$f":"IF(Taxa_PivotTable!B198=\"\",\"\",Taxa_PivotTable!B198)","v":""},{"$f":"IF(ISNUMBER(VLOOKUP(B198,UKOptima!A:J,10,FALSE)),VLOOKUP(B198,UKOptima!A:J,10,FALSE),\"\")","v":""},{"$f":"IF(ISNUMBER(Taxa_PivotTable!C198),Taxa_PivotTable!C198,\"\")","v":""},"","","",{"$f":"IF(ISNUMBER(Taxa_PivotTable!D198),Taxa_PivotTable!D198,\"\")","v":""},"","","",{"$f":"IF(ISNUMBER(Taxa_PivotTable!E198),Taxa_PivotTable!E198,\"\")","v":""},"","","",{"$f":"IF(ISNUMBER(Taxa_PivotTable!F198),Taxa_PivotTable!F198,\"\")","v":""},"","","",{"$f":"IF(ISNUMBER(Taxa_PivotTable!G198),Taxa_PivotTable!G198,\"\")","v":""},"","","",{"$f":"IF(ISNUMBER(Taxa_PivotTable!H198),Taxa_PivotTable!H198,\"\")","v":""},"","","",{"$f":"IF(ISNUMBER(Taxa_PivotTable!I198),Taxa_PivotTable!I198,\"\")","v":""},"","","",{"$f":"IF(ISNUMBER(Taxa_PivotTable!J198),Taxa_PivotTable!J198,\"\")","v":""},"","","",{"$f":"IF(ISNUMBER(Taxa_PivotTable!K198),Taxa_PivotTable!K198,\"\")","v":""},"","",""]
[{"$f":"Taxa_PivotTable!A199","v":{"$error":"#N/A"}},{"$f":"IF(Taxa_PivotTable!B199=\"\",\"\",Taxa_PivotTable!B199)","v":""},{"$f":"IF(ISNUMBER(VLOOKUP(B199,UKOptima!A:J,10,FALSE)),VLOOKUP(B199,UKOptima!A:J,10,FALSE),\"\")","v":""},{"$f":"IF(ISNUMBER(Taxa_PivotTable!C199),Taxa_PivotTable!C199,\"\")","v":""},"","","",{"$f":"IF(ISNUMBER(Taxa_PivotTable!D199),Taxa_PivotTable!D199,\"\")","v":""},"","","",{"$f":"IF(ISNUMBER(Taxa_PivotTable!E199),Taxa_PivotTable!E199,\"\")","v":""},"","","",{"$f":"IF(ISNUMBER(Taxa_PivotTable!F199),Taxa_PivotTable!F199,\"\")","v":""},"","","",{"$f":"IF(ISNUMBER(Taxa_PivotTable!G199),Taxa_PivotTable!G199,\"\")","v":""},"","","",{"$f":"IF(ISNUMBER(Taxa_PivotTable!H199),Taxa_PivotTable!H199,\"\")","v":""},"","","",{"$f":"IF(ISNUMBER(Taxa_PivotTable!I199),Taxa_PivotTable!I199,\"\")","v":""},"","","",{"$f":"IF(ISNUMBER(Taxa_PivotTable!J199),Taxa_PivotTable!J199,\"\")","v":""},"","","",{"$f":"IF(ISNUMBER(Taxa_PivotTable!K199),Taxa_PivotTable!K199,\"\")","v":""},"","",""]
[{"$f":"Taxa_PivotTable!A200","v":{"$error":"#N/A"}},{"$f":"IF(Taxa_PivotTable!B200=\"\",\"\",Taxa_PivotTable!B200)","v":""},{"$f":"IF(ISNUMBER(VLOOKUP(B200,UKOptima!A:J,10,FALSE)),VLOOKUP(B200,UKOptima!A:J,10,FALSE),\"\")","v":""},{"$f":"IF(ISNUMBER(Taxa_PivotTable!C200),Taxa_PivotTable!C200,\"\")","v":""},"","","",{"$f":"IF(ISNUMBER(Taxa_PivotTable!D200),Taxa_PivotTable!D200,\"\")","v":""},"","","",{"$f":"IF(ISNUMBER(Taxa_PivotTable!E200),Taxa_PivotTable!E200,\"\")","v":""},"","","",{"$f":"IF(ISNUMBER(Taxa_PivotTable!F200),Taxa_PivotTable!F200,\"\")","v":""},"","","",{"$f":"IF(ISNUMBER(Taxa_PivotTable!G200),Taxa_PivotTable!G200,\"\")","v":""},"","","",{"$f":"IF(ISNUMBER(Taxa_PivotTable!H200),Taxa_PivotTable!H200,\"\")","v":""},"","","",{"$f":"IF(ISNUMBER(Taxa_PivotTable!I200),Taxa_PivotTable!I200,\"\")","v":""},"","","",{"$f":"IF(ISNUMBER(Taxa_PivotTable!J200),Taxa_PivotTable!J200,\"\")","v":""},"","","",{"$f":"IF(ISNUMBER(Taxa_PivotTable!K200),Taxa_PivotTable!K200,\"\")","v":""},"","",""]
[{"$f":"Taxa_PivotTable!A201","v":{"$error":"#N/A"}},{"$f":"IF(Taxa_PivotTable!B201=\"\",\"\",Taxa_PivotTable!B201)","v":""},{"$f":"IF(ISNUMBER(VLOOKUP(B201,UKOptima!A:J,10,FALSE)),VLOOKUP(B201,UKOptima!A:J,10,FALSE),\"\")","v":""},{"$f":"IF(ISNUMBER(Taxa_PivotTable!C201),Taxa_PivotTable!C201,\"\")","v":""},"","","",{"$f":"IF(ISNUMBER(Taxa_PivotTable!D201),Taxa_PivotTable!D201,\"\")","v":""},"","","",{"$f":"IF(ISNUMBER(Taxa_PivotTable!E201),Taxa_PivotTable!E201,\"\")","v":""},"","","",{"$f":"IF(ISNUMBER(Taxa_PivotTable!F201),Taxa_PivotTable!F201,\"\")","v":""},"","","",{"$f":"IF(ISNUMBER(Taxa_PivotTable!G201),Taxa_PivotTable!G201,\"\")","v":""},"","","",{"$f":"IF(ISNUMBER(Taxa_PivotTable!H201),Taxa_PivotTable!H201,\"\")","v":""},"","","",{"$f":"IF(ISNUMBER(Taxa_PivotTable!I201),Taxa_PivotTable!I201,\"\")","v":""},"","","",{"$f":"IF(ISNUMBER(Taxa_PivotTable!J201),Taxa_PivotTable!J201,\"\")","v":""},"","","",{"$f":"IF(ISNUMBER(Taxa_PivotTable!K201),Taxa_PivotTable!K201,\"\")","v":""},"","",""]
[{"$f":"Taxa_PivotTable!A202","v":{"$error":"#N/A"}},{"$f":"IF(Taxa_PivotTable!B202=\"\",\"\",Taxa_PivotTable!B202)","v":""},{"$f":"IF(ISNUMBER(VLOOKUP(B202,UKOptima!A:J,10,FALSE)),VLOOKUP(B202,UKOptima!A:J,10,FALSE),\"\")","v":""},{"$f":"IF(ISNUMBER(Taxa_PivotTable!C202),Taxa_PivotTable!C202,\"\")","v":""},"","","",{"$f":"IF(ISNUMBER(Taxa_PivotTable!D202),Taxa_PivotTable!D202,\"\")","v":""},"","","",{"$f":"IF(ISNUMBER(Taxa_PivotTable!E202),Taxa_PivotTable!E202,\"\")","v":""},"","","",{"$f":"IF(ISNUMBER(Taxa_PivotTable!F202),Taxa_PivotTable!F202,\"\")","v":""},"","","",{"$f":"IF(ISNUMBER(Taxa_PivotTable!G202),Taxa_PivotTable!G202,\"\")","v":""},"","","",{"$f":"IF(ISNUMBER(Taxa_PivotTable!H202),Taxa_PivotTable!H202,\"\")","v":""},"","","",{"$f":"IF(ISNUMBER(Taxa_PivotTable!I202),Taxa_PivotTable!I202,\"\")","v":""},"","","",{"$f":"IF(ISNUMBER(Taxa_PivotTable!J202),Taxa_PivotTable!J202,\"\")","v":""},"","","",{"$f":"IF(ISNUMBER(Taxa_PivotTable!K202),Taxa_PivotTable!K202,\"\")","v":""},"","",""]
[{"$f":"Taxa_PivotTable!A203","v":{"$error":"#N/A"}},{"$f":"IF(Taxa_PivotTable!B203=\"\",\"\",Taxa_PivotTable!B203)","v":""},{"$f":"IF(ISNUMBER(VLOOKUP(B203,UKOptima!A:J,10,FALSE)),VLOOKUP(B203,UKOptima!A:J,10,FALSE),\"\")","v":""},{"$f":"IF(ISNUMBER(Taxa_PivotTable!C203),Taxa_PivotTable!C203,\"\")","v":""},"","","",{"$f":"IF(ISNUMBER(Taxa_PivotTable!D203),Taxa_PivotTable!D203,\"\")","v":""},"","","",{"$f":"IF(ISNUMBER(Taxa_PivotTable!E203),Taxa_PivotTable!E203,\"\")","v":""},"","","",{"$f":"IF(ISNUMBER(Taxa_PivotTable!F203),Taxa_PivotTable!F203,\"\")","v":""},"","","",{"$f":"IF(ISNUMBER(Taxa_PivotTable!G203),Taxa_PivotTable!G203,\"\")","v":""},"","","",{"$f":"IF(ISNUMBER(Taxa_PivotTable!H203),Taxa_PivotTable!H203,\"\")","v":""},"","","",{"$f":"IF(ISNUMBER(Taxa_PivotTable!I203),Taxa_PivotTable!I203,\"\")","v":""},"","","",{"$f":"IF(ISNUMBER(Taxa_PivotTable!J203),Taxa_PivotTable!J203,\"\")","v":""},"","","",{"$f":"IF(ISNUMBER(Taxa_PivotTable!K203),Taxa_PivotTable!K203,\"\")","v":""},"","",""]
[{"$f":"Taxa_PivotTable!A204","v":{"$error":"#N/A"}},{"$f":"IF(Taxa_PivotTable!B204=\"\",\"\",Taxa_PivotTable!B204)","v":""},{"$f":"IF(ISNUMBER(VLOOKUP(B204,UKOptima!A:J,10,FALSE)),VLOOKUP(B204,UKOptima!A:J,10,FALSE),\"\")","v":""},{"$f":"IF(ISNUMBER(Taxa_PivotTable!C204),Taxa_PivotTable!C204,\"\")","v":""},"","","",{"$f":"IF(ISNUMBER(Taxa_PivotTable!D204),Taxa_PivotTable!D204,\"\")","v":""},"","","",{"$f":"IF(ISNUMBER(Taxa_PivotTable!E204),Taxa_PivotTable!E204,\"\")","v":""},"","","",{"$f":"IF(ISNUMBER(Taxa_PivotTable!F204),Taxa_PivotTable!F204,\"\")","v":""},"","","",{"$f":"IF(ISNUMBER(Taxa_PivotTable!G204),Taxa_PivotTable!G204,\"\")","v":""},"","","",{"$f":"IF(ISNUMBER(Taxa_PivotTable!H204),Taxa_PivotTable!H204,\"\")","v":""},"","","",{"$f":"IF(ISNUMBER(Taxa_PivotTable!I204),Taxa_PivotTable!I204,\"\")","v":""},"","","",{"$f":"IF(ISNUMBER(Taxa_PivotTable!J204),Taxa_PivotTable!J204,\"\")","v":""},"","","",{"$f":"IF(ISNUMBER(Taxa_PivotTable!K204),Taxa_PivotTable!K204,\"\")","v":""},"","",""]
[{"$f":"Taxa_PivotTable!A205","v":{"$error":"#N/A"}},{"$f":"IF(Taxa_PivotTable!B205=\"\",\"\",Taxa_PivotTable!B205)","v":""},{"$f":"IF(ISNUMBER(VLOOKUP(B205,UKOptima!A:J,10,FALSE)),VLOOKUP(B205,UKOptima!A:J,10,FALSE),\"\")","v":""},{"$f":"IF(ISNUMBER(Taxa_PivotTable!C205),Taxa_PivotTable!C205,\"\")","v":""},"","","",{"$f":"IF(ISNUMBER(Taxa_PivotTable!D205),Taxa_PivotTable!D205,\"\")","v":""},"","","",{"$f":"IF(ISNUMBER(Taxa_PivotTable!E205),Taxa_PivotTable!E205,\"\")","v":""},"","","",{"$f":"IF(ISNUMBER(Taxa_PivotTable!F205),Taxa_PivotTable!F205,\"\")","v":""},"","","",{"$f":"IF(ISNUMBER(Taxa_PivotTable!G205),Taxa_PivotTable!G205,\"\")","v":""},"","","",{"$f":"IF(ISNUMBER(Taxa_PivotTable!H205),Taxa_PivotTable!H205,\"\")","v":""},"","","",{"$f":"IF(ISNUMBER(Taxa_PivotTable!I205),Taxa_PivotTable!I205,\"\")","v":""},"","","",{"$f":"IF(ISNUMBER(Taxa_PivotTable!J205),Taxa_PivotTable!J205,\"\")","v":""},"","","",{"$f":"IF(ISNUMBER(Taxa_PivotTable!K205),Taxa_PivotTable!K205,\"\")","v":""},"","",""]
[{"$f":"Taxa_PivotTable!A206","v":{"$error":"#N/A"}},{"$f":"IF(Taxa_PivotTable!B206=\"\",\"\",Taxa_PivotTable!B206)","v":""},{"$f":"IF(ISNUMBER(VLOOKUP(B206,UKOptima!A:J,10,FALSE)),VLOOKUP(B206,UKOptima!A:J,10,FALSE),\"\")","v":""},{"$f":"IF(ISNUMBER(Taxa_PivotTable!C206),Taxa_PivotTable!C206,\"\")","v":""},"","","",{"$f":"IF(ISNUMBER(Taxa_PivotTable!D206),Taxa_PivotTable!D206,\"\")","v":""},"","","",{"$f":"IF(ISNUMBER(Taxa_PivotTable!E206),Taxa_PivotTable!E206,\"\")","v":""},"","","",{"$f":"IF(ISNUMBER(Taxa_PivotTable!F206),Taxa_PivotTable!F206,\"\")","v":""},"","","",{"$f":"IF(ISNUMBER(Taxa_PivotTable!G206),Taxa_PivotTable!G206,\"\")","v":""},"","","",{"$f":"IF(ISNUMBER(Taxa_PivotTable!H206),Taxa_PivotTable!H206,\"\")","v":""},"","","",{"$f":"IF(ISNUMBER(Taxa_PivotTable!I206),Taxa_PivotTable!I206,\"\")","v":""},"","","",{"$f":"IF(ISNUMBER(Taxa_PivotTable!J206),Taxa_PivotTable!J206,\"\")","v":""},"","","",{"$f":"IF(ISNUMBER(Taxa_PivotTable!K206),Taxa_PivotTable!K206,\"\")","v":""},"","",""]
[{"$f":"Taxa_PivotTable!A207","v":{"$error":"#N/A"}},{"$f":"IF(Taxa_PivotTable!B207=\"\",\"\",Taxa_PivotTable!B207)","v":""},{"$f":"IF(ISNUMBER(VLOOKUP(B207,UKOptima!A:J,10,FALSE)),VLOOKUP(B207,UKOptima!A:J,10,FALSE),\"\")","v":""},{"$f":"IF(ISNUMBER(Taxa_PivotTable!C207),Taxa_PivotTable!C207,\"\")","v":""},"","","",{"$f":"IF(ISNUMBER(Taxa_PivotTable!D207),Taxa_PivotTable!D207,\"\")","v":""},"","","",{"$f":"IF(ISNUMBER(Taxa_PivotTable!E207),Taxa_PivotTable!E207,\"\")","v":""},"","","",{"$f":"IF(ISNUMBER(Taxa_PivotTable!F207),Taxa_PivotTable!F207,\"\")","v":""},"","","",{"$f":"IF(ISNUMBER(Taxa_PivotTable!G207),Taxa_PivotTable!G207,\"\")","v":""},"","","",{"$f":"IF(ISNUMBER(Taxa_PivotTable!H207),Taxa_PivotTable!H207,\"\")","v":""},"","","",{"$f":"IF(ISNUMBER(Taxa_PivotTable!I207),Taxa_PivotTable!I207,\"\")","v":""},"","","",{"$f":"IF(ISNUMBER(Taxa_PivotTable!J207),Taxa_PivotTable!J207,\"\")","v":""},"","","",{"$f":"IF(ISNUMBER(Taxa_PivotTable!K207),Taxa_PivotTable!K207,\"\")","v":""},"","",""]
[{"$f":"Taxa_PivotTable!A208","v":{"$error":"#N/A"}},{"$f":"IF(Taxa_PivotTable!B208=\"\",\"\",Taxa_PivotTable!B208)","v":""},{"$f":"IF(ISNUMBER(VLOOKUP(B208,UKOptima!A:J,10,FALSE)),VLOOKUP(B208,UKOptima!A:J,10,FALSE),\"\")","v":""},{"$f":"IF(ISNUMBER(Taxa_PivotTable!C208),Taxa_PivotTable!C208,\"\")","v":""},"","","",{"$f":"IF(ISNUMBER(Taxa_PivotTable!D208),Taxa_PivotTable!D208,\"\")","v":""},"","","",{"$f":"IF(ISNUMBER(Taxa_PivotTable!E208),Taxa_PivotTable!E208,\"\")","v":""},"","","",{"$f":"IF(ISNUMBER(Taxa_PivotTable!F208),Taxa_PivotTable!F208,\"\")","v":""},"","","",{"$f":"IF(ISNUMBER(Taxa_PivotTable!G208),Taxa_PivotTable!G208,\"\")","v":""},"","","",{"$f":"IF(ISNUMBER(Taxa_PivotTable!H208),Taxa_PivotTable!H208,\"\")","v":""},"","","",{"$f":"IF(ISNUMBER(Taxa_PivotTable!I208),Taxa_PivotTable!I208,\"\")","v":""},"","","",{"$f":"IF(ISNUMBER(Taxa_PivotTable!J208),Taxa_PivotTable!J208,\"\")","v":""},"","","",{"$f":"IF(ISNUMBER(Taxa_PivotTable!K208),Taxa_PivotTable!K208,\"\")","v":""},"","",""]
[{"$f":"Taxa_PivotTable!A209","v":{"$error":"#N/A"}},{"$f":"IF(Taxa_PivotTable!B209=\"\",\"\",Taxa_PivotTable!B209)","v":""},{"$f":"IF(ISNUMBER(VLOOKUP(B209,UKOptima!A:J,10,FALSE)),VLOOKUP(B209,UKOptima!A:J,10,FALSE),\"\")","v":""},{"$f":"IF(ISNUMBER(Taxa_PivotTable!C209),Taxa_PivotTable!C209,\"\")","v":""},"","","",{"$f":"IF(ISNUMBER(Taxa_PivotTable!D209),Taxa_PivotTable!D209,\"\")","v":""},"","","",{"$f":"IF(ISNUMBER(Taxa_PivotTable!E209),Taxa_PivotTable!E209,\"\")","v":""},"","","",{"$f":"IF(ISNUMBER(Taxa_PivotTable!F209),Taxa_PivotTable!F209,\"\")","v":""},"","","",{"$f":"IF(ISNUMBER(Taxa_PivotTable!G209),Taxa_PivotTable!G209,\"\")","v":""},"","","",{"$f":"IF(ISNUMBER(Taxa_PivotTable!H209),Taxa_PivotTable!H209,\"\")","v":""},"","","",{"$f":"IF(ISNUMBER(Taxa_PivotTable!I209),Taxa_PivotTable!I209,\"\")","v":""},"","","",{"$f":"IF(ISNUMBER(Taxa_PivotTable!J209),Taxa_PivotTable!J209,\"\")","v":""},"","","",{"$f":"IF(ISNUMBER(Taxa_PivotTable!K209),Taxa_PivotTable!K209,\"\")","v":""},"","",""]
[{"$f":"Taxa_PivotTable!A210","v":{"$error":"#N/A"}},{"$f":"IF(Taxa_PivotTable!B210=\"\",\"\",Taxa_PivotTable!B210)","v":""},{"$f":"IF(ISNUMBER(VLOOKUP(B210,UKOptima!A:J,10,FALSE)),VLOOKUP(B210,UKOptima!A:J,10,FALSE),\"\")","v":""},{"$f":"IF(ISNUMBER(Taxa_PivotTable!C210),Taxa_PivotTable!C210,\"\")","v":""},"","","",{"$f":"IF(ISNUMBER(Taxa_PivotTable!D210),Taxa_PivotTable!D210,\"\")","v":""},"","","",{"$f":"IF(ISNUMBER(Taxa_PivotTable!E210),Taxa_PivotTable!E210,\"\")","v":""},"","","",{"$f":"IF(ISNUMBER(Taxa_PivotTable!F210),Taxa_PivotTable!F210,\"\")","v":""},"","","",{"$f":"IF(ISNUMBER(Taxa_PivotTable!G210),Taxa_PivotTable!G210,\"\")","v":""},"","","",{"$f":"IF(ISNUMBER(Taxa_PivotTable!H210),Taxa_PivotTable!H210,\"\")","v":""},"","","",{"$f":"IF(ISNUMBER(Taxa_PivotTable!I210),Taxa_PivotTable!I210,\"\")","v":""},"","","",{"$f":"IF(ISNUMBER(Taxa_PivotTable!J210),Taxa_PivotTable!J210,\"\")","v":""},"","","",{"$f":"IF(ISNUMBER(Taxa_PivotTable!K210),Taxa_PivotTable!K210,\"\")","v":""},"","",""]
[{"$f":"Taxa_PivotTable!A211","v":{"$error":"#N/A"}},{"$f":"IF(Taxa_PivotTable!B211=\"\",\"\",Taxa_PivotTable!B211)","v":""},{"$f":"IF(ISNUMBER(VLOOKUP(B211,UKOptima!A:J,10,FALSE)),VLOOKUP(B211,UKOptima!A:J,10,FALSE),\"\")","v":""},{"$f":"IF(ISNUMBER(Taxa_PivotTable!C211),Taxa_PivotTable!C211,\"\")","v":""},"","","",{"$f":"IF(ISNUMBER(Taxa_PivotTable!D211),Taxa_PivotTable!D211,\"\")","v":""},"","","",{"$f":"IF(ISNUMBER(Taxa_PivotTable!E211),Taxa_PivotTable!E211,\"\")","v":""},"","","",{"$f":"IF(ISNUMBER(Taxa_PivotTable!F211),Taxa_PivotTable!F211,\"\")","v":""},"","","",{"$f":"IF(ISNUMBER(Taxa_PivotTable!G211),Taxa_PivotTable!G211,\"\")","v":""},"","","",{"$f":"IF(ISNUMBER(Taxa_PivotTable!H211),Taxa_PivotTable!H211,\"\")","v":""},"","","",{"$f":"IF(ISNUMBER(Taxa_PivotTable!I211),Taxa_PivotTable!I211,\"\")","v":""},"","","",{"$f":"IF(ISNUMBER(Taxa_PivotTable!J211),Taxa_PivotTable!J211,\"\")","v":""},"","","",{"$f":"IF(ISNUMBER(Taxa_PivotTable!K211),Taxa_PivotTable!K211,\"\")","v":""},"","",""]
[{"$f":"Taxa_PivotTable!A212","v":{"$error":"#N/A"}},{"$f":"IF(Taxa_PivotTable!B212=\"\",\"\",Taxa_PivotTable!B212)","v":""},{"$f":"IF(ISNUMBER(VLOOKUP(B212,UKOptima!A:J,10,FALSE)),VLOOKUP(B212,UKOptima!A:J,10,FALSE),\"\")","v":""},{"$f":"IF(ISNUMBER(Taxa_PivotTable!C212),Taxa_PivotTable!C212,\"\")","v":""},"","","",{"$f":"IF(ISNUMBER(Taxa_PivotTable!D212),Taxa_PivotTable!D212,\"\")","v":""},"","","",{"$f":"IF(ISNUMBER(Taxa_PivotTable!E212),Taxa_PivotTable!E212,\"\")","v":""},"","","",{"$f":"IF(ISNUMBER(Taxa_PivotTable!F212),Taxa_PivotTable!F212,\"\")","v":""},"","","",{"$f":"IF(ISNUMBER(Taxa_PivotTable!G212),Taxa_PivotTable!G212,\"\")","v":""},"","","",{"$f":"IF(ISNUMBER(Taxa_PivotTable!H212),Taxa_PivotTable!H212,\"\")","v":""},"","","",{"$f":"IF(ISNUMBER(Taxa_PivotTable!I212),Taxa_PivotTable!I212,\"\")","v":""},"","","",{"$f":"IF(ISNUMBER(Taxa_PivotTable!J212),Taxa_PivotTable!J212,\"\")","v":""},"","","",{"$f":"IF(ISNUMBER(Taxa_PivotTable!K212),Taxa_PivotTable!K212,\"\")","v":""},"","",""]
[{"$f":"Taxa_PivotTable!A213","v":{"$error":"#N/A"}},{"$f":"IF(Taxa_PivotTable!B213=\"\",\"\",Taxa_PivotTable!B213)","v":""},{"$f":"IF(ISNUMBER(VLOOKUP(B213,UKOptima!A:J,10,FALSE)),VLOOKUP(B213,UKOptima!A:J,10,FALSE),\"\")","v":""},{"$f":"IF(ISNUMBER(Taxa_PivotTable!C213),Taxa_PivotTable!C213,\"\")","v":""},"","","",{"$f":"IF(ISNUMBER(Taxa_PivotTable!D213),Taxa_PivotTable!D213,\"\")","v":""},"","","",{"$f":"IF(ISNUMBER(Taxa_PivotTable!E213),Taxa_PivotTable!E213,\"\")","v":""},"","","",{"$f":"IF(ISNUMBER(Taxa_PivotTable!F213),Taxa_PivotTable!F213,\"\")","v":""},"","","",{"$f":"IF(ISNUMBER(Taxa_PivotTable!G213),Taxa_PivotTable!G213,\"\")","v":""},"","","",{"$f":"IF(ISNUMBER(Taxa_PivotTable!H213),Taxa_PivotTable!H213,\"\")","v":""},"",{"$f":"IF(COUNT(Y213,$C213)=2,(Y213)*$C213,\"\")","v":""},"",{"$f":"IF(ISNUMBER(Taxa_PivotTable!I213),Taxa_PivotTable!I213,\"\")","v":""},"",{"$f":"IF(COUNT(AC213,$C213)=2,(AC213)*$C213,\"\")","v":""},"",{"$f":"IF(ISNUMBER(Taxa_PivotTable!J213),Taxa_PivotTable!J213,\"\")","v":""},"",{"$f":"IF(COUNT(AG213,$C213)=2,(AG213)*$C213,\"\")","v":""},"",{"$f":"IF(ISNUMBER(Taxa_PivotTable!K213),Taxa_PivotTable!K213,\"\")","v":""},"",{"$f":"IF(COUNT(AK213,$C213)=2,(AK213)*$C213,\"\")","v":""},""]
[{"$f":"Taxa_PivotTable!A214","v":{"$error":"#N/A"}},{"$f":"IF(Taxa_PivotTable!B214=\"\",\"\",Taxa_PivotTable!B214)","v":""},{"$f":"IF(ISNUMBER(VLOOKUP(B214,UKOptima!A:J,10,FALSE)),VLOOKUP(B214,UKOptima!A:J,10,FALSE),\"\")","v":""},{"$f":"IF(ISNUMBER(Taxa_PivotTable!C214),Taxa_PivotTable!C214,\"\")","v":""},"","","",{"$f":"IF(ISNUMBER(Taxa_PivotTable!D214),Taxa_PivotTable!D214,\"\")","v":""},"","","",{"$f":"IF(ISNUMBER(Taxa_PivotTable!E214),Taxa_PivotTable!E214,\"\")","v":""},"","","",{"$f":"IF(ISNUMBER(Taxa_PivotTable!F214),Taxa_PivotTable!F214,\"\")","v":""},"","","",{"$f":"IF(ISNUMBER(Taxa_PivotTable!G214),Taxa_PivotTable!G214,\"\")","v":""},"","","",{"$f":"IF(ISNUMBER(Taxa_PivotTable!H214),Taxa_PivotTable!H214,\"\")","v":""},{"$f":"IF(ISNUMBER(X214),LOG(ROUND(X214,6)),\"\")","v":""},"","",{"$f":"IF(ISNUMBER(Taxa_PivotTable!I214),Taxa_PivotTable!I214,\"\")","v":""},{"$f":"IF(ISNUMBER(AB214),LOG(ROUND(AB214,6)),\"\")","v":""},"","",{"$f":"IF(ISNUMBER(Taxa_PivotTable!J214),Taxa_PivotTable!J214,\"\")","v":""},{"$f":"IF(ISNUMBER(AF214),LOG(ROUND(AF214,6)),\"\")","v":""},"","",{"$f":"IF(ISNUMBER(Taxa_PivotTable!K214),Taxa_PivotTable!K214,\"\")","v":""},{"$f":"IF(ISNUMBER(AJ214),LOG(ROUND(AJ214,6)),\"\")","v":""},"",""]
[{"$f":"Taxa_PivotTable!A215","v":{"$error":"#N/A"}},{"$f":"IF(Taxa_PivotTable!B215=\"\",\"\",Taxa_PivotTable!B215)","v":""},{"$f":"IF(ISNUMBER(VLOOKUP(B215,UKOptima!A:J,10,FALSE)),VLOOKUP(B215,UKOptima!A:J,10,FALSE),\"\")","v":""},{"$f":"IF(ISNUMBER(Taxa_PivotTable!C215),Taxa_PivotTable!C215,\"\")","v":""},{"$f":"IF(ISNUMBER(D215),LOG(ROUND(D215,6)),\"\")","v":""},"",{"$f":"IF(AND(ISNUMBER(D215),LEFT($B215,2)=\"01\"),D215/10^6,\"\")","v":""},{"$f":"IF(ISNUMBER(Taxa_PivotTable!D215),Taxa_PivotTable!D215,\"\")","v":""},{"$f":"IF(ISNUMBER(H215),LOG(ROUND(H215,6)),\"\")","v":""},"",{"$f":"IF(AND(ISNUMBER(H215),LEFT($B215,2)=\"01\"),H215/10^6,\"\")","v":""},{"$f":"IF(ISNUMBER(Taxa_PivotTable!E215),Taxa_PivotTable!E215,\"\")","v":""},{"$f":"IF(ISNUMBER(L215),LOG(ROUND(L215,6)),\"\")","v":""},"",{"$f":"IF(AND(ISNUMBER(L215),LEFT($B215,2)=\"01\"),L215/10^6,\"\")","v":""},{"$f":"IF(ISNUMBER(Taxa_PivotTable!F215),Taxa_PivotTable!F215,\"\")","v":""},{"$f":"IF(ISNUMBER(P215),LOG(ROUND(P215,6)),\"\")","v":""},"",{"$f":"IF(AND(ISNUMBER(P215),LEFT($B215,2)=\"01\"),P215/10^6,\"\")","v":""},{"$f":"IF(ISNUMBER(Taxa_PivotTable!G215),Taxa_PivotTable!G215,\"\")","v":""},{"$f":"IF(ISNUMBER(T215),LOG(ROUND(T215,6)),\"\")","v":""},"",{"$f":"IF(AND(ISNUMBER(T215),LEFT($B215,2)=\"01\"),T215/10^6,\"\")","v":""},{"$f":"IF(ISNUMBER(Taxa_PivotTable!H215),Taxa_PivotTable!H215,\"\")","v":""},"","",{"$f":"IF(AND(ISNUMBER(X215),LEFT($B215,2)=\"01\"),X215/10^6,\"\")","v":""},{"$f":"IF(ISNUMBER(Taxa_PivotTable!I215),Taxa_PivotTable!I215,\"\")","v":""},"","",{"$f":"IF(AND(ISNUMBER(AB215),LEFT($B215,2)=\"01\"),AB215/10^6,\"\")","v":""},{"$f":"IF(ISNUMBER(Taxa_PivotTable!J215),Taxa_PivotTable!J215,\"\")","v":""},"","",{"$f":"IF(AND(ISNUMBER(AF215),LEFT($B215,2)=\"01\"),AF215/10^6,\"\")","v":""},{"$f":"IF(ISNUMBER(Taxa_PivotTable!K215),Taxa_PivotTable!K215,\"\")","v":""},"","",{"$f":"IF(AND(ISNUMBER(AJ215),LEFT($B215,2)=\"01\"),AJ215/10^6,\"\")","v":""}]
[{"$f":"Taxa_PivotTable!A216","v":{"$error":"#N/A"}},{"$f":"IF(Taxa_PivotTable!B216=\"\",\"\",Taxa_PivotTable!B216)","v":""},{"$f":"IF(ISNUMBER(VLOOKUP(B216,UKOptima!A:J,10,FALSE)),VLOOKUP(B216,UKOptima!A:J,10,FALSE),\"\")","v":""},{"$f":"IF(ISNUMBER(Taxa_PivotTable!C216),Taxa_PivotTable!C216,\"\")","v":""},"","","",{"$f":"IF(ISNUMBER(Taxa_PivotTable!D216),Taxa_PivotTable!D216,\"\")","v":""},"","","",{"$f":"IF(ISNUMBER(Taxa_PivotTable!E216),Taxa_PivotTable!E216,\"\")","v":""},"","","",{"$f":"IF(ISNUMBER(Taxa_PivotTable!F216),Taxa_PivotTable!F216,\"\")","v":""},"","","",{"$f":"IF(ISNUMBER(Taxa_PivotTable!G216),Taxa_PivotTable!G216,\"\")","v":""},"","","",{"$f":"IF(ISNUMBER(Taxa_PivotTable!H216),Taxa_PivotTable!H216,\"\")","v":""},"","","",{"$f":"IF(ISNUMBER(Taxa_PivotTable!I216),Taxa_PivotTable!I216,\"\")","v":""},"","","",{"$f":"IF(ISNUMBER(Taxa_PivotTable!J216),Taxa_PivotTable!J216,\"\")","v":""},"","","",{"$f":"IF(ISNUMBER(Taxa_PivotTable!K216),Taxa_PivotTable!K216,\"\")","v":""},"","",""]
[{"$f":"Taxa_PivotTable!A217","v":{"$error":"#N/A"}},{"$f":"IF(Taxa_PivotTable!B217=\"\",\"\",Taxa_PivotTable!B217)","v":""},{"$f":"IF(ISNUMBER(VLOOKUP(B217,UKOptima!A:J,10,FALSE)),VLOOKUP(B217,UKOptima!A:J,10,FALSE),\"\")","v":""},{"$f":"IF(ISNUMBER(Taxa_PivotTable!C217),Taxa_PivotTable!C217,\"\")","v":""},"","","",{"$f":"IF(ISNUMBER(Taxa_PivotTable!D217),Taxa_PivotTable!D217,\"\")","v":""},"","","",{"$f":"IF(ISNUMBER(Taxa_PivotTable!E217),Taxa_PivotTable!E217,\"\")","v":""},"","","",{"$f":"IF(ISNUMBER(Taxa_PivotTable!F217),Taxa_PivotTable!F217,\"\")","v":""},"","","",{"$f":"IF(ISNUMBER(Taxa_PivotTable!G217),Taxa_PivotTable!G217,\"\")","v":""},"","","",{"$f":"IF(ISNUMBER(Taxa_PivotTable!H217),Taxa_PivotTable!H217,\"\")","v":""},"","","",{"$f":"IF(ISNUMBER(Taxa_PivotTable!I217),Taxa_PivotTable!I217,\"\")","v":""},"","","",{"$f":"IF(ISNUMBER(Taxa_PivotTable!J217),Taxa_PivotTable!J217,\"\")","v":""},"","","",{"$f":"IF(ISNUMBER(Taxa_PivotTable!K217),Taxa_PivotTable!K217,\"\")","v":""},"","",""]
[{"$f":"Taxa_PivotTable!A218","v":{"$error":"#N/A"}},{"$f":"IF(Taxa_PivotTable!B218=\"\",\"\",Taxa_PivotTable!B218)","v":""},{"$f":"IF(ISNUMBER(VLOOKUP(B218,UKOptima!A:J,10,FALSE)),VLOOKUP(B218,UKOptima!A:J,10,FALSE),\"\")","v":""},{"$f":"IF(ISNUMBER(Taxa_PivotTable!C218),Taxa_PivotTable!C218,\"\")","v":""},"","","",{"$f":"IF(ISNUMBER(Taxa_PivotTable!D218),Taxa_PivotTable!D218,\"\")","v":""},"","","",{"$f":"IF(ISNUMBER(Taxa_PivotTable!E218),Taxa_PivotTable!E218,\"\")","v":""},"","","",{"$f":"IF(ISNUMBER(Taxa_PivotTable!F218),Taxa_PivotTable!F218,\"\")","v":""},"","","",{"$f":"IF(ISNUMBER(Taxa_PivotTable!G218),Taxa_PivotTable!G218,\"\")","v":""},"","","",{"$f":"IF(ISNUMBER(Taxa_PivotTable!H218),Taxa_PivotTable!H218,\"\")","v":""},"","","",{"$f":"IF(ISNUMBER(Taxa_PivotTable!I218),Taxa_PivotTable!I218,\"\")","v":""},"","","",{"$f":"IF(ISNUMBER(Taxa_PivotTable!J218),Taxa_PivotTable!J218,\"\")","v":""},"","","",{"$f":"IF(ISNUMBER(Taxa_PivotTable!K218),Taxa_PivotTable!K218,\"\")","v":""},"","",""]
[{"$f":"Taxa_PivotTable!A219","v":{"$error":"#N/A"}},{"$f":"IF(Taxa_PivotTable!B219=\"\",\"\",Taxa_PivotTable!B219)","v":""},{"$f":"IF(ISNUMBER(VLOOKUP(B219,UKOptima!A:J,10,FALSE)),VLOOKUP(B219,UKOptima!A:J,10,FALSE),\"\")","v":""},{"$f":"IF(ISNUMBER(Taxa_PivotTable!C219),Taxa_PivotTable!C219,\"\")","v":""},"","","",{"$f":"IF(ISNUMBER(Taxa_PivotTable!D219),Taxa_PivotTable!D219,\"\")","v":""},"","","",{"$f":"IF(ISNUMBER(Taxa_PivotTable!E219),Taxa_PivotTable!E219,\"\")","v":""},"","","",{"$f":"IF(ISNUMBER(Taxa_PivotTable!F219),Taxa_PivotTable!F219,\"\")","v":""},"","","",{"$f":"IF(ISNUMBER(Taxa_PivotTable!G219),Taxa_PivotTable!G219,\"\")","v":""},"","","",{"$f":"IF(ISNUMBER(Taxa_PivotTable!H219),Taxa_PivotTable!H219,\"\")","v":""},"","","",{"$f":"IF(ISNUMBER(Taxa_PivotTable!I219),Taxa_PivotTable!I219,\"\")","v":""},"","","",{"$f":"IF(ISNUMBER(Taxa_PivotTable!J219),Taxa_PivotTable!J219,\"\")","v":""},"","","",{"$f":"IF(ISNUMBER(Taxa_PivotTable!K219),Taxa_PivotTable!K219,\"\")","v":""},"","",""]
[{"$f":"Taxa_PivotTable!A220","v":{"$error":"#N/A"}},{"$f":"IF(Taxa_PivotTable!B220=\"\",\"\",Taxa_PivotTable!B220)","v":""},{"$f":"IF(ISNUMBER(VLOOKUP(B220,UKOptima!A:J,10,FALSE)),VLOOKUP(B220,UKOptima!A:J,10,FALSE),\"\")","v":""},{"$f":"IF(ISNUMBER(Taxa_PivotTable!C220),Taxa_PivotTable!C220,\"\")","v":""},"","","",{"$f":"IF(ISNUMBER(Taxa_PivotTable!D220),Taxa_PivotTable!D220,\"\")","v":""},"","","",{"$f":"IF(ISNUMBER(Taxa_PivotTable!E220),Taxa_PivotTable!E220,\"\")","v":""},"","","",{"$f":"IF(ISNUMBER(Taxa_PivotTable!F220),Taxa_PivotTable!F220,\"\")","v":""},"","","",{"$f":"IF(ISNUMBER(Taxa_PivotTable!G220),Taxa_PivotTable!G220,\"\")","v":""},"","","",{"$f":"IF(ISNUMBER(Taxa_PivotTable!H220),Taxa_PivotTable!H220,\"\")","v":""},"","","",{"$f":"IF(ISNUMBER(Taxa_PivotTable!I220),Taxa_PivotTable!I220,\"\")","v":""},"","","",{"$f":"IF(ISNUMBER(Taxa_PivotTable!J220),Taxa_PivotTable!J220,\"\")","v":""},"","","",{"$f":"IF(ISNUMBER(Taxa_PivotTable!K220),Taxa_PivotTable!K220,\"\")","v":""},"","",""]
[{"$f":"Taxa_PivotTable!A221","v":{"$error":"#N/A"}},{"$f":"IF(Taxa_PivotTable!B221=\"\",\"\",Taxa_PivotTable!B221)","v":""},{"$f":"IF(ISNUMBER(VLOOKUP(B221,UKOptima!A:J,10,FALSE)),VLOOKUP(B221,UKOptima!A:J,10,FALSE),\"\")","v":""},{"$f":"IF(ISNUMBER(Taxa_PivotTable!C221),Taxa_PivotTable!C221,\"\")","v":""},"","","",{"$f":"IF(ISNUMBER(Taxa_PivotTable!D221),Taxa_PivotTable!D221,\"\")","v":""},"","","",{"$f":"IF(ISNUMBER(Taxa_PivotTable!E221),Taxa_PivotTable!E221,\"\")","v":""},"","","",{"$f":"IF(ISNUMBER(Taxa_PivotTable!F221),Taxa_PivotTable!F221,\"\")","v":""},"","","",{"$f":"IF(ISNUMBER(Taxa_PivotTable!G221),Taxa_PivotTable!G221,\"\")","v":""},"","","",{"$f":"IF(ISNUMBER(Taxa_PivotTable!H221),Taxa_PivotTable!H221,\"\")","v":""},"","","",{"$f":"IF(ISNUMBER(Taxa_PivotTable!I221),Taxa_PivotTable!I221,\"\")","v":""},"","","",{"$f":"IF(ISNUMBER(Taxa_PivotTable!J221),Taxa_PivotTable!J221,\"\")","v":""},"","","",{"$f":"IF(ISNUMBER(Taxa_PivotTable!K221),Taxa_PivotTable!K221,\"\")","v":""},"","",""]
[{"$f":"Taxa_PivotTable!A222","v":{"$error":"#N/A"}},{"$f":"IF(Taxa_PivotTable!B222=\"\",\"\",Taxa_PivotTable!B222)","v":""},{"$f":"IF(ISNUMBER(VLOOKUP(B222,UKOptima!A:J,10,FALSE)),VLOOKUP(B222,UKOptima!A:J,10,FALSE),\"\")","v":""},{"$f":"IF(ISNUMBER(Taxa_PivotTable!C222),Taxa_PivotTable!C222,\"\")","v":""},"","","",{"$f":"IF(ISNUMBER(Taxa_PivotTable!D222),Taxa_PivotTable!D222,\"\")","v":""},"","","",{"$f":"IF(ISNUMBER(Taxa_PivotTable!E222),Taxa_PivotTable!E222,\"\")","v":""},"","","",{"$f":"IF(ISNUMBER(Taxa_PivotTable!F222),Taxa_PivotTable!F222,\"\")","v":""},"","","",{"$f":"IF(ISNUMBER(Taxa_PivotTable!G222),Taxa_PivotTable!G222,\"\")","v":""},"","","",{"$f":"IF(ISNUMBER(Taxa_PivotTable!H222),Taxa_PivotTable!H222,\"\")","v":""},"","","",{"$f":"IF(ISNUMBER(Taxa_PivotTable!I222),Taxa_PivotTable!I222,\"\")","v":""},"","","",{"$f":"IF(ISNUMBER(Taxa_PivotTable!J222),Taxa_PivotTable!J222,\"\")","v":""},"","","",{"$f":"IF(ISNUMBER(Taxa_PivotTable!K222),Taxa_PivotTable!K222,\"\")","v":""},"","",""]
[{"$f":"Taxa_PivotTable!A223","v":{"$error":"#N/A"}},{"$f":"IF(Taxa_PivotTable!B223=\"\",\"\",Taxa_PivotTable!B223)","v":""},{"$f":"IF(ISNUMBER(VLOOKUP(B223,UKOptima!A:J,10,FALSE)),VLOOKUP(B223,UKOptima!A:J,10,FALSE),\"\")","v":""},{"$f":"IF(ISNUMBER(Taxa_PivotTable!C223),Taxa_PivotTable!C223,\"\")","v":""},"","","",{"$f":"IF(ISNUMBER(Taxa_PivotTable!D223),Taxa_PivotTable!D223,\"\")","v":""},"","","",{"$f":"IF(ISNUMBER(Taxa_PivotTable!E223),Taxa_PivotTable!E223,\"\")","v":""},"","","",{"$f":"IF(ISNUMBER(Taxa_PivotTable!F223),Taxa_PivotTable!F223,\"\")","v":""},"","","",{"$f":"IF(ISNUMBER(Taxa_PivotTable!G223),Taxa_PivotTable!G223,\"\")","v":""},"","","",{"$f":"IF(ISNUMBER(Taxa_PivotTable!H223),Taxa_PivotTable!H223,\"\")","v":""},"","","",{"$f":"IF(ISNUMBER(Taxa_PivotTable!I223),Taxa_PivotTable!I223,\"\")","v":""},"","","",{"$f":"IF(ISNUMBER(Taxa_PivotTable!J223),Taxa_PivotTable!J223,\"\")","v":""},"","","",{"$f":"IF(ISNUMBER(Taxa_PivotTable!K223),Taxa_PivotTable!K223,\"\")","v":""},"","",""]
[{"$f":"Taxa_PivotTable!A224","v":{"$error":"#N/A"}},{"$f":"IF(Taxa_PivotTable!B224=\"\",\"\",Taxa_PivotTable!B224)","v":""},{"$f":"IF(ISNUMBER(VLOOKUP(B224,UKOptima!A:J,10,FALSE)),VLOOKUP(B224,UKOptima!A:J,10,FALSE),\"\")","v":""},{"$f":"IF(ISNUMBER(Taxa_PivotTable!C224),Taxa_PivotTable!C224,\"\")","v":""},"","","",{"$f":"IF(ISNUMBER(Taxa_PivotTable!D224),Taxa_PivotTable!D224,\"\")","v":""},"","","",{"$f":"IF(ISNUMBER(Taxa_PivotTable!E224),Taxa_PivotTable!E224,\"\")","v":""},"","","",{"$f":"IF(ISNUMBER(Taxa_PivotTable!F224),Taxa_PivotTable!F224,\"\")","v":""},"","","",{"$f":"IF(ISNUMBER(Taxa_PivotTable!G224),Taxa_PivotTable!G224,\"\")","v":""},"","","",{"$f":"IF(ISNUMBER(Taxa_PivotTable!H224),Taxa_PivotTable!H224,\"\")","v":""},"","","",{"$f":"IF(ISNUMBER(Taxa_PivotTable!I224),Taxa_PivotTable!I224,\"\")","v":""},"","","",{"$f":"IF(ISNUMBER(Taxa_PivotTable!J224),Taxa_PivotTable!J224,\"\")","v":""},"","","",{"$f":"IF(ISNUMBER(Taxa_PivotTable!K224),Taxa_PivotTable!K224,\"\")","v":""},"","",""]
[{"$f":"Taxa_PivotTable!A225","v":{"$error":"#N/A"}},{"$f":"IF(Taxa_PivotTable!B225=\"\",\"\",Taxa_PivotTable!B225)","v":""},{"$f":"IF(ISNUMBER(VLOOKUP(B225,UKOptima!A:J,10,FALSE)),VLOOKUP(B225,UKOptima!A:J,10,FALSE),\"\")","v":""},{"$f":"IF(ISNUMBER(Taxa_PivotTable!C225),Taxa_PivotTable!C225,\"\")","v":""},"","","",{"$f":"IF(ISNUMBER(Taxa_PivotTable!D225),Taxa_PivotTable!D225,\"\")","v":""},"","","",{"$f":"IF(ISNUMBER(Taxa_PivotTable!E225),Taxa_PivotTable!E225,\"\")","v":""},"","","",{"$f":"IF(ISNUMBER(Taxa_PivotTable!F225),Taxa_PivotTable!F225,\"\")","v":""},"","","",{"$f":"IF(ISNUMBER(Taxa_PivotTable!G225),Taxa_PivotTable!G225,\"\")","v":""},"","","",{"$f":"IF(ISNUMBER(Taxa_PivotTable!H225),Taxa_PivotTable!H225,\"\")","v":""},"","","",{"$f":"IF(ISNUMBER(Taxa_PivotTable!I225),Taxa_PivotTable!I225,\"\")","v":""},"","","",{"$f":"IF(ISNUMBER(Taxa_PivotTable!J225),Taxa_PivotTable!J225,\"\")","v":""},"","","",{"$f":"IF(ISNUMBER(Taxa_PivotTable!K225),Taxa_PivotTable!K225,\"\")","v":""},"","",""]
[{"$f":"Taxa_PivotTable!A226","v":{"$error":"#N/A"}},{"$f":"IF(Taxa_PivotTable!B226=\"\",\"\",Taxa_PivotTable!B226)","v":""},{"$f":"IF(ISNUMBER(VLOOKUP(B226,UKOptima!A:J,10,FALSE)),VLOOKUP(B226,UKOptima!A:J,10,FALSE),\"\")","v":""},{"$f":"IF(ISNUMBER(Taxa_PivotTable!C226),Taxa_PivotTable!C226,\"\")","v":""},"","","",{"$f":"IF(ISNUMBER(Taxa_PivotTable!D226),Taxa_PivotTable!D226,\"\")","v":""},"","","",{"$f":"IF(ISNUMBER(Taxa_PivotTable!E226),Taxa_PivotTable!E226,\"\")","v":""},"","","",{"$f":"IF(ISNUMBER(Taxa_PivotTable!F226),Taxa_PivotTable!F226,\"\")","v":""},"","","",{"$f":"IF(ISNUMBER(Taxa_PivotTable!G226),Taxa_PivotTable!G226,\"\")","v":""},"","","",{"$f":"IF(ISNUMBER(Taxa_PivotTable!H226),Taxa_PivotTable!H226,\"\")","v":""},"","","",{"$f":"IF(ISNUMBER(Taxa_PivotTable!I226),Taxa_PivotTable!I226,\"\")","v":""},"","","",{"$f":"IF(ISNUMBER(Taxa_PivotTable!J226),Taxa_PivotTable!J226,\"\")","v":""},"","","",{"$f":"IF(ISNUMBER(Taxa_PivotTable!K226),Taxa_PivotTable!K226,\"\")","v":""},"","",""]
[{"$f":"Taxa_PivotTable!A227","v":{"$error":"#N/A"}},{"$f":"IF(Taxa_PivotTable!B227=\"\",\"\",Taxa_PivotTable!B227)","v":""},{"$f":"IF(ISNUMBER(VLOOKUP(B227,UKOptima!A:J,10,FALSE)),VLOOKUP(B227,UKOptima!A:J,10,FALSE),\"\")","v":""},{"$f":"IF(ISNUMBER(Taxa_PivotTable!C227),Taxa_PivotTable!C227,\"\")","v":""},"","","",{"$f":"IF(ISNUMBER(Taxa_PivotTable!D227),Taxa_PivotTable!D227,\"\")","v":""},"","","",{"$f":"IF(ISNUMBER(Taxa_PivotTable!E227),Taxa_PivotTable!E227,\"\")","v":""},"","","",{"$f":"IF(ISNUMBER(Taxa_PivotTable!F227),Taxa_PivotTable!F227,\"\")","v":""},"","","",{"$f":"IF(ISNUMBER(Taxa_PivotTable!G227),Taxa_PivotTable!G227,\"\")","v":""},"","","",{"$f":"IF(ISNUMBER(Taxa_PivotTable!H227),Taxa_PivotTable!H227,\"\")","v":""},"","","",{"$f":"IF(ISNUMBER(Taxa_PivotTable!I227),Taxa_PivotTable!I227,\"\")","v":""},"","","",{"$f":"IF(ISNUMBER(Taxa_PivotTable!J227),Taxa_PivotTable!J227,\"\")","v":""},"","","",{"$f":"IF(ISNUMBER(Taxa_PivotTable!K227),Taxa_PivotTable!K227,\"\")","v":""},"","",""]
[{"$f":"Taxa_PivotTable!A228","v":{"$error":"#N/A"}},{"$f":"IF(Taxa_PivotTable!B228=\"\",\"\",Taxa_PivotTable!B228)","v":""},{"$f":"IF(ISNUMBER(VLOOKUP(B228,UKOptima!A:J,10,FALSE)),VLOOKUP(B228,UKOptima!A:J,10,FALSE),\"\")","v":""},{"$f":"IF(ISNUMBER(Taxa_PivotTable!C228),Taxa_PivotTable!C228,\"\")","v":""},"","","",{"$f":"IF(ISNUMBER(Taxa_PivotTable!D228),Taxa_PivotTable!D228,\"\")","v":""},"","","",{"$f":"IF(ISNUMBER(Taxa_PivotTable!E228),Taxa_PivotTable!E228,\"\")","v":""},"","","",{"$f":"IF(ISNUMBER(Taxa_PivotTable!F228),Taxa_PivotTable!F228,\"\")","v":""},"","","",{"$f":"IF(ISNUMBER(Taxa_PivotTable!G228),Taxa_PivotTable!G228,\"\")","v":""},"","","",{"$f":"IF(ISNUMBER(Taxa_PivotTable!H228),Taxa_PivotTable!H228,\"\")","v":""},"","","",{"$f":"IF(ISNUMBER(Taxa_PivotTable!I228),Taxa_PivotTable!I228,\"\")","v":""},"","","",{"$f":"IF(ISNUMBER(Taxa_PivotTable!J228),Taxa_PivotTable!J228,\"\")","v":""},"","","",{"$f":"IF(ISNUMBER(Taxa_PivotTable!K228),Taxa_PivotTable!K228,\"\")","v":""},"","",""]
[{"$f":"Taxa_PivotTable!A229","v":{"$error":"#N/A"}},{"$f":"IF(Taxa_PivotTable!B229=\"\",\"\",Taxa_PivotTable!B229)","v":""},{"$f":"IF(ISNUMBER(VLOOKUP(B229,UKOptima!A:J,10,FALSE)),VLOOKUP(B229,UKOptima!A:J,10,FALSE),\"\")","v":""},{"$f":"IF(ISNUMBER(Taxa_PivotTable!C229),Taxa_PivotTable!C229,\"\")","v":""},"","","",{"$f":"IF(ISNUMBER(Taxa_PivotTable!D229),Taxa_PivotTable!D229,\"\")","v":""},"","","",{"$f":"IF(ISNUMBER(Taxa_PivotTable!E229),Taxa_PivotTable!E229,\"\")","v":""},"","","",{"$f":"IF(ISNUMBER(Taxa_PivotTable!F229),Taxa_PivotTable!F229,\"\")","v":""},"","","",{"$f":"IF(ISNUMBER(Taxa_PivotTable!G229),Taxa_PivotTable!G229,\"\")","v":""},"","","",{"$f":"IF(ISNUMBER(Taxa_PivotTable!H229),Taxa_PivotTable!H229,\"\")","v":""},"","","",{"$f":"IF(ISNUMBER(Taxa_PivotTable!I229),Taxa_PivotTable!I229,\"\")","v":""},"","","",{"$f":"IF(ISNUMBER(Taxa_PivotTable!J229),Taxa_PivotTable!J229,\"\")","v":""},"","","",{"$f":"IF(ISNUMBER(Taxa_PivotTable!K229),Taxa_PivotTable!K229,\"\")","v":""},"","",""]
[{"$f":"Taxa_PivotTable!A230","v":{"$error":"#N/A"}},{"$f":"IF(Taxa_PivotTable!B230=\"\",\"\",Taxa_PivotTable!B230)","v":""},{"$f":"IF(ISNUMBER(VLOOKUP(B230,UKOptima!A:J,10,FALSE)),VLOOKUP(B230,UKOptima!A:J,10,FALSE),\"\")","v":""},{"$f":"IF(ISNUMBER(Taxa_PivotTable!C230),Taxa_PivotTable!C230,\"\")","v":""},"","","",{"$f":"IF(ISNUMBER(Taxa_PivotTable!D230),Taxa_PivotTable!D230,\"\")","v":""},"","","",{"$f":"IF(ISNUMBER(Taxa_PivotTable!E230),Taxa_PivotTable!E230,\"\")","v":""},"","","",{"$f":"IF(ISNUMBER(Taxa_PivotTable!F230),Taxa_PivotTable!F230,\"\")","v":""},"","","",{"$f":"IF(ISNUMBER(Taxa_PivotTable!G230),Taxa_PivotTable!G230,\"\")","v":""},"","","",{"$f":"IF(ISNUMBER(Taxa_PivotTable!H230),Taxa_PivotTable!H230,\"\")","v":""},"","","",{"$f":"IF(ISNUMBER(Taxa_PivotTable!I230),Taxa_PivotTable!I230,\"\")","v":""},"","","",{"$f":"IF(ISNUMBER(Taxa_PivotTable!J230),Taxa_PivotTable!J230,\"\")","v":""},"","","",{"$f":"IF(ISNUMBER(Taxa_PivotTable!K230),Taxa_PivotTable!K230,\"\")","v":""},"","",""]
[{"$f":"Taxa_PivotTable!A231","v":{"$error":"#N/A"}},{"$f":"IF(Taxa_PivotTable!B231=\"\",\"\",Taxa_PivotTable!B231)","v":""},{"$f":"IF(ISNUMBER(VLOOKUP(B231,UKOptima!A:J,10,FALSE)),VLOOKUP(B231,UKOptima!A:J,10,FALSE),\"\")","v":""},{"$f":"IF(ISNUMBER(Taxa_PivotTable!C231),Taxa_PivotTable!C231,\"\")","v":""},"","","",{"$f":"IF(ISNUMBER(Taxa_PivotTable!D231),Taxa_PivotTable!D231,\"\")","v":""},"","","",{"$f":"IF(ISNUMBER(Taxa_PivotTable!E231),Taxa_PivotTable!E231,\"\")","v":""},"","","",{"$f":"IF(ISNUMBER(Taxa_PivotTable!F231),Taxa_PivotTable!F231,\"\")","v":""},"","","",{"$f":"IF(ISNUMBER(Taxa_PivotTable!G231),Taxa_PivotTable!G231,\"\")","v":""},"","","",{"$f":"IF(ISNUMBER(Taxa_PivotTable!H231),Taxa_PivotTable!H231,\"\")","v":""},"","","",{"$f":"IF(ISNUMBER(Taxa_PivotTable!I231),Taxa_PivotTable!I231,\"\")","v":""},"","","",{"$f":"IF(ISNUMBER(Taxa_PivotTable!J231),Taxa_PivotTable!J231,\"\")","v":""},"","","",{"$f":"IF(ISNUMBER(Taxa_PivotTable!K231),Taxa_PivotTable!K231,\"\")","v":""},"","",""]
[{"$f":"Taxa_PivotTable!A232","v":{"$error":"#N/A"}},{"$f":"IF(Taxa_PivotTable!B232=\"\",\"\",Taxa_PivotTable!B232)","v":""},{"$f":"IF(ISNUMBER(VLOOKUP(B232,UKOptima!A:J,10,FALSE)),VLOOKUP(B232,UKOptima!A:J,10,FALSE),\"\")","v":""},{"$f":"IF(ISNUMBER(Taxa_PivotTable!C232),Taxa_PivotTable!C232,\"\")","v":""},"","","",{"$f":"IF(ISNUMBER(Taxa_PivotTable!D232),Taxa_PivotTable!D232,\"\")","v":""},"","","",{"$f":"IF(ISNUMBER(Taxa_PivotTable!E232),Taxa_PivotTable!E232,\"\")","v":""},"","","",{"$f":"IF(ISNUMBER(Taxa_PivotTable!F232),Taxa_PivotTable!F232,\"\")","v":""},"","","",{"$f":"IF(ISNUMBER(Taxa_PivotTable!G232),Taxa_PivotTable!G232,\"\")","v":""},"","","",{"$f":"IF(ISNUMBER(Taxa_PivotTable!H232),Taxa_PivotTable!H232,\"\")","v":""},"","","",{"$f":"IF(ISNUMBER(Taxa_PivotTable!I232),Taxa_PivotTable!I232,\"\")","v":""},"","","",{"$f":"IF(ISNUMBER(Taxa_PivotTable!J232),Taxa_PivotTable!J232,\"\")","v":""},"","","",{"$f":"IF(ISNUMBER(Taxa_PivotTable!K232),Taxa_PivotTable!K232,\"\")","v":""},"","",""]
[{"$f":"Taxa_PivotTable!A233","v":{"$error":"#N/A"}},{"$f":"IF(Taxa_PivotTable!B233=\"\",\"\",Taxa_PivotTable!B233)","v":""},{"$f":"IF(ISNUMBER(VLOOKUP(B233,UKOptima!A:J,10,FALSE)),VLOOKUP(B233,UKOptima!A:J,10,FALSE),\"\")","v":""},{"$f":"IF(ISNUMBER(Taxa_PivotTable!C233),Taxa_PivotTable!C233,\"\")","v":""},"","","",{"$f":"IF(ISNUMBER(Taxa_PivotTable!D233),Taxa_PivotTable!D233,\"\")","v":""},"","","",{"$f":"IF(ISNUMBER(Taxa_PivotTable!E233),Taxa_PivotTable!E233,\"\")","v":""},"","","",{"$f":"IF(ISNUMBER(Taxa_PivotTable!F233),Taxa_PivotTable!F233,\"\")","v":""},"","","",{"$f":"IF(ISNUMBER(Taxa_PivotTable!G233),Taxa_PivotTable!G233,\"\")","v":""},"","","",{"$f":"IF(ISNUMBER(Taxa_PivotTable!H233),Taxa_PivotTable!H233,\"\")","v":""},"","","",{"$f":"IF(ISNUMBER(Taxa_PivotTable!I233),Taxa_PivotTable!I233,\"\")","v":""},"","","",{"$f":"IF(ISNUMBER(Taxa_PivotTable!J233),Taxa_PivotTable!J233,\"\")","v":""},"","","",{"$f":"IF(ISNUMBER(Taxa_PivotTable!K233),Taxa_PivotTable!K233,\"\")","v":""},"","",""]
[{"$f":"Taxa_PivotTable!A234","v":{"$error":"#N/A"}},{"$f":"IF(Taxa_PivotTable!B234=\"\",\"\",Taxa_PivotTable!B234)","v":""},{"$f":"IF(ISNUMBER(VLOOKUP(B234,UKOptima!A:J,10,FALSE)),VLOOKUP(B234,UKOptima!A:J,10,FALSE),\"\")","v":""},{"$f":"IF(ISNUMBER(Taxa_PivotTable!C234),Taxa_PivotTable!C234,\"\")","v":""},"","","",{"$f":"IF(ISNUMBER(Taxa_PivotTable!D234),Taxa_PivotTable!D234,\"\")","v":""},"","","",{"$f":"IF(ISNUMBER(Taxa_PivotTable!E234),Taxa_PivotTable!E234,\"\")","v":""},"","","",{"$f":"IF(ISNUMBER(Taxa_PivotTable!F234),Taxa_PivotTable!F234,\"\")","v":""},"","","",{"$f":"IF(ISNUMBER(Taxa_PivotTable!G234),Taxa_PivotTable!G234,\"\")","v":""},"","","",{"$f":"IF(ISNUMBER(Taxa_PivotTable!H234),Taxa_PivotTable!H234,\"\")","v":""},"","","",{"$f":"IF(ISNUMBER(Taxa_PivotTable!I234),Taxa_PivotTable!I234,\"\")","v":""},"","","",{"$f":"IF(ISNUMBER(Taxa_PivotTable!J234),Taxa_PivotTable!J234,\"\")","v":""},"","","",{"$f":"IF(ISNUMBER(Taxa_PivotTable!K234),Taxa_PivotTable!K234,\"\")","v":""},"","",""]
[{"$f":"Taxa_PivotTable!A235","v":{"$error":"#N/A"}},{"$f":"IF(Taxa_PivotTable!B235=\"\",\"\",Taxa_PivotTable!B235)","v":""},{"$f":"IF(ISNUMBER(VLOOKUP(B235,UKOptima!A:J,10,FALSE)),VLOOKUP(B235,UKOptima!A:J,10,FALSE),\"\")","v":""},{"$f":"IF(ISNUMBER(Taxa_PivotTable!C235),Taxa_PivotTable!C235,\"\")","v":""},"","","",{"$f":"IF(ISNUMBER(Taxa_PivotTable!D235),Taxa_PivotTable!D235,\"\")","v":""},"","","",{"$f":"IF(ISNUMBER(Taxa_PivotTable!E235),Taxa_PivotTable!E235,\"\")","v":""},"","","",{"$f":"IF(ISNUMBER(Taxa_PivotTable!F235),Taxa_PivotTable!F235,\"\")","v":""},"","","",{"$f":"IF(ISNUMBER(Taxa_PivotTable!G235),Taxa_PivotTable!G235,\"\")","v":""},"","","",{"$f":"IF(ISNUMBER(Taxa_PivotTable!H235),Taxa_PivotTable!H235,\"\")","v":""},"","","",{"$f":"IF(ISNUMBER(Taxa_PivotTable!I235),Taxa_PivotTable!I235,\"\")","v":""},"","","",{"$f":"IF(ISNUMBER(Taxa_PivotTable!J235),Taxa_PivotTable!J235,\"\")","v":""},"","","",{"$f":"IF(ISNUMBER(Taxa_PivotTable!K235),Taxa_PivotTable!K235,\"\")","v":""},"","",""]
[{"$f":"Taxa_PivotTable!A236","v":{"$error":"#N/A"}},{"$f":"IF(Taxa_PivotTable!B236=\"\",\"\",Taxa_PivotTable!B236)","v":""},{"$f":"IF(ISNUMBER(VLOOKUP(B236,UKOptima!A:J,10,FALSE)),VLOOKUP(B236,UKOptima!A:J,10,FALSE),\"\")","v":""},{"$f":"IF(ISNUMBER(Taxa_PivotTable!C236),Taxa_PivotTable!C236,\"\")","v":""},"","","",{"$f":"IF(ISNUMBER(Taxa_PivotTable!D236),Taxa_PivotTable!D236,\"\")","v":""},"","","",{"$f":"IF(ISNUMBER(Taxa_PivotTable!E236),Taxa_PivotTable!E236,\"\")","v":""},"","","",{"$f":"IF(ISNUMBER(Taxa_PivotTable!F236),Taxa_PivotTable!F236,\"\")","v":""},"","","",{"$f":"IF(ISNUMBER(Taxa_PivotTable!G236),Taxa_PivotTable!G236,\"\")","v":""},"","","",{"$f":"IF(ISNUMBER(Taxa_PivotTable!H236),Taxa_PivotTable!H236,\"\")","v":""},"","","",{"$f":"IF(ISNUMBER(Taxa_PivotTable!I236),Taxa_PivotTable!I236,\"\")","v":""},"","","",{"$f":"IF(ISNUMBER(Taxa_PivotTable!J236),Taxa_PivotTable!J236,\"\")","v":""},"","","",{"$f":"IF(ISNUMBER(Taxa_PivotTable!K236),Taxa_PivotTable!K236,\"\")","v":""},"","",""]
[{"$f":"Taxa_PivotTable!A237","v":{"$error":"#N/A"}},{"$f":"IF(Taxa_PivotTable!B237=\"\",\"\",Taxa_PivotTable!B237)","v":""},{"$f":"IF(ISNUMBER(VLOOKUP(B237,UKOptima!A:J,10,FALSE)),VLOOKUP(B237,UKOptima!A:J,10,FALSE),\"\")","v":""},{"$f":"IF(ISNUMBER(Taxa_PivotTable!C237),Taxa_PivotTable!C237,\"\")","v":""},"","","",{"$f":"IF(ISNUMBER(Taxa_PivotTable!D237),Taxa_PivotTable!D237,\"\")","v":""},"","","",{"$f":"IF(ISNUMBER(Taxa_PivotTable!E237),Taxa_PivotTable!E237,\"\")","v":""},"","","",{"$f":"IF(ISNUMBER(Taxa_PivotTable!F237),Taxa_PivotTable!F237,\"\")","v":""},"","","",{"$f":"IF(ISNUMBER(Taxa_PivotTable!G237),Taxa_PivotTable!G237,\"\")","v":""},"","","",{"$f":"IF(ISNUMBER(Taxa_PivotTable!H237),Taxa_PivotTable!H237,\"\")","v":""},"","","",{"$f":"IF(ISNUMBER(Taxa_PivotTable!I237),Taxa_PivotTable!I237,\"\")","v":""},"","","",{"$f":"IF(ISNUMBER(Taxa_PivotTable!J237),Taxa_PivotTable!J237,\"\")","v":""},"","","",{"$f":"IF(ISNUMBER(Taxa_PivotTable!K237),Taxa_PivotTable!K237,\"\")","v":""},"","",""]
[{"$f":"Taxa_PivotTable!A238","v":{"$error":"#N/A"}},{"$f":"IF(Taxa_PivotTable!B238=\"\",\"\",Taxa_PivotTable!B238)","v":""},{"$f":"IF(ISNUMBER(VLOOKUP(B238,UKOptima!A:J,10,FALSE)),VLOOKUP(B238,UKOptima!A:J,10,FALSE),\"\")","v":""},{"$f":"IF(ISNUMBER(Taxa_PivotTable!C238),Taxa_PivotTable!C238,\"\")","v":""},"","","",{"$f":"IF(ISNUMBER(Taxa_PivotTable!D238),Taxa_PivotTable!D238,\"\")","v":""},"","","",{"$f":"IF(ISNUMBER(Taxa_PivotTable!E238),Taxa_PivotTable!E238,\"\")","v":""},"","","",{"$f":"IF(ISNUMBER(Taxa_PivotTable!F238),Taxa_PivotTable!F238,\"\")","v":""},"","","",{"$f":"IF(ISNUMBER(Taxa_PivotTable!G238),Taxa_PivotTable!G238,\"\")","v":""},"","","",{"$f":"IF(ISNUMBER(Taxa_PivotTable!H238),Taxa_PivotTable!H238,\"\")","v":""},"","","",{"$f":"IF(ISNUMBER(Taxa_PivotTable!I238),Taxa_PivotTable!I238,\"\")","v":""},"","","",{"$f":"IF(ISNUMBER(Taxa_PivotTable!J238),Taxa_PivotTable!J238,\"\")","v":""},"","","",{"$f":"IF(ISNUMBER(Taxa_PivotTable!K238),Taxa_PivotTable!K238,\"\")","v":""},"","",""]
[{"$f":"Taxa_PivotTable!A239","v":{"$error":"#N/A"}},{"$f":"IF(Taxa_PivotTable!B239=\"\",\"\",Taxa_PivotTable!B239)","v":""},{"$f":"IF(ISNUMBER(VLOOKUP(B239,UKOptima!A:J,10,FALSE)),VLOOKUP(B239,UKOptima!A:J,10,FALSE),\"\")","v":""},{"$f":"IF(ISNUMBER(Taxa_PivotTable!C239),Taxa_PivotTable!C239,\"\")","v":""},"","","",{"$f":"IF(ISNUMBER(Taxa_PivotTable!D239),Taxa_PivotTable!D239,\"\")","v":""},"","","",{"$f":"IF(ISNUMBER(Taxa_PivotTable!E239),Taxa_PivotTable!E239,\"\")","v":""},"","","",{"$f":"IF(ISNUMBER(Taxa_PivotTable!F239),Taxa_PivotTable!F239,\"\")","v":""},"","","",{"$f":"IF(ISNUMBER(Taxa_PivotTable!G239),Taxa_PivotTable!G239,\"\")","v":""},"","","",{"$f":"IF(ISNUMBER(Taxa_PivotTable!H239),Taxa_PivotTable!H239,\"\")","v":""},"","","",{"$f":"IF(ISNUMBER(Taxa_PivotTable!I239),Taxa_PivotTable!I239,\"\")","v":""},"","","",{"$f":"IF(ISNUMBER(Taxa_PivotTable!J239),Taxa_PivotTable!J239,\"\")","v":""},"","","",{"$f":"IF(ISNUMBER(Taxa_PivotTable!K239),Taxa_PivotTable!K239,\"\")","v":""},"","",""]
[{"$f":"Taxa_PivotTable!A240","v":{"$error":"#N/A"}},{"$f":"IF(Taxa_PivotTable!B240=\"\",\"\",Taxa_PivotTable!B240)","v":""},{"$f":"IF(ISNUMBER(VLOOKUP(B240,UKOptima!A:J,10,FALSE)),VLOOKUP(B240,UKOptima!A:J,10,FALSE),\"\")","v":""},{"$f":"IF(ISNUMBER(Taxa_PivotTable!C240),Taxa_PivotTable!C240,\"\")","v":""},"","","",{"$f":"IF(ISNUMBER(Taxa_PivotTable!D240),Taxa_PivotTable!D240,\"\")","v":""},"","","",{"$f":"IF(ISNUMBER(Taxa_PivotTable!E240),Taxa_PivotTable!E240,\"\")","v":""},"","","",{"$f":"IF(ISNUMBER(Taxa_PivotTable!F240),Taxa_PivotTable!F240,\"\")","v":""},"","","",{"$f":"IF(ISNUMBER(Taxa_PivotTable!G240),Taxa_PivotTable!G240,\"\")","v":""},"","","",{"$f":"IF(ISNUMBER(Taxa_PivotTable!H240),Taxa_PivotTable!H240,\"\")","v":""},"","","",{"$f":"IF(ISNUMBER(Taxa_PivotTable!I240),Taxa_PivotTable!I240,\"\")","v":""},"","","",{"$f":"IF(ISNUMBER(Taxa_PivotTable!J240),Taxa_PivotTable!J240,\"\")","v":""},"","","",{"$f":"IF(ISNUMBER(Taxa_PivotTable!K240),Taxa_PivotTable!K240,\"\")","v":""},"","",""]
[{"$f":"Taxa_PivotTable!A241","v":{"$error":"#N/A"}},{"$f":"IF(Taxa_PivotTable!B241=\"\",\"\",Taxa_PivotTable!B241)","v":""},{"$f":"IF(ISNUMBER(VLOOKUP(B241,UKOptima!A:J,10,FALSE)),VLOOKUP(B241,UKOptima!A:J,10,FALSE),\"\")","v":""},{"$f":"IF(ISNUMBER(Taxa_PivotTable!C241),Taxa_PivotTable!C241,\"\")","v":""},"","","",{"$f":"IF(ISNUMBER(Taxa_PivotTable!D241),Taxa_PivotTable!D241,\"\")","v":""},"","","",{"$f":"IF(ISNUMBER(Taxa_PivotTable!E241),Taxa_PivotTable!E241,\"\")","v":""},"","","",{"$f":"IF(ISNUMBER(Taxa_PivotTable!F241),Taxa_PivotTable!F241,\"\")","v":""},"","","",{"$f":"IF(ISNUMBER(Taxa_PivotTable!G241),Taxa_PivotTable!G241,\"\")","v":""},"","","",{"$f":"IF(ISNUMBER(Taxa_PivotTable!H241),Taxa_PivotTable!H241,\"\")","v":""},"","","",{"$f":"IF(ISNUMBER(Taxa_PivotTable!I241),Taxa_PivotTable!I241,\"\")","v":""},"","","",{"$f":"IF(ISNUMBER(Taxa_PivotTable!J241),Taxa_PivotTable!J241,\"\")","v":""},"","","",{"$f":"IF(ISNUMBER(Taxa_PivotTable!K241),Taxa_PivotTable!K241,\"\")","v":""},"","",""]
[{"$f":"Taxa_PivotTable!A242","v":{"$error":"#N/A"}},{"$f":"IF(Taxa_PivotTable!B242=\"\",\"\",Taxa_PivotTable!B242)","v":""},{"$f":"IF(ISNUMBER(VLOOKUP(B242,UKOptima!A:J,10,FALSE)),VLOOKUP(B242,UKOptima!A:J,10,FALSE),\"\")","v":""},{"$f":"IF(ISNUMBER(Taxa_PivotTable!C242),Taxa_PivotTable!C242,\"\")","v":""},"","","",{"$f":"IF(ISNUMBER(Taxa_PivotTable!D242),Taxa_PivotTable!D242,\"\")","v":""},"","","",{"$f":"IF(ISNUMBER(Taxa_PivotTable!E242),Taxa_PivotTable!E242,\"\")","v":""},"","","",{"$f":"IF(ISNUMBER(Taxa_PivotTable!F242),Taxa_PivotTable!F242,\"\")","v":""},"","","",{"$f":"IF(ISNUMBER(Taxa_PivotTable!G242),Taxa_PivotTable!G242,\"\")","v":""},"","","",{"$f":"IF(ISNUMBER(Taxa_PivotTable!H242),Taxa_PivotTable!H242,\"\")","v":""},"","","",{"$f":"IF(ISNUMBER(Taxa_PivotTable!I242),Taxa_PivotTable!I242,\"\")","v":""},"","","",{"$f":"IF(ISNUMBER(Taxa_PivotTable!J242),Taxa_PivotTable!J242,\"\")","v":""},"","","",{"$f":"IF(ISNUMBER(Taxa_PivotTable!K242),Taxa_PivotTable!K242,\"\")","v":""},"","",""]
[{"$f":"Taxa_PivotTable!A243","v":{"$error":"#N/A"}},{"$f":"IF(Taxa_PivotTable!B243=\"\",\"\",Taxa_PivotTable!B243)","v":""},{"$f":"IF(ISNUMBER(VLOOKUP(B243,UKOptima!A:J,10,FALSE)),VLOOKUP(B243,UKOptima!A:J,10,FALSE),\"\")","v":""},{"$f":"IF(ISNUMBER(Taxa_PivotTable!C243),Taxa_PivotTable!C243,\"\")","v":""},"","","",{"$f":"IF(ISNUMBER(Taxa_PivotTable!D243),Taxa_PivotTable!D243,\"\")","v":""},"","","",{"$f":"IF(ISNUMBER(Taxa_PivotTable!E243),Taxa_PivotTable!E243,\"\")","v":""},"","","",{"$f":"IF(ISNUMBER(Taxa_PivotTable!F243),Taxa_PivotTable!F243,\"\")","v":""},"","","",{"$f":"IF(ISNUMBER(Taxa_PivotTable!G243),Taxa_PivotTable!G243,\"\")","v":""},"","","",{"$f":"IF(ISNUMBER(Taxa_PivotTable!H243),Taxa_PivotTable!H243,\"\")","v":""},"","","",{"$f":"IF(ISNUMBER(Taxa_PivotTable!I243),Taxa_PivotTable!I243,\"\")","v":""},"","","",{"$f":"IF(ISNUMBER(Taxa_PivotTable!J243),Taxa_PivotTable!J243,\"\")","v":""},"","","",{"$f":"IF(ISNUMBER(Taxa_PivotTable!K243),Taxa_PivotTable!K243,\"\")","v":""},"","",""]
[{"$f":"Taxa_PivotTable!A244","v":{"$error":"#N/A"}},{"$f":"IF(Taxa_PivotTable!B244=\"\",\"\",Taxa_PivotTable!B244)","v":""},{"$f":"IF(ISNUMBER(VLOOKUP(B244,UKOptima!A:J,10,FALSE)),VLOOKUP(B244,UKOptima!A:J,10,FALSE),\"\")","v":""},{"$f":"IF(ISNUMBER(Taxa_PivotTable!C244),Taxa_PivotTable!C244,\"\")","v":""},"","","",{"$f":"IF(ISNUMBER(Taxa_PivotTable!D244),Taxa_PivotTable!D244,\"\")","v":""},"","","",{"$f":"IF(ISNUMBER(Taxa_PivotTable!E244),Taxa_PivotTable!E244,\"\")","v":""},"","","",{"$f":"IF(ISNUMBER(Taxa_PivotTable!F244),Taxa_PivotTable!F244,\"\")","v":""},"","","",{"$f":"IF(ISNUMBER(Taxa_PivotTable!G244),Taxa_PivotTable!G244,\"\")","v":""},"","","",{"$f":"IF(ISNUMBER(Taxa_PivotTable!H244),Taxa_PivotTable!H244,\"\")","v":""},"","","",{"$f":"IF(ISNUMBER(Taxa_PivotTable!I244),Taxa_PivotTable!I244,\"\")","v":""},"","","",{"$f":"IF(ISNUMBER(Taxa_PivotTable!J244),Taxa_PivotTable!J244,\"\")","v":""},"","","",{"$f":"IF(ISNUMBER(Taxa_PivotTable!K244),Taxa_PivotTable!K244,\"\")","v":""},"","",""]
[{"$f":"Taxa_PivotTable!A245","v":{"$error":"#N/A"}},{"$f":"IF(Taxa_PivotTable!B245=\"\",\"\",Taxa_PivotTable!B245)","v":""},{"$f":"IF(ISNUMBER(VLOOKUP(B245,UKOptima!A:J,10,FALSE)),VLOOKUP(B245,UKOptima!A:J,10,FALSE),\"\")","v":""},{"$f":"IF(ISNUMBER(Taxa_PivotTable!C245),Taxa_PivotTable!C245,\"\")","v":""},"",{"$f":"IF(COUNT(E245,$C245)=2,(E245)*$C245,\"\")","v":""},"",{"$f":"IF(ISNUMBER(Taxa_PivotTable!D245),Taxa_PivotTable!D245,\"\")","v":""},"",{"$f":"IF(COUNT(I245,$C245)=2,(I245)*$C245,\"\")","v":""},"",{"$f":"IF(ISNUMBER(Taxa_PivotTable!E245),Taxa_PivotTable!E245,\"\")","v":""},"",{"$f":"IF(COUNT(M245,$C245)=2,(M245)*$C245,\"\")","v":""},"",{"$f":"IF(ISNUMBER(Taxa_PivotTable!F245),Taxa_PivotTable!F245,\"\")","v":""},"",{"$f":"IF(COUNT(Q245,$C245)=2,(Q245)*$C245,\"\")","v":""},"",{"$f":"IF(ISNUMBER(Taxa_PivotTable!G245),Taxa_PivotTable!G245,\"\")","v":""},"",{"$f":"IF(COUNT(U245,$C245)=2,(U245)*$C245,\"\")","v":""},"",{"$f":"IF(ISNUMBER(Taxa_PivotTable!H245),Taxa_PivotTable!H245,\"\")","v":""},"","","",{"$f":"IF(ISNUMBER(Taxa_PivotTable!I245),Taxa_PivotTable!I245,\"\")","v":""},"","","",{"$f":"IF(ISNUMBER(Taxa_PivotTable!J245),Taxa_PivotTable!J245,\"\")","v":""},"","","",{"$f":"IF(ISNUMBER(Taxa_PivotTable!K245),Taxa_PivotTable!K245,\"\")","v":""},"","",""]
[{"$f":"Taxa_PivotTable!A246","v":{"$error":"#N/A"}},{"$f":"IF(Taxa_PivotTable!B246=\"\",\"\",Taxa_PivotTable!B246)","v":""},{"$f":"IF(ISNUMBER(VLOOKUP(B246,UKOptima!A:J,10,FALSE)),VLOOKUP(B246,UKOptima!A:J,10,FALSE),\"\")","v":""},{"$f":"IF(ISNUMBER(Taxa_PivotTable!C246),Taxa_PivotTable!C246,\"\")","v":""},"","","",{"$f":"IF(ISNUMBER(Taxa_PivotTable!D246),Taxa_PivotTable!D246,\"\")","v":""},"","","",{"$f":"IF(ISNUMBER(Taxa_PivotTable!E246),Taxa_PivotTable!E246,\"\")","v":""},"","","",{"$f":"IF(ISNUMBER(Taxa_PivotTable!F246),Taxa_PivotTable!F246,\"\")","v":""},"","","",{"$f":"IF(ISNUMBER(Taxa_PivotTable!G246),Taxa_PivotTable!G246,\"\")","v":""},"","","",{"$f":"IF(ISNUMBER(Taxa_PivotTable!H246),Taxa_PivotTable!H246,\"\")","v":""},"","","",{"$f":"IF(ISNUMBER(Taxa_PivotTable!I246),Taxa_PivotTable!I246,\"\")","v":""},"","","",{"$f":"IF(ISNUMBER(Taxa_PivotTable!J246),Taxa_PivotTable!J246,\"\")","v":""},"","","",{"$f":"IF(ISNUMBER(Taxa_PivotTable!K246),Taxa_PivotTable!K246,\"\")","v":""},"","",""]
[{"$f":"Taxa_PivotTable!A247","v":{"$error":"#N/A"}},{"$f":"IF(Taxa_PivotTable!B247=\"\",\"\",Taxa_PivotTable!B247)","v":""},{"$f":"IF(ISNUMBER(VLOOKUP(B247,UKOptima!A:J,10,FALSE)),VLOOKUP(B247,UKOptima!A:J,10,FALSE),\"\")","v":""},{"$f":"IF(ISNUMBER(Taxa_PivotTable!C247),Taxa_PivotTable!C247,\"\")","v":""},"","","",{"$f":"IF(ISNUMBER(Taxa_PivotTable!D247),Taxa_PivotTable!D247,\"\")","v":""},"","","",{"$f":"IF(ISNUMBER(Taxa_PivotTable!E247),Taxa_PivotTable!E247,\"\")","v":""},"","","",{"$f":"IF(ISNUMBER(Taxa_PivotTable!F247),Taxa_PivotTable!F247,\"\")","v":""},"","","",{"$f":"IF(ISNUMBER(Taxa_PivotTable!G247),Taxa_PivotTable!G247,\"\")","v":""},"","","",{"$f":"IF(ISNUMBER(Taxa_PivotTable!H247),Taxa_PivotTable!H247,\"\")","v":""},"","","",{"$f":"IF(ISNUMBER(Taxa_PivotTable!I247),Taxa_PivotTable!I247,\"\")","v":""},"","","",{"$f":"IF(ISNUMBER(Taxa_PivotTable!J247),Taxa_PivotTable!J247,\"\")","v":""},"","","",{"$f":"IF(ISNUMBER(Taxa_PivotTable!K247),Taxa_PivotTable!K247,\"\")","v":""},"","",""]
[{"$f":"Taxa_PivotTable!A248","v":{"$error":"#N/A"}},{"$f":"IF(Taxa_PivotTable!B248=\"\",\"\",Taxa_PivotTable!B248)","v":""},{"$f":"IF(ISNUMBER(VLOOKUP(B248,UKOptima!A:J,10,FALSE)),VLOOKUP(B248,UKOptima!A:J,10,FALSE),\"\")","v":""},{"$f":"IF(ISNUMBER(Taxa_PivotTable!C248),Taxa_PivotTable!C248,\"\")","v":""},"","","",{"$f":"IF(ISNUMBER(Taxa_PivotTable!D248),Taxa_PivotTable!D248,\"\")","v":""},"","","",{"$f":"IF(ISNUMBER(Taxa_PivotTable!E248),Taxa_PivotTable!E248,\"\")","v":""},"","","",{"$f":"IF(ISNUMBER(Taxa_PivotTable!F248),Taxa_PivotTable!F248,\"\")","v":""},"","","",{"$f":"IF(ISNUMBER(Taxa_PivotTable!G248),Taxa_PivotTable!G248,\"\")","v":""},"","","",{"$f":"IF(ISNUMBER(Taxa_PivotTable!H248),Taxa_PivotTable!H248,\"\")","v":""},"","","",{"$f":"IF(ISNUMBER(Taxa_PivotTable!I248),Taxa_PivotTable!I248,\"\")","v":""},"","","",{"$f":"IF(ISNUMBER(Taxa_PivotTable!J248),Taxa_PivotTable!J248,\"\")","v":""},"","","",{"$f":"IF(ISNUMBER(Taxa_PivotTable!K248),Taxa_PivotTable!K248,\"\")","v":""},"","",""]
[{"$f":"Taxa_PivotTable!A249","v":{"$error":"#N/A"}},{"$f":"IF(Taxa_PivotTable!B249=\"\",\"\",Taxa_PivotTable!B249)","v":""},{"$f":"IF(ISNUMBER(VLOOKUP(B249,UKOptima!A:J,10,FALSE)),VLOOKUP(B249,UKOptima!A:J,10,FALSE),\"\")","v":""},{"$f":"IF(ISNUMBER(Taxa_PivotTable!C249),Taxa_PivotTable!C249,\"\")","v":""},"","","",{"$f":"IF(ISNUMBER(Taxa_PivotTable!D249),Taxa_PivotTable!D249,\"\")","v":""},"","","",{"$f":"IF(ISNUMBER(Taxa_PivotTable!E249),Taxa_PivotTable!E249,\"\")","v":""},"","","",{"$f":"IF(ISNUMBER(Taxa_PivotTable!F249),Taxa_PivotTable!F249,\"\")","v":""},"","","",{"$f":"IF(ISNUMBER(Taxa_PivotTable!G249),Taxa_PivotTable!G249,\"\")","v":""},"","","",{"$f":"IF(ISNUMBER(Taxa_PivotTable!H249),Taxa_PivotTable!H249,\"\")","v":""},"","","",{"$f":"IF(ISNUMBER(Taxa_PivotTable!I249),Taxa_PivotTable!I249,\"\")","v":""},"","","",{"$f":"IF(ISNUMBER(Taxa_PivotTable!J249),Taxa_PivotTable!J249,\"\")","v":""},"","","",{"$f":"IF(ISNUMBER(Taxa_PivotTable!K249),Taxa_PivotTable!K249,\"\")","v":""},"","",""]
[{"$f":"Taxa_PivotTable!A250","v":{"$error":"#N/A"}},{"$f":"IF(Taxa_PivotTable!B250=\"\",\"\",Taxa_PivotTable!B250)","v":""},{"$f":"IF(ISNUMBER(VLOOKUP(B250,UKOptima!A:J,10,FALSE)),VLOOKUP(B250,UKOptima!A:J,10,FALSE),\"\")","v":""},{"$f":"IF(ISNUMBER(Taxa_PivotTable!C250),Taxa_PivotTable!C250,\"\")","v":""},"","","",{"$f":"IF(ISNUMBER(Taxa_PivotTable!D250),Taxa_PivotTable!D250,\"\")","v":""},"","","",{"$f":"IF(ISNUMBER(Taxa_PivotTable!E250),Taxa_PivotTable!E250,\"\")","v":""},"","","",{"$f":"IF(ISNUMBER(Taxa_PivotTable!F250),Taxa_PivotTable!F250,\"\")","v":""},"","","",{"$f":"IF(ISNUMBER(Taxa_PivotTable!G250),Taxa_PivotTable!G250,\"\")","v":""},"","","",{"$f":"IF(ISNUMBER(Taxa_PivotTable!H250),Taxa_PivotTable!H250,\"\")","v":""},"","","",{"$f":"IF(ISNUMBER(Taxa_PivotTable!I250),Taxa_PivotTable!I250,\"\")","v":""},"","","",{"$f":"IF(ISNUMBER(Taxa_PivotTable!J250),Taxa_PivotTable!J250,\"\")","v":""},"","","",{"$f":"IF(ISNUMBER(Taxa_PivotTable!K250),Taxa_PivotTable!K250,\"\")","v":""},"","",""]
[{"$f":"Taxa_PivotTable!A251","v":{"$error":"#N/A"}},{"$f":"IF(Taxa_PivotTable!B251=\"\",\"\",Taxa_PivotTable!B251)","v":""},{"$f":"IF(ISNUMBER(VLOOKUP(B251,UKOptima!A:J,10,FALSE)),VLOOKUP(B251,UKOptima!A:J,10,FALSE),\"\")","v":""},{"$f":"IF(ISNUMBER(Taxa_PivotTable!C251),Taxa_PivotTable!C251,\"\")","v":""},"","","",{"$f":"IF(ISNUMBER(Taxa_PivotTable!D251),Taxa_PivotTable!D251,\"\")","v":""},"","","",{"$f":"IF(ISNUMBER(Taxa_PivotTable!E251),Taxa_PivotTable!E251,\"\")","v":""},"","","",{"$f":"IF(ISNUMBER(Taxa_PivotTable!F251),Taxa_PivotTable!F251,\"\")","v":""},"","","",{"$f":"IF(ISNUMBER(Taxa_PivotTable!G251),Taxa_PivotTable!G251,\"\")","v":""},"","","",{"$f":"IF(ISNUMBER(Taxa_PivotTable!H251),Taxa_PivotTable!H251,\"\")","v":""},"","","",{"$f":"IF(ISNUMBER(Taxa_PivotTable!I251),Taxa_PivotTable!I251,\"\")","v":""},"","","",{"$f":"IF(ISNUMBER(Taxa_PivotTable!J251),Taxa_PivotTable!J251,\"\")","v":""},"","","",{"$f":"IF(ISNUMBER(Taxa_PivotTable!K251),Taxa_PivotTable!K251,\"\")","v":""},"","",""]
[{"$f":"Taxa_PivotTable!A252","v":{"$error":"#N/A"}},{"$f":"IF(Taxa_PivotTable!B252=\"\",\"\",Taxa_PivotTable!B252)","v":""},{"$f":"IF(ISNUMBER(VLOOKUP(B252,UKOptima!A:J,10,FALSE)),VLOOKUP(B252,UKOptima!A:J,10,FALSE),\"\")","v":""},{"$f":"IF(ISNUMBER(Taxa_PivotTable!C252),Taxa_PivotTable!C252,\"\")","v":""},"","","",{"$f":"IF(ISNUMBER(Taxa_PivotTable!D252),Taxa_PivotTable!D252,\"\")","v":""},"","","",{"$f":"IF(ISNUMBER(Taxa_PivotTable!E252),Taxa_PivotTable!E252,\"\")","v":""},"","","",{"$f":"IF(ISNUMBER(Taxa_PivotTable!F252),Taxa_PivotTable!F252,\"\")","v":""},"","","",{"$f":"IF(ISNUMBER(Taxa_PivotTable!G252),Taxa_PivotTable!G252,\"\")","v":""},"","","",{"$f":"IF(ISNUMBER(Taxa_PivotTable!H252),Taxa_PivotTable!H252,\"\")","v":""},"","","",{"$f":"IF(ISNUMBER(Taxa_PivotTable!I252),Taxa_PivotTable!I252,\"\")","v":""},"","","",{"$f":"IF(ISNUMBER(Taxa_PivotTable!J252),Taxa_PivotTable!J252,\"\")","v":""},"","","",{"$f":"IF(ISNUMBER(Taxa_PivotTable!K252),Taxa_PivotTable!K252,\"\")","v":""},"","",""]
[{"$f":"Taxa_PivotTable!A253","v":{"$error":"#N/A"}},{"$f":"IF(Taxa_PivotTable!B253=\"\",\"\",Taxa_PivotTable!B253)","v":""},{"$f":"IF(ISNUMBER(VLOOKUP(B253,UKOptima!A:J,10,FALSE)),VLOOKUP(B253,UKOptima!A:J,10,FALSE),\"\")","v":""},{"$f":"IF(ISNUMBER(Taxa_PivotTable!C253),Taxa_PivotTable!C253,\"\")","v":""},"","","",{"$f":"IF(ISNUMBER(Taxa_PivotTable!D253),Taxa_PivotTable!D253,\"\")","v":""},"","","",{"$f":"IF(ISNUMBER(Taxa_PivotTable!E253),Taxa_PivotTable!E253,\"\")","v":""},"","","",{"$f":"IF(ISNUMBER(Taxa_PivotTable!F253),Taxa_PivotTable!F253,\"\")","v":""},"","","",{"$f":"IF(ISNUMBER(Taxa_PivotTable!G253),Taxa_PivotTable!G253,\"\")","v":""},"","","",{"$f":"IF(ISNUMBER(Taxa_PivotTable!H253),Taxa_PivotTable!H253,\"\")","v":""},"","","",{"$f":"IF(ISNUMBER(Taxa_PivotTable!I253),Taxa_PivotTable!I253,\"\")","v":""},"","","",{"$f":"IF(ISNUMBER(Taxa_PivotTable!J253),Taxa_PivotTable!J253,\"\")","v":""},"","","",{"$f":"IF(ISNUMBER(Taxa_PivotTable!K253),Taxa_PivotTable!K253,\"\")","v":""},"","",""]
[{"$f":"Taxa_PivotTable!A254","v":{"$error":"#N/A"}},{"$f":"IF(Taxa_PivotTable!B254=\"\",\"\",Taxa_PivotTable!B254)","v":""},{"$f":"IF(ISNUMBER(VLOOKUP(B254,UKOptima!A:J,10,FALSE)),VLOOKUP(B254,UKOptima!A:J,10,FALSE),\"\")","v":""},{"$f":"IF(ISNUMBER(Taxa_PivotTable!C254),Taxa_PivotTable!C254,\"\")","v":""},"","","",{"$f":"IF(ISNUMBER(Taxa_PivotTable!D254),Taxa_PivotTable!D254,\"\")","v":""},"","","",{"$f":"IF(ISNUMBER(Taxa_PivotTable!E254),Taxa_PivotTable!E254,\"\")","v":""},"","","",{"$f":"IF(ISNUMBER(Taxa_PivotTable!F254),Taxa_PivotTable!F254,\"\")","v":""},"","","",{"$f":"IF(ISNUMBER(Taxa_PivotTable!G254),Taxa_PivotTable!G254,\"\")","v":""},"","","",{"$f":"IF(ISNUMBER(Taxa_PivotTable!H254),Taxa_PivotTable!H254,\"\")","v":""},"","","",{"$f":"IF(ISNUMBER(Taxa_PivotTable!I254),Taxa_PivotTable!I254,\"\")","v":""},"","","",{"$f":"IF(ISNUMBER(Taxa_PivotTable!J254),Taxa_PivotTable!J254,\"\")","v":""},"","","",{"$f":"IF(ISNUMBER(Taxa_PivotTable!K254),Taxa_PivotTable!K254,\"\")","v":""},"","",""]
[{"$f":"Taxa_PivotTable!A255","v":{"$error":"#N/A"}},{"$f":"IF(Taxa_PivotTable!B255=\"\",\"\",Taxa_PivotTable!B255)","v":""},{"$f":"IF(ISNUMBER(VLOOKUP(B255,UKOptima!A:J,10,FALSE)),VLOOKUP(B255,UKOptima!A:J,10,FALSE),\"\")","v":""},{"$f":"IF(ISNUMBER(Taxa_PivotTable!C255),Taxa_PivotTable!C255,\"\")","v":""},"","","",{"$f":"IF(ISNUMBER(Taxa_PivotTable!D255),Taxa_PivotTable!D255,\"\")","v":""},"","","",{"$f":"IF(ISNUMBER(Taxa_PivotTable!E255),Taxa_PivotTable!E255,\"\")","v":""},"","","",{"$f":"IF(ISNUMBER(Taxa_PivotTable!F255),Taxa_PivotTable!F255,\"\")","v":""},"","","",{"$f":"IF(ISNUMBER(Taxa_PivotTable!G255),Taxa_PivotTable!G255,\"\")","v":""},"","","",{"$f":"IF(ISNUMBER(Taxa_PivotTable!H255),Taxa_PivotTable!H255,\"\")","v":""},"","","",{"$f":"IF(ISNUMBER(Taxa_PivotTable!I255),Taxa_PivotTable!I255,\"\")","v":""},"","","",{"$f":"IF(ISNUMBER(Taxa_PivotTable!J255),Taxa_PivotTable!J255,\"\")","v":""},"","","",{"$f":"IF(ISNUMBER(Taxa_PivotTable!K255),Taxa_PivotTable!K255,\"\")","v":""},"","",""]
[{"$f":"Taxa_PivotTable!A256","v":{"$error":"#N/A"}},{"$f":"IF(Taxa_PivotTable!B256=\"\",\"\",Taxa_PivotTable!B256)","v":""},{"$f":"IF(ISNUMBER(VLOOKUP(B256,UKOptima!A:J,10,FALSE)),VLOOKUP(B256,UKOptima!A:J,10,FALSE),\"\")","v":""},{"$f":"IF(ISNUMBER(Taxa_PivotTable!C256),Taxa_PivotTable!C256,\"\")","v":""},"","","",{"$f":"IF(ISNUMBER(Taxa_PivotTable!D256),Taxa_PivotTable!D256,\"\")","v":""},"","","",{"$f":"IF(ISNUMBER(Taxa_PivotTable!E256),Taxa_PivotTable!E256,\"\")","v":""},"","","",{"$f":"IF(ISNUMBER(Taxa_PivotTable!F256),Taxa_PivotTable!F256,\"\")","v":""},"","","",{"$f":"IF(ISNUMBER(Taxa_PivotTable!G256),Taxa_PivotTable!G256,\"\")","v":""},"","","",{"$f":"IF(ISNUMBER(Taxa_PivotTable!H256),Taxa_PivotTable!H256,\"\")","v":""},"","","",{"$f":"IF(ISNUMBER(Taxa_PivotTable!I256),Taxa_PivotTable!I256,\"\")","v":""},"","","",{"$f":"IF(ISNUMBER(Taxa_PivotTable!J256),Taxa_PivotTable!J256,\"\")","v":""},"","","",{"$f":"IF(ISNUMBER(Taxa_PivotTable!K256),Taxa_PivotTable!K256,\"\")","v":""},"","",""]
[{"$f":"Taxa_PivotTable!A257","v":{"$error":"#N/A"}},{"$f":"IF(Taxa_PivotTable!B257=\"\",\"\",Taxa_PivotTable!B257)","v":""},{"$f":"IF(ISNUMBER(VLOOKUP(B257,UKOptima!A:J,10,FALSE)),VLOOKUP(B257,UKOptima!A:J,10,FALSE),\"\")","v":""},{"$f":"IF(ISNUMBER(Taxa_PivotTable!C257),Taxa_PivotTable!C257,\"\")","v":""},"","","",{"$f":"IF(ISNUMBER(Taxa_PivotTable!D257),Taxa_PivotTable!D257,\"\")","v":""},"","","",{"$f":"IF(ISNUMBER(Taxa_PivotTable!E257),Taxa_PivotTable!E257,\"\")","v":""},"","","",{"$f":"IF(ISNUMBER(Taxa_PivotTable!F257),Taxa_PivotTable!F257,\"\")","v":""},"","","",{"$f":"IF(ISNUMBER(Taxa_PivotTable!G257),Taxa_PivotTable!G257,\"\")","v":""},"","","",{"$f":"IF(ISNUMBER(Taxa_PivotTable!H257),Taxa_PivotTable!H257,\"\")","v":""},"","","",{"$f":"IF(ISNUMBER(Taxa_PivotTable!I257),Taxa_PivotTable!I257,\"\")","v":""},"","","",{"$f":"IF(ISNUMBER(Taxa_PivotTable!J257),Taxa_PivotTable!J257,\"\")","v":""},"","","",{"$f":"IF(ISNUMBER(Taxa_PivotTable!K257),Taxa_PivotTable!K257,\"\")","v":""},"","",""]
[{"$f":"Taxa_PivotTable!A258","v":{"$error":"#N/A"}},{"$f":"IF(Taxa_PivotTable!B258=\"\",\"\",Taxa_PivotTable!B258)","v":""},{"$f":"IF(ISNUMBER(VLOOKUP(B258,UKOptima!A:J,10,FALSE)),VLOOKUP(B258,UKOptima!A:J,10,FALSE),\"\")","v":""},{"$f":"IF(ISNUMBER(Taxa_PivotTable!C258),Taxa_PivotTable!C258,\"\")","v":""},"","","",{"$f":"IF(ISNUMBER(Taxa_PivotTable!D258),Taxa_PivotTable!D258,\"\")","v":""},"","","",{"$f":"IF(ISNUMBER(Taxa_PivotTable!E258),Taxa_PivotTable!E258,\"\")","v":""},"","","",{"$f":"IF(ISNUMBER(Taxa_PivotTable!F258),Taxa_PivotTable!F258,\"\")","v":""},"","","",{"$f":"IF(ISNUMBER(Taxa_PivotTable!G258),Taxa_PivotTable!G258,\"\")","v":""},"","","",{"$f":"IF(ISNUMBER(Taxa_PivotTable!H258),Taxa_PivotTable!H258,\"\")","v":""},"","","",{"$f":"IF(ISNUMBER(Taxa_PivotTable!I258),Taxa_PivotTable!I258,\"\")","v":""},"","","",{"$f":"IF(ISNUMBER(Taxa_PivotTable!J258),Taxa_PivotTable!J258,\"\")","v":""},"","","",{"$f":"IF(ISNUMBER(Taxa_PivotTable!K258),Taxa_PivotTable!K258,\"\")","v":""},"","",""]
[{"$f":"Taxa_PivotTable!A259","v":{"$error":"#N/A"}},{"$f":"IF(Taxa_PivotTable!B259=\"\",\"\",Taxa_PivotTable!B259)","v":""},{"$f":"IF(ISNUMBER(VLOOKUP(B259,UKOptima!A:J,10,FALSE)),VLOOKUP(B259,UKOptima!A:J,10,FALSE),\"\")","v":""},{"$f":"IF(ISNUMBER(Taxa_PivotTable!C259),Taxa_PivotTable!C259,\"\")","v":""},"","","",{"$f":"IF(ISNUMBER(Taxa_PivotTable!D259),Taxa_PivotTable!D259,\"\")","v":""},"","","",{"$f":"IF(ISNUMBER(Taxa_PivotTable!E259),Taxa_PivotTable!E259,\"\")","v":""},"","","",{"$f":"IF(ISNUMBER(Taxa_PivotTable!F259),Taxa_PivotTable!F259,\"\")","v":""},"","","",{"$f":"IF(ISNUMBER(Taxa_PivotTable!G259),Taxa_PivotTable!G259,\"\")","v":""},"","","",{"$f":"IF(ISNUMBER(Taxa_PivotTable!H259),Taxa_PivotTable!H259,\"\")","v":""},"","","",{"$f":"IF(ISNUMBER(Taxa_PivotTable!I259),Taxa_PivotTable!I259,\"\")","v":""},"","","",{"$f":"IF(ISNUMBER(Taxa_PivotTable!J259),Taxa_PivotTable!J259,\"\")","v":""},"","","",{"$f":"IF(ISNUMBER(Taxa_PivotTable!K259),Taxa_PivotTable!K259,\"\")","v":""},"","",""]
[{"$f":"Taxa_PivotTable!A260","v":{"$error":"#N/A"}},{"$f":"IF(Taxa_PivotTable!B260=\"\",\"\",Taxa_PivotTable!B260)","v":""},{"$f":"IF(ISNUMBER(VLOOKUP(B260,UKOptima!A:J,10,FALSE)),VLOOKUP(B260,UKOptima!A:J,10,FALSE),\"\")","v":""},{"$f":"IF(ISNUMBER(Taxa_PivotTable!C260),Taxa_PivotTable!C260,\"\")","v":""},"","","",{"$f":"IF(ISNUMBER(Taxa_PivotTable!D260),Taxa_PivotTable!D260,\"\")","v":""},"","","",{"$f":"IF(ISNUMBER(Taxa_PivotTable!E260),Taxa_PivotTable!E260,\"\")","v":""},"","","",{"$f":"IF(ISNUMBER(Taxa_PivotTable!F260),Taxa_PivotTable!F260,\"\")","v":""},"","","",{"$f":"IF(ISNUMBER(Taxa_PivotTable!G260),Taxa_PivotTable!G260,\"\")","v":""},"","","",{"$f":"IF(ISNUMBER(Taxa_PivotTable!H260),Taxa_PivotTable!H260,\"\")","v":""},"","","",{"$f":"IF(ISNUMBER(Taxa_PivotTable!I260),Taxa_PivotTable!I260,\"\")","v":""},"","","",{"$f":"IF(ISNUMBER(Taxa_PivotTable!J260),Taxa_PivotTable!J260,\"\")","v":""},"","","",{"$f":"IF(ISNUMBER(Taxa_PivotTable!K260),Taxa_PivotTable!K260,\"\")","v":""},"","",""]
[{"$f":"Taxa_PivotTable!A261","v":{"$error":"#N/A"}},{"$f":"IF(Taxa_PivotTable!B261=\"\",\"\",Taxa_PivotTable!B261)","v":""},{"$f":"IF(ISNUMBER(VLOOKUP(B261,UKOptima!A:J,10,FALSE)),VLOOKUP(B261,UKOptima!A:J,10,FALSE),\"\")","v":""},{"$f":"IF(ISNUMBER(Taxa_PivotTable!C261),Taxa_PivotTable!C261,\"\")","v":""},"","","",{"$f":"IF(ISNUMBER(Taxa_PivotTable!D261),Taxa_PivotTable!D261,\"\")","v":""},"","","",{"$f":"IF(ISNUMBER(Taxa_PivotTable!E261),Taxa_PivotTable!E261,\"\")","v":""},"","","",{"$f":"IF(ISNUMBER(Taxa_PivotTable!F261),Taxa_PivotTable!F261,\"\")","v":""},"","","",{"$f":"IF(ISNUMBER(Taxa_PivotTable!G261),Taxa_PivotTable!G261,\"\")","v":""},"","","",{"$f":"IF(ISNUMBER(Taxa_PivotTable!H261),Taxa_PivotTable!H261,\"\")","v":""},"","","",{"$f":"IF(ISNUMBER(Taxa_PivotTable!I261),Taxa_PivotTable!I261,\"\")","v":""},"","","",{"$f":"IF(ISNUMBER(Taxa_PivotTable!J261),Taxa_PivotTable!J261,\"\")","v":""},"","","",{"$f":"IF(ISNUMBER(Taxa_PivotTable!K261),Taxa_PivotTable!K261,\"\")","v":""},"","",""]
[{"$f":"Taxa_PivotTable!A262","v":{"$error":"#N/A"}},{"$f":"IF(Taxa_PivotTable!B262=\"\",\"\",Taxa_PivotTable!B262)","v":""},{"$f":"IF(ISNUMBER(VLOOKUP(B262,UKOptima!A:J,10,FALSE)),VLOOKUP(B262,UKOptima!A:J,10,FALSE),\"\")","v":""},{"$f":"IF(ISNUMBER(Taxa_PivotTable!C262),Taxa_PivotTable!C262,\"\")","v":""},"","","",{"$f":"IF(ISNUMBER(Taxa_PivotTable!D262),Taxa_PivotTable!D262,\"\")","v":""},"","","",{"$f":"IF(ISNUMBER(Taxa_PivotTable!E262),Taxa_PivotTable!E262,\"\")","v":""},"","","",{"$f":"IF(ISNUMBER(Taxa_PivotTable!F262),Taxa_PivotTable!F262,\"\")","v":""},"","","",{"$f":"IF(ISNUMBER(Taxa_PivotTable!G262),Taxa_PivotTable!G262,\"\")","v":""},"","","",{"$f":"IF(ISNUMBER(Taxa_PivotTable!H262),Taxa_PivotTable!H262,\"\")","v":""},"","","",{"$f":"IF(ISNUMBER(Taxa_PivotTable!I262),Taxa_PivotTable!I262,\"\")","v":""},"","","",{"$f":"IF(ISNUMBER(Taxa_PivotTable!J262),Taxa_PivotTable!J262,\"\")","v":""},"","","",{"$f":"IF(ISNUMBER(Taxa_PivotTable!K262),Taxa_PivotTable!K262,\"\")","v":""},"","",""]
[{"$f":"Taxa_PivotTable!A263","v":{"$error":"#N/A"}},{"$f":"IF(Taxa_PivotTable!B263=\"\",\"\",Taxa_PivotTable!B263)","v":""},{"$f":"IF(ISNUMBER(VLOOKUP(B263,UKOptima!A:J,10,FALSE)),VLOOKUP(B263,UKOptima!A:J,10,FALSE),\"\")","v":""},{"$f":"IF(ISNUMBER(Taxa_PivotTable!C263),Taxa_PivotTable!C263,\"\")","v":""},"","","",{"$f":"IF(ISNUMBER(Taxa_PivotTable!D263),Taxa_PivotTable!D263,\"\")","v":""},"","","",{"$f":"IF(ISNUMBER(Taxa_PivotTable!E263),Taxa_PivotTable!E263,\"\")","v":""},"","","",{"$f":"IF(ISNUMBER(Taxa_PivotTable!F263),Taxa_PivotTable!F263,\"\")","v":""},"","","",{"$f":"IF(ISNUMBER(Taxa_PivotTable!G263),Taxa_PivotTable!G263,\"\")","v":""},"","","",{"$f":"IF(ISNUMBER(Taxa_PivotTable!H263),Taxa_PivotTable!H263,\"\")","v":""},"","","",{"$f":"IF(ISNUMBER(Taxa_PivotTable!I263),Taxa_PivotTable!I263,\"\")","v":""},"","","",{"$f":"IF(ISNUMBER(Taxa_PivotTable!J263),Taxa_PivotTable!J263,\"\")","v":""},"","","",{"$f":"IF(ISNUMBER(Taxa_PivotTable!K263),Taxa_PivotTable!K263,\"\")","v":""},"","",""]
[{"$f":"Taxa_PivotTable!A264","v":{"$error":"#N/A"}},{"$f":"IF(Taxa_PivotTable!B264=\"\",\"\",Taxa_PivotTable!B264)","v":""},{"$f":"IF(ISNUMBER(VLOOKUP(B264,UKOptima!A:J,10,FALSE)),VLOOKUP(B264,UKOptima!A:J,10,FALSE),\"\")","v":""},{"$f":"IF(ISNUMBER(Taxa_PivotTable!C264),Taxa_PivotTable!C264,\"\")","v":""},"","","",{"$f":"IF(ISNUMBER(Taxa_PivotTable!D264),Taxa_PivotTable!D264,\"\")","v":""},"","","",{"$f":"IF(ISNUMBER(Taxa_PivotTable!E264),Taxa_PivotTable!E264,\"\")","v":""},"","","",{"$f":"IF(ISNUMBER(Taxa_PivotTable!F264),Taxa_PivotTable!F264,\"\")","v":""},"","","",{"$f":"IF(ISNUMBER(Taxa_PivotTable!G264),Taxa_PivotTable!G264,\"\")","v":""},"","","",{"$f":"IF(ISNUMBER(Taxa_PivotTable!H264),Taxa_PivotTable!H264,\"\")","v":""},"","","",{"$f":"IF(ISNUMBER(Taxa_PivotTable!I264),Taxa_PivotTable!I264,\"\")","v":""},"","","",{"$f":"IF(ISNUMBER(Taxa_PivotTable!J264),Taxa_PivotTable!J264,\"\")","v":""},"","","",{"$f":"IF(ISNUMBER(Taxa_PivotTable!K264),Taxa_PivotTable!K264,\"\")","v":""},"","",""]
[{"$f":"Taxa_PivotTable!A265","v":{"$error":"#N/A"}},{"$f":"IF(Taxa_PivotTable!B265=\"\",\"\",Taxa_PivotTable!B265)","v":""},{"$f":"IF(ISNUMBER(VLOOKUP(B265,UKOptima!A:J,10,FALSE)),VLOOKUP(B265,UKOptima!A:J,10,FALSE),\"\")","v":""},{"$f":"IF(ISNUMBER(Taxa_PivotTable!C265),Taxa_PivotTable!C265,\"\")","v":""},"","","",{"$f":"IF(ISNUMBER(Taxa_PivotTable!D265),Taxa_PivotTable!D265,\"\")","v":""},"","","",{"$f":"IF(ISNUMBER(Taxa_PivotTable!E265),Taxa_PivotTable!E265,\"\")","v":""},"","","",{"$f":"IF(ISNUMBER(Taxa_PivotTable!F265),Taxa_PivotTable!F265,\"\")","v":""},"","","",{"$f":"IF(ISNUMBER(Taxa_PivotTable!G265),Taxa_PivotTable!G265,\"\")","v":""},"","","",{"$f":"IF(ISNUMBER(Taxa_PivotTable!H265),Taxa_PivotTable!H265,\"\")","v":""},"","","",{"$f":"IF(ISNUMBER(Taxa_PivotTable!I265),Taxa_PivotTable!I265,\"\")","v":""},"","","",{"$f":"IF(ISNUMBER(Taxa_PivotTable!J265),Taxa_PivotTable!J265,\"\")","v":""},"","","",{"$f":"IF(ISNUMBER(Taxa_PivotTable!K265),Taxa_PivotTable!K265,\"\")","v":""},"","",""]
[{"$f":"Taxa_PivotTable!A266","v":{"$error":"#N/A"}},{"$f":"IF(Taxa_PivotTable!B266=\"\",\"\",Taxa_PivotTable!B266)","v":""},{"$f":"IF(ISNUMBER(VLOOKUP(B266,UKOptima!A:J,10,FALSE)),VLOOKUP(B266,UKOptima!A:J,10,FALSE),\"\")","v":""},{"$f":"IF(ISNUMBER(Taxa_PivotTable!C266),Taxa_PivotTable!C266,\"\")","v":""},"","","",{"$f":"IF(ISNUMBER(Taxa_PivotTable!D266),Taxa_PivotTable!D266,\"\")","v":""},"","","",{"$f":"IF(ISNUMBER(Taxa_PivotTable!E266),Taxa_PivotTable!E266,\"\")","v":""},"","","",{"$f":"IF(ISNUMBER(Taxa_PivotTable!F266),Taxa_PivotTable!F266,\"\")","v":""},"","","",{"$f":"IF(ISNUMBER(Taxa_PivotTable!G266),Taxa_PivotTable!G266,\"\")","v":""},"","","",{"$f":"IF(ISNUMBER(Taxa_PivotTable!H266),Taxa_PivotTable!H266,\"\")","v":""},"","","",{"$f":"IF(ISNUMBER(Taxa_PivotTable!I266),Taxa_PivotTable!I266,\"\")","v":""},"","","",{"$f":"IF(ISNUMBER(Taxa_PivotTable!J266),Taxa_PivotTable!J266,\"\")","v":""},"","","",{"$f":"IF(ISNUMBER(Taxa_PivotTable!K266),Taxa_PivotTable!K266,\"\")","v":""},"","",""]
[{"$f":"Taxa_PivotTable!A267","v":{"$error":"#N/A"}},{"$f":"IF(Taxa_PivotTable!B267=\"\",\"\",Taxa_PivotTable!B267)","v":""},{"$f":"IF(ISNUMBER(VLOOKUP(B267,UKOptima!A:J,10,FALSE)),VLOOKUP(B267,UKOptima!A:J,10,FALSE),\"\")","v":""},{"$f":"IF(ISNUMBER(Taxa_PivotTable!C267),Taxa_PivotTable!C267,\"\")","v":""},"","","",{"$f":"IF(ISNUMBER(Taxa_PivotTable!D267),Taxa_PivotTable!D267,\"\")","v":""},"","","",{"$f":"IF(ISNUMBER(Taxa_PivotTable!E267),Taxa_PivotTable!E267,\"\")","v":""},"","","",{"$f":"IF(ISNUMBER(Taxa_PivotTable!F267),Taxa_PivotTable!F267,\"\")","v":""},"","","",{"$f":"IF(ISNUMBER(Taxa_PivotTable!G267),Taxa_PivotTable!G267,\"\")","v":""},"","","",{"$f":"IF(ISNUMBER(Taxa_PivotTable!H267),Taxa_PivotTable!H267,\"\")","v":""},"","","",{"$f":"IF(ISNUMBER(Taxa_PivotTable!I267),Taxa_PivotTable!I267,\"\")","v":""},"","","",{"$f":"IF(ISNUMBER(Taxa_PivotTable!J267),Taxa_PivotTable!J267,\"\")","v":""},"","","",{"$f":"IF(ISNUMBER(Taxa_PivotTable!K267),Taxa_PivotTable!K267,\"\")","v":""},"","",""]
[{"$f":"Taxa_PivotTable!A268","v":{"$error":"#N/A"}},{"$f":"IF(Taxa_PivotTable!B268=\"\",\"\",Taxa_PivotTable!B268)","v":""},{"$f":"IF(ISNUMBER(VLOOKUP(B268,UKOptima!A:J,10,FALSE)),VLOOKUP(B268,UKOptima!A:J,10,FALSE),\"\")","v":""},{"$f":"IF(ISNUMBER(Taxa_PivotTable!C268),Taxa_PivotTable!C268,\"\")","v":""},"","","",{"$f":"IF(ISNUMBER(Taxa_PivotTable!D268),Taxa_PivotTable!D268,\"\")","v":""},"","","",{"$f":"IF(ISNUMBER(Taxa_PivotTable!E268),Taxa_PivotTable!E268,\"\")","v":""},"","","",{"$f":"IF(ISNUMBER(Taxa_PivotTable!F268),Taxa_PivotTable!F268,\"\")","v":""},"","","",{"$f":"IF(ISNUMBER(Taxa_PivotTable!G268),Taxa_PivotTable!G268,\"\")","v":""},"","","",{"$f":"IF(ISNUMBER(Taxa_PivotTable!H268),Taxa_PivotTable!H268,\"\")","v":""},"","","",{"$f":"IF(ISNUMBER(Taxa_PivotTable!I268),Taxa_PivotTable!I268,\"\")","v":""},"","","",{"$f":"IF(ISNUMBER(Taxa_PivotTable!J268),Taxa_PivotTable!J268,\"\")","v":""},"","","",{"$f":"IF(ISNUMBER(Taxa_PivotTable!K268),Taxa_PivotTable!K268,\"\")","v":""},"","",""]
[{"$f":"Taxa_PivotTable!A269","v":{"$error":"#N/A"}},{"$f":"IF(Taxa_PivotTable!B269=\"\",\"\",Taxa_PivotTable!B269)","v":""},{"$f":"IF(ISNUMBER(VLOOKUP(B269,UKOptima!A:J,10,FALSE)),VLOOKUP(B269,UKOptima!A:J,10,FALSE),\"\")","v":""},{"$f":"IF(ISNUMBER(Taxa_PivotTable!C269),Taxa_PivotTable!C269,\"\")","v":""},"","","",{"$f":"IF(ISNUMBER(Taxa_PivotTable!D269),Taxa_PivotTable!D269,\"\")","v":""},"","","",{"$f":"IF(ISNUMBER(Taxa_PivotTable!E269),Taxa_PivotTable!E269,\"\")","v":""},"","","",{"$f":"IF(ISNUMBER(Taxa_PivotTable!F269),Taxa_PivotTable!F269,\"\")","v":""},"","","",{"$f":"IF(ISNUMBER(Taxa_PivotTable!G269),Taxa_PivotTable!G269,\"\")","v":""},"","","",{"$f":"IF(ISNUMBER(Taxa_PivotTable!H269),Taxa_PivotTable!H269,\"\")","v":""},"","","",{"$f":"IF(ISNUMBER(Taxa_PivotTable!I269),Taxa_PivotTable!I269,\"\")","v":""},"","","",{"$f":"IF(ISNUMBER(Taxa_PivotTable!J269),Taxa_PivotTable!J269,\"\")","v":""},"","","",{"$f":"IF(ISNUMBER(Taxa_PivotTable!K269),Taxa_PivotTable!K269,\"\")","v":""},"","",""]
[{"$f":"Taxa_PivotTable!A270","v":{"$error":"#N/A"}},{"$f":"IF(Taxa_PivotTable!B270=\"\",\"\",Taxa_PivotTable!B270)","v":""},{"$f":"IF(ISNUMBER(VLOOKUP(B270,UKOptima!A:J,10,FALSE)),VLOOKUP(B270,UKOptima!A:J,10,FALSE),\"\")","v":""},{"$f":"IF(ISNUMBER(Taxa_PivotTable!C270),Taxa_PivotTable!C270,\"\")","v":""},"","","",{"$f":"IF(ISNUMBER(Taxa_PivotTable!D270),Taxa_PivotTable!D270,\"\")","v":""},"","","",{"$f":"IF(ISNUMBER(Taxa_PivotTable!E270),Taxa_PivotTable!E270,\"\")","v":""},"","","",{"$f":"IF(ISNUMBER(Taxa_PivotTable!F270),Taxa_PivotTable!F270,\"\")","v":""},"","","",{"$f":"IF(ISNUMBER(Taxa_PivotTable!G270),Taxa_PivotTable!G270,\"\")","v":""},"","","",{"$f":"IF(ISNUMBER(Taxa_PivotTable!H270),Taxa_PivotTable!H270,\"\")","v":""},"","","",{"$f":"IF(ISNUMBER(Taxa_PivotTable!I270),Taxa_PivotTable!I270,\"\")","v":""},"","","",{"$f":"IF(ISNUMBER(Taxa_PivotTable!J270),Taxa_PivotTable!J270,\"\")","v":""},"","","",{"$f":"IF(ISNUMBER(Taxa_PivotTable!K270),Taxa_PivotTable!K270,\"\")","v":""},"","",""]
[{"$f":"Taxa_PivotTable!A271","v":{"$error":"#N/A"}},{"$f":"IF(Taxa_PivotTable!B271=\"\",\"\",Taxa_PivotTable!B271)","v":""},{"$f":"IF(ISNUMBER(VLOOKUP(B271,UKOptima!A:J,10,FALSE)),VLOOKUP(B271,UKOptima!A:J,10,FALSE),\"\")","v":""},{"$f":"IF(ISNUMBER(Taxa_PivotTable!C271),Taxa_PivotTable!C271,\"\")","v":""},"","","",{"$f":"IF(ISNUMBER(Taxa_PivotTable!D271),Taxa_PivotTable!D271,\"\")","v":""},"","","",{"$f":"IF(ISNUMBER(Taxa_PivotTable!E271),Taxa_PivotTable!E271,\"\")","v":""},"","","",{"$f":"IF(ISNUMBER(Taxa_PivotTable!F271),Taxa_PivotTable!F271,\"\")","v":""},"","","",{"$f":"IF(ISNUMBER(Taxa_PivotTable!G271),Taxa_PivotTable!G271,\"\")","v":""},"","","",{"$f":"IF(ISNUMBER(Taxa_PivotTable!H271),Taxa_PivotTable!H271,\"\")","v":""},"","","",{"$f":"IF(ISNUMBER(Taxa_PivotTable!I271),Taxa_PivotTable!I271,\"\")","v":""},"","","",{"$f":"IF(ISNUMBER(Taxa_PivotTable!J271),Taxa_PivotTable!J271,\"\")","v":""},"","","",{"$f":"IF(ISNUMBER(Taxa_PivotTable!K271),Taxa_PivotTable!K271,\"\")","v":""},"","",""]
[{"$f":"Taxa_PivotTable!A272","v":{"$error":"#N/A"}},{"$f":"IF(Taxa_PivotTable!B272=\"\",\"\",Taxa_PivotTable!B272)","v":""},{"$f":"IF(ISNUMBER(VLOOKUP(B272,UKOptima!A:J,10,FALSE)),VLOOKUP(B272,UKOptima!A:J,10,FALSE),\"\")","v":""},{"$f":"IF(ISNUMBER(Taxa_PivotTable!C272),Taxa_PivotTable!C272,\"\")","v":""},"","","",{"$f":"IF(ISNUMBER(Taxa_PivotTable!D272),Taxa_PivotTable!D272,\"\")","v":""},"","","",{"$f":"IF(ISNUMBER(Taxa_PivotTable!E272),Taxa_PivotTable!E272,\"\")","v":""},"","","",{"$f":"IF(ISNUMBER(Taxa_PivotTable!F272),Taxa_PivotTable!F272,\"\")","v":""},"","","",{"$f":"IF(ISNUMBER(Taxa_PivotTable!G272),Taxa_PivotTable!G272,\"\")","v":""},"","","",{"$f":"IF(ISNUMBER(Taxa_PivotTable!H272),Taxa_PivotTable!H272,\"\")","v":""},"","","",{"$f":"IF(ISNUMBER(Taxa_PivotTable!I272),Taxa_PivotTable!I272,\"\")","v":""},"","","",{"$f":"IF(ISNUMBER(Taxa_PivotTable!J272),Taxa_PivotTable!J272,\"\")","v":""},"","","",{"$f":"IF(ISNUMBER(Taxa_PivotTable!K272),Taxa_PivotTable!K272,\"\")","v":""},"","",""]
[{"$f":"Taxa_PivotTable!A273","v":{"$error":"#N/A"}},{"$f":"IF(Taxa_PivotTable!B273=\"\",\"\",Taxa_PivotTable!B273)","v":""},{"$f":"IF(ISNUMBER(VLOOKUP(B273,UKOptima!A:J,10,FALSE)),VLOOKUP(B273,UKOptima!A:J,10,FALSE),\"\")","v":""},{"$f":"IF(ISNUMBER(Taxa_PivotTable!C273),Taxa_PivotTable!C273,\"\")","v":""},"","","",{"$f":"IF(ISNUMBER(Taxa_PivotTable!D273),Taxa_PivotTable!D273,\"\")","v":""},"","","",{"$f":"IF(ISNUMBER(Taxa_PivotTable!E273),Taxa_PivotTable!E273,\"\")","v":""},"","","",{"$f":"IF(ISNUMBER(Taxa_PivotTable!F273),Taxa_PivotTable!F273,\"\")","v":""},"","","",{"$f":"IF(ISNUMBER(Taxa_PivotTable!G273),Taxa_PivotTable!G273,\"\")","v":""},"","","",{"$f":"IF(ISNUMBER(Taxa_PivotTable!H273),Taxa_PivotTable!H273,\"\")","v":""},"","","",{"$f":"IF(ISNUMBER(Taxa_PivotTable!I273),Taxa_PivotTable!I273,\"\")","v":""},"","","",{"$f":"IF(ISNUMBER(Taxa_PivotTable!J273),Taxa_PivotTable!J273,\"\")","v":""},"","","",{"$f":"IF(ISNUMBER(Taxa_PivotTable!K273),Taxa_PivotTable!K273,\"\")","v":""},"","",""]
[{"$f":"Taxa_PivotTable!A274","v":{"$error":"#N/A"}},{"$f":"IF(Taxa_PivotTable!B274=\"\",\"\",Taxa_PivotTable!B274)","v":""},{"$f":"IF(ISNUMBER(VLOOKUP(B274,UKOptima!A:J,10,FALSE)),VLOOKUP(B274,UKOptima!A:J,10,FALSE),\"\")","v":""},{"$f":"IF(ISNUMBER(Taxa_PivotTable!C274),Taxa_PivotTable!C274,\"\")","v":""},"","","",{"$f":"IF(ISNUMBER(Taxa_PivotTable!D274),Taxa_PivotTable!D274,\"\")","v":""},"","","",{"$f":"IF(ISNUMBER(Taxa_PivotTable!E274),Taxa_PivotTable!E274,\"\")","v":""},"","","",{"$f":"IF(ISNUMBER(Taxa_PivotTable!F274),Taxa_PivotTable!F274,\"\")","v":""},"","","",{"$f":"IF(ISNUMBER(Taxa_PivotTable!G274),Taxa_PivotTable!G274,\"\")","v":""},"","","",{"$f":"IF(ISNUMBER(Taxa_PivotTable!H274),Taxa_PivotTable!H274,\"\")","v":""},"","","",{"$f":"IF(ISNUMBER(Taxa_PivotTable!I274),Taxa_PivotTable!I274,\"\")","v":""},"","","",{"$f":"IF(ISNUMBER(Taxa_PivotTable!J274),Taxa_PivotTable!J274,\"\")","v":""},"","","",{"$f":"IF(ISNUMBER(Taxa_PivotTable!K274),Taxa_PivotTable!K274,\"\")","v":""},"","",""]
[{"$f":"Taxa_PivotTable!A275","v":{"$error":"#N/A"}},{"$f":"IF(Taxa_PivotTable!B275=\"\",\"\",Taxa_PivotTable!B275)","v":""},{"$f":"IF(ISNUMBER(VLOOKUP(B275,UKOptima!A:J,10,FALSE)),VLOOKUP(B275,UKOptima!A:J,10,FALSE),\"\")","v":""},{"$f":"IF(ISNUMBER(Taxa_PivotTable!C275),Taxa_PivotTable!C275,\"\")","v":""},"","","",{"$f":"IF(ISNUMBER(Taxa_PivotTable!D275),Taxa_PivotTable!D275,\"\")","v":""},"","","",{"$f":"IF(ISNUMBER(Taxa_PivotTable!E275),Taxa_PivotTable!E275,\"\")","v":""},"","","",{"$f":"IF(ISNUMBER(Taxa_PivotTable!F275),Taxa_PivotTable!F275,\"\")","v":""},"","","",{"$f":"IF(ISNUMBER(Taxa_PivotTable!G275),Taxa_PivotTable!G275,\"\")","v":""},"","","",{"$f":"IF(ISNUMBER(Taxa_PivotTable!H275),Taxa_PivotTable!H275,\"\")","v":""},"","","",{"$f":"IF(ISNUMBER(Taxa_PivotTable!I275),Taxa_PivotTable!I275,\"\")","v":""},"","","",{"$f":"IF(ISNUMBER(Taxa_PivotTable!J275),Taxa_PivotTable!J275,\"\")","v":""},"","","",{"$f":"IF(ISNUMBER(Taxa_PivotTable!K275),Taxa_PivotTable!K275,\"\")","v":""},"","",""]
[{"$f":"Taxa_PivotTable!A276","v":{"$error":"#N/A"}},{"$f":"IF(Taxa_PivotTable!B276=\"\",\"\",Taxa_PivotTable!B276)","v":""},{"$f":"IF(ISNUMBER(VLOOKUP(B276,UKOptima!A:J,10,FALSE)),VLOOKUP(B276,UKOptima!A:J,10,FALSE),\"\")","v":""},{"$f":"IF(ISNUMBER(Taxa_PivotTable!C276),Taxa_PivotTable!C276,\"\")","v":""},"","","",{"$f":"IF(ISNUMBER(Taxa_PivotTable!D276),Taxa_PivotTable!D276,\"\")","v":""},"","","",{"$f":"IF(ISNUMBER(Taxa_PivotTable!E276),Taxa_PivotTable!E276,\"\")","v":""},"","","",{"$f":"IF(ISNUMBER(Taxa_PivotTable!F276),Taxa_PivotTable!F276,\"\")","v":""},"","","",{"$f":"IF(ISNUMBER(Taxa_PivotTable!G276),Taxa_PivotTable!G276,\"\")","v":""},"","","",{"$f":"IF(ISNUMBER(Taxa_PivotTable!H276),Taxa_PivotTable!H276,\"\")","v":""},"","","",{"$f":"IF(ISNUMBER(Taxa_PivotTable!I276),Taxa_PivotTable!I276,\"\")","v":""},"","","",{"$f":"IF(ISNUMBER(Taxa_PivotTable!J276),Taxa_PivotTable!J276,\"\")","v":""},"","","",{"$f":"IF(ISNUMBER(Taxa_PivotTable!K276),Taxa_PivotTable!K276,\"\")","v":""},"","",""]
[{"$f":"Taxa_PivotTable!A277","v":{"$error":"#N/A"}},{"$f":"IF(Taxa_PivotTable!B277=\"\",\"\",Taxa_PivotTable!B277)","v":""},{"$f":"IF(ISNUMBER(VLOOKUP(B277,UKOptima!A:J,10,FALSE)),VLOOKUP(B277,UKOptima!A:J,10,FALSE),\"\")","v":""},{"$f":"IF(ISNUMBER(Taxa_PivotTable!C277),Taxa_PivotTable!C277,\"\")","v":""},"","","",{"$f":"IF(ISNUMBER(Taxa_PivotTable!D277),Taxa_PivotTable!D277,\"\")","v":""},"","","",{"$f":"IF(ISNUMBER(Taxa_PivotTable!E277),Taxa_PivotTable!E277,\"\")","v":""},"","","",{"$f":"IF(ISNUMBER(Taxa_PivotTable!F277),Taxa_PivotTable!F277,\"\")","v":""},"","","",{"$f":"IF(ISNUMBER(Taxa_PivotTable!G277),Taxa_PivotTable!G277,\"\")","v":""},"","","",{"$f":"IF(ISNUMBER(Taxa_PivotTable!H277),Taxa_PivotTable!H277,\"\")","v":""},"",{"$f":"IF(COUNT(Y277,$C277)=2,(Y277)*$C277,\"\")","v":""},"",{"$f":"IF(ISNUMBER(Taxa_PivotTable!I277),Taxa_PivotTable!I277,\"\")","v":""},"",{"$f":"IF(COUNT(AC277,$C277)=2,(AC277)*$C277,\"\")","v":""},"",{"$f":"IF(ISNUMBER(Taxa_PivotTable!J277),Taxa_PivotTable!J277,\"\")","v":""},"",{"$f":"IF(COUNT(AG277,$C277)=2,(AG277)*$C277,\"\")","v":""},"",{"$f":"IF(ISNUMBER(Taxa_PivotTable!K277),Taxa_PivotTable!K277,\"\")","v":""},"",{"$f":"IF(COUNT(AK277,$C277)=2,(AK277)*$C277,\"\")","v":""},""]
[{"$f":"Taxa_PivotTable!A278","v":{"$error":"#N/A"}},{"$f":"IF(Taxa_PivotTable!B278=\"\",\"\",Taxa_PivotTable!B278)","v":""},{"$f":"IF(ISNUMBER(VLOOKUP(B278,UKOptima!A:J,10,FALSE)),VLOOKUP(B278,UKOptima!A:J,10,FALSE),\"\")","v":""},{"$f":"IF(ISNUMBER(Taxa_PivotTable!C278),Taxa_PivotTable!C278,\"\")","v":""},"","","",{"$f":"IF(ISNUMBER(Taxa_PivotTable!D278),Taxa_PivotTable!D278,\"\")","v":""},"","","",{"$f":"IF(ISNUMBER(Taxa_PivotTable!E278),Taxa_PivotTable!E278,\"\")","v":""},"","","",{"$f":"IF(ISNUMBER(Taxa_PivotTable!F278),Taxa_PivotTable!F278,\"\")","v":""},"","","",{"$f":"IF(ISNUMBER(Taxa_PivotTable!G278),Taxa_PivotTable!G278,\"\")","v":""},"","","",{"$f":"IF(ISNUMBER(Taxa_PivotTable!H278),Taxa_PivotTable!H278,\"\")","v":""},{"$f":"IF(ISNUMBER(X278),LOG(ROUND(X278,6)),\"\")","v":""},"","",{"$f":"IF(ISNUMBER(Taxa_PivotTable!I278),Taxa_PivotTable!I278,\"\")","v":""},{"$f":"IF(ISNUMBER(AB278),LOG(ROUND(AB278,6)),\"\")","v":""},"","",{"$f":"IF(ISNUMBER(Taxa_PivotTable!J278),Taxa_PivotTable!J278,\"\")","v":""},{"$f":"IF(ISNUMBER(AF278),LOG(ROUND(AF278,6)),\"\")","v":""},"","",{"$f":"IF(ISNUMBER(Taxa_PivotTable!K278),Taxa_PivotTable!K278,\"\")","v":""},{"$f":"IF(ISNUMBER(AJ278),LOG(ROUND(AJ278,6)),\"\")","v":""},"",""]
[{"$f":"Taxa_PivotTable!A279","v":{"$error":"#N/A"}},{"$f":"IF(Taxa_PivotTable!B279=\"\",\"\",Taxa_PivotTable!B279)","v":""},{"$f":"IF(ISNUMBER(VLOOKUP(B279,UKOptima!A:J,10,FALSE)),VLOOKUP(B279,UKOptima!A:J,10,FALSE),\"\")","v":""},{"$f":"IF(ISNUMBER(Taxa_PivotTable!C279),Taxa_PivotTable!C279,\"\")","v":""},{"$f":"IF(ISNUMBER(D279),LOG(ROUND(D279,6)),\"\")","v":""},"",{"$f":"IF(AND(ISNUMBER(D279),LEFT($B279,2)=\"01\"),D279/10^6,\"\")","v":""},{"$f":"IF(ISNUMBER(Taxa_PivotTable!D279),Taxa_PivotTable!D279,\"\")","v":""},{"$f":"IF(ISNUMBER(H279),LOG(ROUND(H279,6)),\"\")","v":""},"",{"$f":"IF(AND(ISNUMBER(H279),LEFT($B279,2)=\"01\"),H279/10^6,\"\")","v":""},{"$f":"IF(ISNUMBER(Taxa_PivotTable!E279),Taxa_PivotTable!E279,\"\")","v":""},{"$f":"IF(ISNUMBER(L279),LOG(ROUND(L279,6)),\"\")","v":""},"",{"$f":"IF(AND(ISNUMBER(L279),LEFT($B279,2)=\"01\"),L279/10^6,\"\")","v":""},{"$f":"IF(ISNUMBER(Taxa_PivotTable!F279),Taxa_PivotTable!F279,\"\")","v":""},{"$f":"IF(ISNUMBER(P279),LOG(ROUND(P279,6)),\"\")","v":""},"",{"$f":"IF(AND(ISNUMBER(P279),LEFT($B279,2)=\"01\"),P279/10^6,\"\")","v":""},{"$f":"IF(ISNUMBER(Taxa_PivotTable!G279),Taxa_PivotTable!G279,\"\")","v":""},{"$f":"IF(ISNUMBER(T279),LOG(ROUND(T279,6)),\"\")","v":""},"",{"$f":"IF(AND(ISNUMBER(T279),LEFT($B279,2)=\"01\"),T279/10^6,\"\")","v":""},{"$f":"IF(ISNUMBER(Taxa_PivotTable!H279),Taxa_PivotTable!H279,\"\")","v":""},"","",{"$f":"IF(AND(ISNUMBER(X279),LEFT($B279,2)=\"01\"),X279/10^6,\"\")","v":""},{"$f":"IF(ISNUMBER(Taxa_PivotTable!I279),Taxa_PivotTable!I279,\"\")","v":""},"","",{"$f":"IF(AND(ISNUMBER(AB279),LEFT($B279,2)=\"01\"),AB279/10^6,\"\")","v":""},{"$f":"IF(ISNUMBER(Taxa_PivotTable!J279),Taxa_PivotTable!J279,\"\")","v":""},"","",{"$f":"IF(AND(ISNUMBER(AF279),LEFT($B279,2)=\"01\"),AF279/10^6,\"\")","v":""},{"$f":"IF(ISNUMBER(Taxa_PivotTable!K279),Taxa_PivotTable!K279,\"\")","v":""},"","",{"$f":"IF(AND(ISNUMBER(AJ279),LEFT($B279,2)=\"01\"),AJ279/10^6,\"\")","v":""}]
[{"$f":"Taxa_PivotTable!A280","v":{"$error":"#N/A"}},{"$f":"IF(Taxa_PivotTable!B280=\"\",\"\",Taxa_PivotTable!B280)","v":""},{"$f":"IF(ISNUMBER(VLOOKUP(B280,UKOptima!A:J,10,FALSE)),VLOOKUP(B280,UKOptima!A:J,10,FALSE),\"\")","v":""},{"$f":"IF(ISNUMBER(Taxa_PivotTable!C280),Taxa_PivotTable!C280,\"\")","v":""},"","","",{"$f":"IF(ISNUMBER(Taxa_PivotTable!D280),Taxa_PivotTable!D280,\"\")","v":""},"","","",{"$f":"IF(ISNUMBER(Taxa_PivotTable!E280),Taxa_PivotTable!E280,\"\")","v":""},"","","",{"$f":"IF(ISNUMBER(Taxa_PivotTable!F280),Taxa_PivotTable!F280,\"\")","v":""},"","","",{"$f":"IF(ISNUMBER(Taxa_PivotTable!G280),Taxa_PivotTable!G280,\"\")","v":""},"","","",{"$f":"IF(ISNUMBER(Taxa_PivotTable!H280),Taxa_PivotTable!H280,\"\")","v":""},"","","",{"$f":"IF(ISNUMBER(Taxa_PivotTable!I280),Taxa_PivotTable!I280,\"\")","v":""},"","","",{"$f":"IF(ISNUMBER(Taxa_PivotTable!J280),Taxa_PivotTable!J280,\"\")","v":""},"","","",{"$f":"IF(ISNUMBER(Taxa_PivotTable!K280),Taxa_PivotTable!K280,\"\")","v":""},"","",""]
[{"$f":"Taxa_PivotTable!A281","v":{"$error":"#N/A"}},{"$f":"IF(Taxa_PivotTable!B281=\"\",\"\",Taxa_PivotTable!B281)","v":""},{"$f":"IF(ISNUMBER(VLOOKUP(B281,UKOptima!A:J,10,FALSE)),VLOOKUP(B281,UKOptima!A:J,10,FALSE),\"\")","v":""},{"$f":"IF(ISNUMBER(Taxa_PivotTable!C281),Taxa_PivotTable!C281,\"\")","v":""},"","","",{"$f":"IF(ISNUMBER(Taxa_PivotTable!D281),Taxa_PivotTable!D281,\"\")","v":""},"","","",{"$f":"IF(ISNUMBER(Taxa_PivotTable!E281),Taxa_PivotTable!E281,\"\")","v":""},"","","",{"$f":"IF(ISNUMBER(Taxa_PivotTable!F281),Taxa_PivotTable!F281,\"\")","v":""},"","","",{"$f":"IF(ISNUMBER(Taxa_PivotTable!G281),Taxa_PivotTable!G281,\"\")","v":""},"","","",{"$f":"IF(ISNUMBER(Taxa_PivotTable!H281),Taxa_PivotTable!H281,\"\")","v":""},"","","",{"$f":"IF(ISNUMBER(Taxa_PivotTable!I281),Taxa_PivotTable!I281,\"\")","v":""},"","","",{"$f":"IF(ISNUMBER(Taxa_PivotTable!J281),Taxa_PivotTable!J281,\"\")","v":""},"","","",{"$f":"IF(ISNUMBER(Taxa_PivotTable!K281),Taxa_PivotTable!K281,\"\")","v":""},"","",""]
[{"$f":"Taxa_PivotTable!A282","v":{"$error":"#N/A"}},{"$f":"IF(Taxa_PivotTable!B282=\"\",\"\",Taxa_PivotTable!B282)","v":""},{"$f":"IF(ISNUMBER(VLOOKUP(B282,UKOptima!A:J,10,FALSE)),VLOOKUP(B282,UKOptima!A:J,10,FALSE),\"\")","v":""},{"$f":"IF(ISNUMBER(Taxa_PivotTable!C282),Taxa_PivotTable!C282,\"\")","v":""},"","","",{"$f":"IF(ISNUMBER(Taxa_PivotTable!D282),Taxa_PivotTable!D282,\"\")","v":""},"","","",{"$f":"IF(ISNUMBER(Taxa_PivotTable!E282),Taxa_PivotTable!E282,\"\")","v":""},"","","",{"$f":"IF(ISNUMBER(Taxa_PivotTable!F282),Taxa_PivotTable!F282,\"\")","v":""},"","","",{"$f":"IF(ISNUMBER(Taxa_PivotTable!G282),Taxa_PivotTable!G282,\"\")","v":""},"","","",{"$f":"IF(ISNUMBER(Taxa_PivotTable!H282),Taxa_PivotTable!H282,\"\")","v":""},"","","",{"$f":"IF(ISNUMBER(Taxa_PivotTable!I282),Taxa_PivotTable!I282,\"\")","v":""},"","","",{"$f":"IF(ISNUMBER(Taxa_PivotTable!J282),Taxa_PivotTable!J282,\"\")","v":""},"","","",{"$f":"IF(ISNUMBER(Taxa_PivotTable!K282),Taxa_PivotTable!K282,\"\")","v":""},"","",""]
[{"$f":"Taxa_PivotTable!A283","v":{"$error":"#N/A"}},{"$f":"IF(Taxa_PivotTable!B283=\"\",\"\",Taxa_PivotTable!B283)","v":""},{"$f":"IF(ISNUMBER(VLOOKUP(B283,UKOptima!A:J,10,FALSE)),VLOOKUP(B283,UKOptima!A:J,10,FALSE),\"\")","v":""},{"$f":"IF(ISNUMBER(Taxa_PivotTable!C283),Taxa_PivotTable!C283,\"\")","v":""},"","","",{"$f":"IF(ISNUMBER(Taxa_PivotTable!D283),Taxa_PivotTable!D283,\"\")","v":""},"","","",{"$f":"IF(ISNUMBER(Taxa_PivotTable!E283),Taxa_PivotTable!E283,\"\")","v":""},"","","",{"$f":"IF(ISNUMBER(Taxa_PivotTable!F283),Taxa_PivotTable!F283,\"\")","v":""},"","","",{"$f":"IF(ISNUMBER(Taxa_PivotTable!G283),Taxa_PivotTable!G283,\"\")","v":""},"","","",{"$f":"IF(ISNUMBER(Taxa_PivotTable!H283),Taxa_PivotTable!H283,\"\")","v":""},"","","",{"$f":"IF(ISNUMBER(Taxa_PivotTable!I283),Taxa_PivotTable!I283,\"\")","v":""},"","","",{"$f":"IF(ISNUMBER(Taxa_PivotTable!J283),Taxa_PivotTable!J283,\"\")","v":""},"","","",{"$f":"IF(ISNUMBER(Taxa_PivotTable!K283),Taxa_PivotTable!K283,\"\")","v":""},"","",""]
[{"$f":"Taxa_PivotTable!A284","v":{"$error":"#N/A"}},{"$f":"IF(Taxa_PivotTable!B284=\"\",\"\",Taxa_PivotTable!B284)","v":""},{"$f":"IF(ISNUMBER(VLOOKUP(B284,UKOptima!A:J,10,FALSE)),VLOOKUP(B284,UKOptima!A:J,10,FALSE),\"\")","v":""},{"$f":"IF(ISNUMBER(Taxa_PivotTable!C284),Taxa_PivotTable!C284,\"\")","v":""},"","","",{"$f":"IF(ISNUMBER(Taxa_PivotTable!D284),Taxa_PivotTable!D284,\"\")","v":""},"","","",{"$f":"IF(ISNUMBER(Taxa_PivotTable!E284),Taxa_PivotTable!E284,\"\")","v":""},"","","",{"$f":"IF(ISNUMBER(Taxa_PivotTable!F284),Taxa_PivotTable!F284,\"\")","v":""},"","","",{"$f":"IF(ISNUMBER(Taxa_PivotTable!G284),Taxa_PivotTable!G284,\"\")","v":""},"","","",{"$f":"IF(ISNUMBER(Taxa_PivotTable!H284),Taxa_PivotTable!H284,\"\")","v":""},"","","",{"$f":"IF(ISNUMBER(Taxa_PivotTable!I284),Taxa_PivotTable!I284,\"\")","v":""},"","","",{"$f":"IF(ISNUMBER(Taxa_PivotTable!J284),Taxa_PivotTable!J284,\"\")","v":""},"","","",{"$f":"IF(ISNUMBER(Taxa_PivotTable!K284),Taxa_PivotTable!K284,\"\")","v":""},"","",""]
[{"$f":"Taxa_PivotTable!A285","v":{"$error":"#N/A"}},{"$f":"IF(Taxa_PivotTable!B285=\"\",\"\",Taxa_PivotTable!B285)","v":""},{"$f":"IF(ISNUMBER(VLOOKUP(B285,UKOptima!A:J,10,FALSE)),VLOOKUP(B285,UKOptima!A:J,10,FALSE),\"\")","v":""},{"$f":"IF(ISNUMBER(Taxa_PivotTable!C285),Taxa_PivotTable!C285,\"\")","v":""},"","","",{"$f":"IF(ISNUMBER(Taxa_PivotTable!D285),Taxa_PivotTable!D285,\"\")","v":""},"","","",{"$f":"IF(ISNUMBER(Taxa_PivotTable!E285),Taxa_PivotTable!E285,\"\")","v":""},"","","",{"$f":"IF(ISNUMBER(Taxa_PivotTable!F285),Taxa_PivotTable!F285,\"\")","v":""},"","","",{"$f":"IF(ISNUMBER(Taxa_PivotTable!G285),Taxa_PivotTable!G285,\"\")","v":""},"","","",{"$f":"IF(ISNUMBER(Taxa_PivotTable!H285),Taxa_PivotTable!H285,\"\")","v":""},"","","",{"$f":"IF(ISNUMBER(Taxa_PivotTable!I285),Taxa_PivotTable!I285,\"\")","v":""},"","","",{"$f":"IF(ISNUMBER(Taxa_PivotTable!J285),Taxa_PivotTable!J285,\"\")","v":""},"","","",{"$f":"IF(ISNUMBER(Taxa_PivotTable!K285),Taxa_PivotTable!K285,\"\")","v":""},"","",""]
[{"$f":"Taxa_PivotTable!A286","v":{"$error":"#N/A"}},{"$f":"IF(Taxa_PivotTable!B286=\"\",\"\",Taxa_PivotTable!B286)","v":""},{"$f":"IF(ISNUMBER(VLOOKUP(B286,UKOptima!A:J,10,FALSE)),VLOOKUP(B286,UKOptima!A:J,10,FALSE),\"\")","v":""},{"$f":"IF(ISNUMBER(Taxa_PivotTable!C286),Taxa_PivotTable!C286,\"\")","v":""},"","","",{"$f":"IF(ISNUMBER(Taxa_PivotTable!D286),Taxa_PivotTable!D286,\"\")","v":""},"","","",{"$f":"IF(ISNUMBER(Taxa_PivotTable!E286),Taxa_PivotTable!E286,\"\")","v":""},"","","",{"$f":"IF(ISNUMBER(Taxa_PivotTable!F286),Taxa_PivotTable!F286,\"\")","v":""},"","","",{"$f":"IF(ISNUMBER(Taxa_PivotTable!G286),Taxa_PivotTable!G286,\"\")","v":""},"","","",{"$f":"IF(ISNUMBER(Taxa_PivotTable!H286),Taxa_PivotTable!H286,\"\")","v":""},"","","",{"$f":"IF(ISNUMBER(Taxa_PivotTable!I286),Taxa_PivotTable!I286,\"\")","v":""},"","","",{"$f":"IF(ISNUMBER(Taxa_PivotTable!J286),Taxa_PivotTable!J286,\"\")","v":""},"","","",{"$f":"IF(ISNUMBER(Taxa_PivotTable!K286),Taxa_PivotTable!K286,\"\")","v":""},"","",""]
[{"$f":"Taxa_PivotTable!A287","v":{"$error":"#N/A"}},{"$f":"IF(Taxa_PivotTable!B287=\"\",\"\",Taxa_PivotTable!B287)","v":""},{"$f":"IF(ISNUMBER(VLOOKUP(B287,UKOptima!A:J,10,FALSE)),VLOOKUP(B287,UKOptima!A:J,10,FALSE),\"\")","v":""},{"$f":"IF(ISNUMBER(Taxa_PivotTable!C287),Taxa_PivotTable!C287,\"\")","v":""},"","","",{"$f":"IF(ISNUMBER(Taxa_PivotTable!D287),Taxa_PivotTable!D287,\"\")","v":""},"","","",{"$f":"IF(ISNUMBER(Taxa_PivotTable!E287),Taxa_PivotTable!E287,\"\")","v":""},"","","",{"$f":"IF(ISNUMBER(Taxa_PivotTable!F287),Taxa_PivotTable!F287,\"\")","v":""},"","","",{"$f":"IF(ISNUMBER(Taxa_PivotTable!G287),Taxa_PivotTable!G287,\"\")","v":""},"","","",{"$f":"IF(ISNUMBER(Taxa_PivotTable!H287),Taxa_PivotTable!H287,\"\")","v":""},"","","",{"$f":"IF(ISNUMBER(Taxa_PivotTable!I287),Taxa_PivotTable!I287,\"\")","v":""},"","","",{"$f":"IF(ISNUMBER(Taxa_PivotTable!J287),Taxa_PivotTable!J287,\"\")","v":""},"","","",{"$f":"IF(ISNUMBER(Taxa_PivotTable!K287),Taxa_PivotTable!K287,\"\")","v":""},"","",""]
[{"$f":"Taxa_PivotTable!A288","v":{"$error":"#N/A"}},{"$f":"IF(Taxa_PivotTable!B288=\"\",\"\",Taxa_PivotTable!B288)","v":""},{"$f":"IF(ISNUMBER(VLOOKUP(B288,UKOptima!A:J,10,FALSE)),VLOOKUP(B288,UKOptima!A:J,10,FALSE),\"\")","v":""},{"$f":"IF(ISNUMBER(Taxa_PivotTable!C288),Taxa_PivotTable!C288,\"\")","v":""},"","","",{"$f":"IF(ISNUMBER(Taxa_PivotTable!D288),Taxa_PivotTable!D288,\"\")","v":""},"","","",{"$f":"IF(ISNUMBER(Taxa_PivotTable!E288),Taxa_PivotTable!E288,\"\")","v":""},"","","",{"$f":"IF(ISNUMBER(Taxa_PivotTable!F288),Taxa_PivotTable!F288,\"\")","v":""},"","","",{"$f":"IF(ISNUMBER(Taxa_PivotTable!G288),Taxa_PivotTable!G288,\"\")","v":""},"","","",{"$f":"IF(ISNUMBER(Taxa_PivotTable!H288),Taxa_PivotTable!H288,\"\")","v":""},"","","",{"$f":"IF(ISNUMBER(Taxa_PivotTable!I288),Taxa_PivotTable!I288,\"\")","v":""},"","","",{"$f":"IF(ISNUMBER(Taxa_PivotTable!J288),Taxa_PivotTable!J288,\"\")","v":""},"","","",{"$f":"IF(ISNUMBER(Taxa_PivotTable!K288),Taxa_PivotTable!K288,\"\")","v":""},"","",""]
[{"$f":"Taxa_PivotTable!A289","v":{"$error":"#N/A"}},{"$f":"IF(Taxa_PivotTable!B289=\"\",\"\",Taxa_PivotTable!B289)","v":""},{"$f":"IF(ISNUMBER(VLOOKUP(B289,UKOptima!A:J,10,FALSE)),VLOOKUP(B289,UKOptima!A:J,10,FALSE),\"\")","v":""},{"$f":"IF(ISNUMBER(Taxa_PivotTable!C289),Taxa_PivotTable!C289,\"\")","v":""},"","","",{"$f":"IF(ISNUMBER(Taxa_PivotTable!D289),Taxa_PivotTable!D289,\"\")","v":""},"","","",{"$f":"IF(ISNUMBER(Taxa_PivotTable!E289),Taxa_PivotTable!E289,\"\")","v":""},"","","",{"$f":"IF(ISNUMBER(Taxa_PivotTable!F289),Taxa_PivotTable!F289,\"\")","v":""},"","","",{"$f":"IF(ISNUMBER(Taxa_PivotTable!G289),Taxa_PivotTable!G289,\"\")","v":""},"","","",{"$f":"IF(ISNUMBER(Taxa_PivotTable!H289),Taxa_PivotTable!H289,\"\")","v":""},"","","",{"$f":"IF(ISNUMBER(Taxa_PivotTable!I289),Taxa_PivotTable!I289,\"\")","v":""},"","","",{"$f":"IF(ISNUMBER(Taxa_PivotTable!J289),Taxa_PivotTable!J289,\"\")","v":""},"","","",{"$f":"IF(ISNUMBER(Taxa_PivotTable!K289),Taxa_PivotTable!K289,\"\")","v":""},"","",""]
[{"$f":"Taxa_PivotTable!A290","v":{"$error":"#N/A"}},{"$f":"IF(Taxa_PivotTable!B290=\"\",\"\",Taxa_PivotTable!B290)","v":""},{"$f":"IF(ISNUMBER(VLOOKUP(B290,UKOptima!A:J,10,FALSE)),VLOOKUP(B290,UKOptima!A:J,10,FALSE),\"\")","v":""},{"$f":"IF(ISNUMBER(Taxa_PivotTable!C290),Taxa_PivotTable!C290,\"\")","v":""},"","","",{"$f":"IF(ISNUMBER(Taxa_PivotTable!D290),Taxa_PivotTable!D290,\"\")","v":""},"","","",{"$f":"IF(ISNUMBER(Taxa_PivotTable!E290),Taxa_PivotTable!E290,\"\")","v":""},"","","",{"$f":"IF(ISNUMBER(Taxa_PivotTable!F290),Taxa_PivotTable!F290,\"\")","v":""},"","","",{"$f":"IF(ISNUMBER(Taxa_PivotTable!G290),Taxa_PivotTable!G290,\"\")","v":""},"","","",{"$f":"IF(ISNUMBER(Taxa_PivotTable!H290),Taxa_PivotTable!H290,\"\")","v":""},"","","",{"$f":"IF(ISNUMBER(Taxa_PivotTable!I290),Taxa_PivotTable!I290,\"\")","v":""},"","","",{"$f":"IF(ISNUMBER(Taxa_PivotTable!J290),Taxa_PivotTable!J290,\"\")","v":""},"","","",{"$f":"IF(ISNUMBER(Taxa_PivotTable!K290),Taxa_PivotTable!K290,\"\")","v":""},"","",""]
[{"$f":"Taxa_PivotTable!A291","v":{"$error":"#N/A"}},{"$f":"IF(Taxa_PivotTable!B291=\"\",\"\",Taxa_PivotTable!B291)","v":""},{"$f":"IF(ISNUMBER(VLOOKUP(B291,UKOptima!A:J,10,FALSE)),VLOOKUP(B291,UKOptima!A:J,10,FALSE),\"\")","v":""},{"$f":"IF(ISNUMBER(Taxa_PivotTable!C291),Taxa_PivotTable!C291,\"\")","v":""},"","","",{"$f":"IF(ISNUMBER(Taxa_PivotTable!D291),Taxa_PivotTable!D291,\"\")","v":""},"","","",{"$f":"IF(ISNUMBER(Taxa_PivotTable!E291),Taxa_PivotTable!E291,\"\")","v":""},"","","",{"$f":"IF(ISNUMBER(Taxa_PivotTable!F291),Taxa_PivotTable!F291,\"\")","v":""},"","","",{"$f":"IF(ISNUMBER(Taxa_PivotTable!G291),Taxa_PivotTable!G291,\"\")","v":""},"","","",{"$f":"IF(ISNUMBER(Taxa_PivotTable!H291),Taxa_PivotTable!H291,\"\")","v":""},"","","",{"$f":"IF(ISNUMBER(Taxa_PivotTable!I291),Taxa_PivotTable!I291,\"\")","v":""},"","","",{"$f":"IF(ISNUMBER(Taxa_PivotTable!J291),Taxa_PivotTable!J291,\"\")","v":""},"","","",{"$f":"IF(ISNUMBER(Taxa_PivotTable!K291),Taxa_PivotTable!K291,\"\")","v":""},"","",""]
[{"$f":"Taxa_PivotTable!A292","v":{"$error":"#N/A"}},{"$f":"IF(Taxa_PivotTable!B292=\"\",\"\",Taxa_PivotTable!B292)","v":""},{"$f":"IF(ISNUMBER(VLOOKUP(B292,UKOptima!A:J,10,FALSE)),VLOOKUP(B292,UKOptima!A:J,10,FALSE),\"\")","v":""},{"$f":"IF(ISNUMBER(Taxa_PivotTable!C292),Taxa_PivotTable!C292,\"\")","v":""},"","","",{"$f":"IF(ISNUMBER(Taxa_PivotTable!D292),Taxa_PivotTable!D292,\"\")","v":""},"","","",{"$f":"IF(ISNUMBER(Taxa_PivotTable!E292),Taxa_PivotTable!E292,\"\")","v":""},"","","",{"$f":"IF(ISNUMBER(Taxa_PivotTable!F292),Taxa_PivotTable!F292,\"\")","v":""},"","","",{"$f":"IF(ISNUMBER(Taxa_PivotTable!G292),Taxa_PivotTable!G292,\"\")","v":""},"","","",{"$f":"IF(ISNUMBER(Taxa_PivotTable!H292),Taxa_PivotTable!H292,\"\")","v":""},"","","",{"$f":"IF(ISNUMBER(Taxa_PivotTable!I292),Taxa_PivotTable!I292,\"\")","v":""},"","","",{"$f":"IF(ISNUMBER(Taxa_PivotTable!J292),Taxa_PivotTable!J292,\"\")","v":""},"","","",{"$f":"IF(ISNUMBER(Taxa_PivotTable!K292),Taxa_PivotTable!K292,\"\")","v":""},"","",""]
[{"$f":"Taxa_PivotTable!A293","v":{"$error":"#N/A"}},{"$f":"IF(Taxa_PivotTable!B293=\"\",\"\",Taxa_PivotTable!B293)","v":""},{"$f":"IF(ISNUMBER(VLOOKUP(B293,UKOptima!A:J,10,FALSE)),VLOOKUP(B293,UKOptima!A:J,10,FALSE),\"\")","v":""},{"$f":"IF(ISNUMBER(Taxa_PivotTable!C293),Taxa_PivotTable!C293,\"\")","v":""},"","","",{"$f":"IF(ISNUMBER(Taxa_PivotTable!D293),Taxa_PivotTable!D293,\"\")","v":""},"","","",{"$f":"IF(ISNUMBER(Taxa_PivotTable!E293),Taxa_PivotTable!E293,\"\")","v":""},"","","",{"$f":"IF(ISNUMBER(Taxa_PivotTable!F293),Taxa_PivotTable!F293,\"\")","v":""},"","","",{"$f":"IF(ISNUMBER(Taxa_PivotTable!G293),Taxa_PivotTable!G293,\"\")","v":""},"","","",{"$f":"IF(ISNUMBER(Taxa_PivotTable!H293),Taxa_PivotTable!H293,\"\")","v":""},"","","",{"$f":"IF(ISNUMBER(Taxa_PivotTable!I293),Taxa_PivotTable!I293,\"\")","v":""},"","","",{"$f":"IF(ISNUMBER(Taxa_PivotTable!J293),Taxa_PivotTable!J293,\"\")","v":""},"","","",{"$f":"IF(ISNUMBER(Taxa_PivotTable!K293),Taxa_PivotTable!K293,\"\")","v":""},"","",""]
[{"$f":"Taxa_PivotTable!A294","v":{"$error":"#N/A"}},{"$f":"IF(Taxa_PivotTable!B294=\"\",\"\",Taxa_PivotTable!B294)","v":""},{"$f":"IF(ISNUMBER(VLOOKUP(B294,UKOptima!A:J,10,FALSE)),VLOOKUP(B294,UKOptima!A:J,10,FALSE),\"\")","v":""},{"$f":"IF(ISNUMBER(Taxa_PivotTable!C294),Taxa_PivotTable!C294,\"\")","v":""},"","","",{"$f":"IF(ISNUMBER(Taxa_PivotTable!D294),Taxa_PivotTable!D294,\"\")","v":""},"","","",{"$f":"IF(ISNUMBER(Taxa_PivotTable!E294),Taxa_PivotTable!E294,\"\")","v":""},"","","",{"$f":"IF(ISNUMBER(Taxa_PivotTable!F294),Taxa_PivotTable!F294,\"\")","v":""},"","","",{"$f":"IF(ISNUMBER(Taxa_PivotTable!G294),Taxa_PivotTable!G294,\"\")","v":""},"","","",{"$f":"IF(ISNUMBER(Taxa_PivotTable!H294),Taxa_PivotTable!H294,\"\")","v":""},"","","",{"$f":"IF(ISNUMBER(Taxa_PivotTable!I294),Taxa_PivotTable!I294,\"\")","v":""},"","","",{"$f":"IF(ISNUMBER(Taxa_PivotTable!J294),Taxa_PivotTable!J294,\"\")","v":""},"","","",{"$f":"IF(ISNUMBER(Taxa_PivotTable!K294),Taxa_PivotTable!K294,\"\")","v":""},"","",""]
[{"$f":"Taxa_PivotTable!A295","v":{"$error":"#N/A"}},{"$f":"IF(Taxa_PivotTable!B295=\"\",\"\",Taxa_PivotTable!B295)","v":""},{"$f":"IF(ISNUMBER(VLOOKUP(B295,UKOptima!A:J,10,FALSE)),VLOOKUP(B295,UKOptima!A:J,10,FALSE),\"\")","v":""},{"$f":"IF(ISNUMBER(Taxa_PivotTable!C295),Taxa_PivotTable!C295,\"\")","v":""},"","","",{"$f":"IF(ISNUMBER(Taxa_PivotTable!D295),Taxa_PivotTable!D295,\"\")","v":""},"","","",{"$f":"IF(ISNUMBER(Taxa_PivotTable!E295),Taxa_PivotTable!E295,\"\")","v":""},"","","",{"$f":"IF(ISNUMBER(Taxa_PivotTable!F295),Taxa_PivotTable!F295,\"\")","v":""},"","","",{"$f":"IF(ISNUMBER(Taxa_PivotTable!G295),Taxa_PivotTable!G295,\"\")","v":""},"","","",{"$f":"IF(ISNUMBER(Taxa_PivotTable!H295),Taxa_PivotTable!H295,\"\")","v":""},"","","",{"$f":"IF(ISNUMBER(Taxa_PivotTable!I295),Taxa_PivotTable!I295,\"\")","v":""},"","","",{"$f":"IF(ISNUMBER(Taxa_PivotTable!J295),Taxa_PivotTable!J295,\"\")","v":""},"","","",{"$f":"IF(ISNUMBER(Taxa_PivotTable!K295),Taxa_PivotTable!K295,\"\")","v":""},"","",""]
[{"$f":"Taxa_PivotTable!A296","v":{"$error":"#N/A"}},{"$f":"IF(Taxa_PivotTable!B296=\"\",\"\",Taxa_PivotTable!B296)","v":""},{"$f":"IF(ISNUMBER(VLOOKUP(B296,UKOptima!A:J,10,FALSE)),VLOOKUP(B296,UKOptima!A:J,10,FALSE),\"\")","v":""},{"$f":"IF(ISNUMBER(Taxa_PivotTable!C296),Taxa_PivotTable!C296,\"\")","v":""},"","","",{"$f":"IF(ISNUMBER(Taxa_PivotTable!D296),Taxa_PivotTable!D296,\"\")","v":""},"","","",{"$f":"IF(ISNUMBER(Taxa_PivotTable!E296),Taxa_PivotTable!E296,\"\")","v":""},"","","",{"$f":"IF(ISNUMBER(Taxa_PivotTable!F296),Taxa_PivotTable!F296,\"\")","v":""},"","","",{"$f":"IF(ISNUMBER(Taxa_PivotTable!G296),Taxa_PivotTable!G296,\"\")","v":""},"","","",{"$f":"IF(ISNUMBER(Taxa_PivotTable!H296),Taxa_PivotTable!H296,\"\")","v":""},"","","",{"$f":"IF(ISNUMBER(Taxa_PivotTable!I296),Taxa_PivotTable!I296,\"\")","v":""},"","","",{"$f":"IF(ISNUMBER(Taxa_PivotTable!J296),Taxa_PivotTable!J296,\"\")","v":""},"","","",{"$f":"IF(ISNUMBER(Taxa_PivotTable!K296),Taxa_PivotTable!K296,\"\")","v":""},"","",""]
[{"$f":"Taxa_PivotTable!A297","v":{"$error":"#N/A"}},{"$f":"IF(Taxa_PivotTable!B297=\"\",\"\",Taxa_PivotTable!B297)","v":""},{"$f":"IF(ISNUMBER(VLOOKUP(B297,UKOptima!A:J,10,FALSE)),VLOOKUP(B297,UKOptima!A:J,10,FALSE),\"\")","v":""},{"$f":"IF(ISNUMBER(Taxa_PivotTable!C297),Taxa_PivotTable!C297,\"\")","v":""},"","","",{"$f":"IF(ISNUMBER(Taxa_PivotTable!D297),Taxa_PivotTable!D297,\"\")","v":""},"","","",{"$f":"IF(ISNUMBER(Taxa_PivotTable!E297),Taxa_PivotTable!E297,\"\")","v":""},"","","",{"$f":"IF(ISNUMBER(Taxa_PivotTable!F297),Taxa_PivotTable!F297,\"\")","v":""},"","","",{"$f":"IF(ISNUMBER(Taxa_PivotTable!G297),Taxa_PivotTable!G297,\"\")","v":""},"","","",{"$f":"IF(ISNUMBER(Taxa_PivotTable!H297),Taxa_PivotTable!H297,\"\")","v":""},"","","",{"$f":"IF(ISNUMBER(Taxa_PivotTable!I297),Taxa_PivotTable!I297,\"\")","v":""},"","","",{"$f":"IF(ISNUMBER(Taxa_PivotTable!J297),Taxa_PivotTable!J297,\"\")","v":""},"","","",{"$f":"IF(ISNUMBER(Taxa_PivotTable!K297),Taxa_PivotTable!K297,\"\")","v":""},"","",""]
[{"$f":"Taxa_PivotTable!A298","v":{"$error":"#N/A"}},{"$f":"IF(Taxa_PivotTable!B298=\"\",\"\",Taxa_PivotTable!B298)","v":""},{"$f":"IF(ISNUMBER(VLOOKUP(B298,UKOptima!A:J,10,FALSE)),VLOOKUP(B298,UKOptima!A:J,10,FALSE),\"\")","v":""},{"$f":"IF(ISNUMBER(Taxa_PivotTable!C298),Taxa_PivotTable!C298,\"\")","v":""},"","","",{"$f":"IF(ISNUMBER(Taxa_PivotTable!D298),Taxa_PivotTable!D298,\"\")","v":""},"","","",{"$f":"IF(ISNUMBER(Taxa_PivotTable!E298),Taxa_PivotTable!E298,\"\")","v":""},"","","",{"$f":"IF(ISNUMBER(Taxa_PivotTable!F298),Taxa_PivotTable!F298,\"\")","v":""},"","","",{"$f":"IF(ISNUMBER(Taxa_PivotTable!G298),Taxa_PivotTable!G298,\"\")","v":""},"","","",{"$f":"IF(ISNUMBER(Taxa_PivotTable!H298),Taxa_PivotTable!H298,\"\")","v":""},"","","",{"$f":"IF(ISNUMBER(Taxa_PivotTable!I298),Taxa_PivotTable!I298,\"\")","v":""},"","","",{"$f":"IF(ISNUMBER(Taxa_PivotTable!J298),Taxa_PivotTable!J298,\"\")","v":""},"","","",{"$f":"IF(ISNUMBER(Taxa_PivotTable!K298),Taxa_PivotTable!K298,\"\")","v":""},"","",""]
[{"$f":"Taxa_PivotTable!A299","v":{"$error":"#N/A"}},{"$f":"IF(Taxa_PivotTable!B299=\"\",\"\",Taxa_PivotTable!B299)","v":""},{"$f":"IF(ISNUMBER(VLOOKUP(B299,UKOptima!A:J,10,FALSE)),VLOOKUP(B299,UKOptima!A:J,10,FALSE),\"\")","v":""},{"$f":"IF(ISNUMBER(Taxa_PivotTable!C299),Taxa_PivotTable!C299,\"\")","v":""},"","","",{"$f":"IF(ISNUMBER(Taxa_PivotTable!D299),Taxa_PivotTable!D299,\"\")","v":""},"","","",{"$f":"IF(ISNUMBER(Taxa_PivotTable!E299),Taxa_PivotTable!E299,\"\")","v":""},"","","",{"$f":"IF(ISNUMBER(Taxa_PivotTable!F299),Taxa_PivotTable!F299,\"\")","v":""},"","","",{"$f":"IF(ISNUMBER(Taxa_PivotTable!G299),Taxa_PivotTable!G299,\"\")","v":""},"","","",{"$f":"IF(ISNUMBER(Taxa_PivotTable!H299),Taxa_PivotTable!H299,\"\")","v":""},"","","",{"$f":"IF(ISNUMBER(Taxa_PivotTable!I299),Taxa_PivotTable!I299,\"\")","v":""},"","","",{"$f":"IF(ISNUMBER(Taxa_PivotTable!J299),Taxa_PivotTable!J299,\"\")","v":""},"","","",{"$f":"IF(ISNUMBER(Taxa_PivotTable!K299),Taxa_PivotTable!K299,\"\")","v":""},"","",""]
[{"$f":"Taxa_PivotTable!A300","v":{"$error":"#N/A"}},{"$f":"IF(Taxa_PivotTable!B300=\"\",\"\",Taxa_PivotTable!B300)","v":""},{"$f":"IF(ISNUMBER(VLOOKUP(B300,UKOptima!A:J,10,FALSE)),VLOOKUP(B300,UKOptima!A:J,10,FALSE),\"\")","v":""},{"$f":"IF(ISNUMBER(Taxa_PivotTable!C300),Taxa_PivotTable!C300,\"\")","v":""},"","","",{"$f":"IF(ISNUMBER(Taxa_PivotTable!D300),Taxa_PivotTable!D300,\"\")","v":""},"","","",{"$f":"IF(ISNUMBER(Taxa_PivotTable!E300),Taxa_PivotTable!E300,\"\")","v":""},"","","",{"$f":"IF(ISNUMBER(Taxa_PivotTable!F300),Taxa_PivotTable!F300,\"\")","v":""},"","","",{"$f":"IF(ISNUMBER(Taxa_PivotTable!G300),Taxa_PivotTable!G300,\"\")","v":""},"","","",{"$f":"IF(ISNUMBER(Taxa_PivotTable!H300),Taxa_PivotTable!H300,\"\")","v":""},"","","",{"$f":"IF(ISNUMBER(Taxa_PivotTable!I300),Taxa_PivotTable!I300,\"\")","v":""},"","","",{"$f":"IF(ISNUMBER(Taxa_PivotTable!J300),Taxa_PivotTable!J300,\"\")","v":""},"","","",{"$f":"IF(ISNUMBER(Taxa_PivotTable!K300),Taxa_PivotTable!K300,\"\")","v":""},"","",""]

{"sheet":"Classification","index":9,"n_rows":19,"n_cols":23,"rows_kept":19,"cut":false,"hidden":false,"merged":[[3,9,3,12],[3,16,3,20],[8,0,8,1],[10,0,10,1]]}
["Classification Results"]
["WBID",{"$f":"'Site Data'!B2","v":28986}]
["Name",{"$f":"'Site Data'!B3","v":"Loweswater"}]
[null,null,null,"Mean",null,null,null,null,null,"Confidence worse than class",null,null,null,null,"Face Value Class",null,"Confidence of class"]
["Metric","Years Classified",null,"EQRnorm","N","DF","Std Dev","Std Err",null,"p<H","p<G","p<M","p<P",null,"FV Class",null,"High","Good","Moderate","Poor","Bad",null,"Check"]
["Chlorophyll",{"$f":"IF(COUNT('Chlorophyll Data'!G14:G73)>1,MIN('Chlorophyll Data'!G14:G73)&\"-\"&MAX('Chlorophyll Data'!G14:G73),\"\")","v":"2010-2012"},null,{"$f":"'Chlorophyll Data'!M7","v":0.69728324695168642},{"$f":"'Chlorophyll Data'!M20","v":36},{"$f":"E6-1","v":35},{"$f":"'Chlorophyll Data'!M14*SQRT('Chlorophyll Data'!M20)","v":0.11460835407116209},{"$f":"'Chlorophyll Data'!M14","v":1.9101392345193681E-2},null,{"$f":"IF($D6>0.8,TDIST(ABS((0.8-$D6)/$H6),$F6,1),1-TDIST(ABS((0.8-$D6)/$H6),$F6,1))","v":0.99999744337122598},{"$f":"IF($D6>0.6,TDIST(ABS((0.6-$D6)/$H6),$F6,1),1-TDIST(ABS((0.6-$D6)/$H6),$F6,1))","v":6.0556548111206979E-6},{"$f":"IF($D6>0.4,TDIST(ABS((0.4-$D6)/$H6),$F6,1),1-TDIST(ABS((0.4-$D6)/$H6),$F6,1))","v":1.3339797742758406E-17},{"$f":"IF($D6>0.2,TDIST(ABS((0.2-$D6)/$H6),$F6,1),1-TDIST(ABS((0.2-$D6)/$H6),$F6,1))","v":8.5262625976048483E-25},null,{"$f":"IF(D6>0.8,\"High\",IF(D6>0.6,\"Good\",IF(D6>0.4,\"Moderate\",IF(D6>0.2,\"Poor\",\"Bad\"))))","v":"Good"},null,{"$f":"1-J6","v":2.5566287740197424E-6},{"$f":"J6-K6","v":0.99999138771641483},6.055654811107358E-6,1.3339796890132147E-17,{"$f":"M6","v":8.5262625976048483E-25},null,{"$f":"SUM(Q6:U6)=1","v":true}]
["PTI",{"$f":"YEAR(MIN('Taxon EQRs'!G2,'Taxon EQRs'!K2,'Taxon EQRs'!O2,'Taxon EQRs'!S2,'Taxon EQRs'!W2,'Taxon EQRs'!AA2,'Taxon EQRs'!AE2,'Taxon EQRs'!AI2,'Taxon EQRs'!AM2))&\"-\"&YEAR(MAX('Taxon EQRs'!G2:AM2))","v":"2010-2012"},null,{"$f":"AVERAGE('Taxon EQRs'!G4:AM4)","v":0.54912537174425979},{"$f":"COUNT('Taxon EQRs'!G4:AM4)","v":7},{"$f":"E7-1","v":6},{"$f":"STDEV('Taxon EQRs'!G4:AM4)","v":0.10276921042508551},{"$f":"G7/SQRT(E7)","v":3.8843110459891826E-2},null,{"$f":"IF($D7>0.8,TDIST(ABS((0.8-$D7)/$H7),$F7,1),1-TDIST(ABS((0.8-$D7)/$H7),$F7,1))","v":0.99967344760375643},{"$f":"IF($D7>0.6,TDIST(ABS((0.6-$D7)/$H7),$F7,1),1-TDIST(ABS((0.6-$D7)/$H7),$F7,1))","v":0.88090347249239453},{"$f":"IF($D7>0.4,TDIST(ABS((0.4-$D7)/$H7),$F7,1),1-TDIST(ABS((0.4-$D7)/$H7),$F7,1))","v":4.2835876064478157E-3},{"$f":"IF($D7>0.2,TDIST(ABS((0.2-$D7)/$H7),$F7,1),1-TDIST(ABS((0.2-$D7)/$H7),$F7,1))","v":5.3030093332267254E-5},null,{"$f":"IF(D7>0.8,\"High\",IF(D7>0.6,\"Good\",IF(D7>0.4,\"Moderate\",IF(D7>0.2,\"Poor\",\"Bad\"))))","v":"Moderate"},null,{"$f":"1-J7","v":3.2655239624357346E-4},0.11876997511136189,0.87661988488594667,4.2305575131155486E-3,{"$f":"M7","v":5.3030093332267254E-5},null,{"$f":"SUM(Q7:U7)=1","v":true}]
["Cyanobacteria",{"$f":"B7","v":"2010-2012"},null,{"$f":"AVERAGE('Taxon EQRs'!G9:AM9)","v":0.48518275118653087},{"$f":"COUNT('Taxon EQRs'!G9:AM9)","v":7},{"$f":"E8-1","v":6},{"$f":"STDEV('Taxon EQRs'!G9:AM9)","v":0.10859148605519749},{"$f":"G8/SQRT(E8)","v":4.1043723800141561E-2},null,{"$f":"IF($D8>0.8,TDIST(ABS((0.8-$D8)/$H8),$F8,1),1-TDIST(ABS((0.8-$D8)/$H8),$F8,1))","v":0.9998716018829571},{"$f":"IF($D8>0.6,TDIST(ABS((0.6-$D8)/$H8),$F8,1),1-TDIST(ABS((0.6-$D8)/$H8),$F8,1))","v":0.98436531336469524},{"$f":"IF($D8>0.4,TDIST(ABS((0.4-$D8)/$H8),$F8,1),1-TDIST(ABS((0.4-$D8)/$H8),$F8,1))","v":4.1630645453891529E-2},{"$f":"IF($D8>0.2,TDIST(ABS((0.2-$D8)/$H8),$F8,1),1-TDIST(ABS((0.2-$D8)/$H8),$F8,1))","v":2.2043102126572813E-4},null,{"$f":"IF(D8>0.8,\"High\",IF(D8>0.6,\"Good\",IF(D8>0.4,\"Moderate\",IF(D8>0.2,\"Poor\",\"Bad\"))))","v":"Moderate"},null,{"$f":"1-J8","v":1.2839811704290494E-4},1.5506288518261857E-2,0.94273466791080374,4.1410214432625804E-2,{"$f":"M8","v":2.2043102126572813E-4},null,{"$f":"SUM(Q8:U8)=1","v":true}]
["Chlorophyll & PTI ",null,null,{"$f":"AVERAGE(D6:D7)","v":0.62320430934797311},null,{"$f":"SUM(G$6^2/2,G$7^2/2)^2/SUM((G$6^2/2)^2/F$6,(G$7^2/2)^2/F$7)","v":23.874139605618787},null,{"$f":"SQRT(SUM(H$6^2,H$7^2))/2","v":2.164284188666302E-2},null,{"$f":"IF($D9>0.8,TDIST(ABS((0.8-$D9)/$H9),$F9,1),1-TDIST(ABS((0.8-$D9)/$H9),$F9,1))","v":0.99999998503875764},{"$f":"IF($D9>0.6,TDIST(ABS((0.6-$D9)/$H9),$F9,1),1-TDIST(ABS((0.6-$D9)/$H9),$F9,1))","v":0.14738770081734817},{"$f":"IF($D9>0.4,TDIST(ABS((0.4-$D9)/$H9),$F9,1),1-TDIST(ABS((0.4-$D9)/$H9),$F9,1))","v":2.1298032629953633E-10},{"$f":"IF($D9>0.2,TDIST(ABS((0.2-$D9)/$H9),$F9,1),1-TDIST(ABS((0.2-$D9)/$H9),$F9,1))","v":3.9507652413217065E-16},null,{"$f":"IF(D9>0.8,\"High\",IF(D9>0.6,\"Good\",IF(D9>0.4,\"Moderate\",IF(D9>0.2,\"Poor\",\"Bad\"))))","v":"Good"},null,{"$f":"1-J9","v":1.4961242356115179E-8},{"$f":"J9-K9","v":0.85261228422140944},0.14738770060436784,2.129799312230122E-10,{"$f":"M9","v":3.9507652413217065E-16},null,{"$f":"SUM(Q9:U9)=1","v":true}]
["Chlorophyll, PTI & Cyanobacteria",null,null,{"$f":"AVERAGE(D6:D8)","v":0.57719712329415895},null,{"$f":"SUM(G$6^2/3,G$7^2/3,G$8^2/3)^2/SUM((G$6^2/3)^2/F$6,(G$7^2/3)^2/F$7,(G$8^2/3)^2/F$8)","v":26.971209836851937},null,{"$f":"SQRT(SUM(H$6^2,H$7^2,H$8^2))/3","v":1.9883655161147051E-2},null,{"$f":"IF($D10>0.8,TDIST(ABS((0.8-$D10)/$H10),$F10,1),1-TDIST(ABS((0.8-$D10)/$H10),$F10,1))","v":0.99999999999058042},{"$f":"IF($D10>0.6,TDIST(ABS((0.6-$D10)/$H10),$F10,1),1-TDIST(ABS((0.6-$D10)/$H10),$F10,1))","v":0.86904869918204986},{"$f":"IF($D10>0.4,TDIST(ABS((0.4-$D10)/$H10),$F10,1),1-TDIST(ABS((0.4-$D10)/$H10),$F10,1))","v":1.1029123252042447E-9},{"$f":"IF($D10>0.2,TDIST(ABS((0.2-$D10)/$H10),$F10,1),1-TDIST(ABS((0.2-$D10)/$H10),$F10,1))","v":4.7230098039687922E-17},null,{"$f":"IF(D10>0.8,\"High\",IF(D10>0.6,\"Good\",IF(D10>0.4,\"Moderate\",IF(D10>0.2,\"Poor\",\"Bad\"))))","v":"Moderate"},null,{"$f":"1-J10","v":9.4195762301296782E-12},0.13095130080853057,0.86904869807913754,1.1029122779741467E-9,{"$f":"M10","v":4.7230098039687922E-17},null,{"$f":"SUM(Q10:U10)=1","v":true}]
["Cyan EQR < Average Chl and PTI EQR",null,null,{"$f":"D8<D9","v":true}]
["Combined Phytoplankton Status",null,null,{"$f":"IF(D8<D9,D10,D9)","v":0.57719712329415895},null,{"$f":"IF(D$8<D$9,SUM(G$6^2/3,G$7^2/3,G$8^2/3)^2/SUM((G$6^2/3)^2/F$6,(G$7^2/3)^2/F$7,(G$8^2/3)^2/F$8),SUM(G$6^2/2,G$7^2/2)^2/SUM((G$6^2/2)^2/F$6,(G$7^2/2)^2/F$7))","v":26.971209836851937},null,{"$f":"IF(D8<D9,H10,H9)","v":1.9883655161147051E-2},null,{"$f":"IF($D12>0.8,TDIST(ABS((0.8-$D12)/$H12),$F12,1),1-TDIST(ABS((0.8-$D12)/$H12),$F12,1))","v":0.99999999999058042},{"$f":"IF($D12>0.6,TDIST(ABS((0.6-$D12)/$H12),$F12,1),1-TDIST(ABS((0.6-$D12)/$H12),$F12,1))","v":0.86904869918204986},{"$f":"IF($D12>0.4,TDIST(ABS((0.4-$D12)/$H12),$F12,1),1-TDIST(ABS((0.4-$D12)/$H12),$F12,1))","v":1.1029123252042447E-9},{"$f":"IF($D12>0.2,TDIST(ABS((0.2-$D12)/$H12),$F12,1),1-TDIST(ABS((0.2-$D12)/$H12),$F12,1))","v":4.7230098039687922E-17},null,{"$f":"IF(D12>0.8,\"High\",IF(D12>0.6,\"Good\",IF(D12>0.4,\"Moderate\",IF(D12>0.2,\"Poor\",\"Bad\"))))","v":"Moderate"},null,{"$f":"1-J12","v":9.4195762301296782E-12},{"$f":"J12-K12","v":0.13095130080853057},{"$f":"K12-L12","v":0.86904869807913754},{"$f":"L12-M12","v":1.1029122779741467E-9},{"$f":"M12","v":4.7230098039687922E-17},null,{"$f":"SUM(Q12:U12)=1","v":true}]
[]
[]
[]
["Chlorophyll","2010-2012",null,0.69669393621880515,39,38,0.2056586162761668,3.2931734538411431E-2,null,0.9983546165704178,2.8072577240340489E-3,2.8537188429030571E-11,6.2966143938977221E-18,null,"Good",null,1.6453834295822034E-3,0.99554735884638379,2.8072576954968607E-3,2.8537182132416175E-11,6.2966143938977221E-18,null,true]
["Chlorophyll","2010-2012",null,0.69669393621880515,39,38,0.11439687776433145,1.8318160837468619E-2,null,0.99999911119523421,2.7723218838518919E-6,5.9895740025205942E-19,9.0517995851496862E-27,null,"Good",null,8.8880476578623302E-7,0.99999633887335038,2.7723218838512931E-6,5.9895739120025984E-19,9.0517995851496862E-27,null,true]
["Chlorophyll","2010-2012",null,0.71559152566259621,11,10,0.18749585494909363,5.6532127328458553E-2,null,0.91686368041657329,3.4054586797468318E-2,1.166443678052714E-4,1.8358463584701246E-6,null,"Good",null,8.313631958342671E-2,0.88280909361910498,3.3937942429663047E-2,1.1480852144680128E-4,1.8358463584701246E-6,null,true]
["Chlorophyll","2010-2012",null,0.71559152566259621,11,10,0.11153926390243514,3.3630353432437234E-2,null,0.98454077351130409,3.1810354333355875E-3,1.4187129221770404E-6,1.4170051953831669E-8,null,"Good",null,1.545922648869591E-2,0.9813597380779685,3.1796167204134105E-3,1.4045428702232088E-6,1.4170051953831669E-8,null,true]

{"sheet":"Data for Export","index":10,"n_rows":22,"n_cols":11,"rows_kept":22,"cut":false,"hidden":false,"merged":[[21,0,21,1],[17,0,17,1],[18,0,18,1],[19,0,19,1],[20,0,20,1]]}
["Sample metric results"]
[]
[null,{"$f":"'Taxon EQRs'!G2","v":"2010-07-07"},{"$f":"'Taxon EQRs'!K2","v":"2010-08-12"},{"$f":"'Taxon EQRs'!O2","v":"2010-09-13"},{"$f":"'Taxon EQRs'!S2","v":"2011-09-27"},{"$f":"'Taxon EQRs'!W2","v":"2012-07-24"},{"$f":"'Taxon EQRs'!AA2","v":"2012-08-21"},{"$f":"'Taxon EQRs'!AE2","v":"2012-09-26"},{"$f":"'Taxon EQRs'!AI2","v":"(blank)"},{"$f":"'Taxon EQRs'!AM2","v":""}]
["PTI Class",{"$f":"'Taxon EQRs'!G3","v":"Moderate"},{"$f":"'Taxon EQRs'!K3","v":"Good"},{"$f":"'Taxon EQRs'!O3","v":"Good"},{"$f":"'Taxon EQRs'!S3","v":"Moderate"},{"$f":"'Taxon EQRs'!W3","v":"Good"},{"$f":"'Taxon EQRs'!AA3","v":"Moderate"},{"$f":"'Taxon EQRs'!AE3","v":"Good"},{"$f":"'Taxon EQRs'!AI3","v":""},{"$f":"'Taxon EQRs'!AM3","v":""}]
["PTI EQRNorm",{"$f":"'Taxon EQRs'!G4","v":0.45118686363877991},{"$f":"'Taxon EQRs'!K4","v":0.66061479537862622},{"$f":"'Taxon EQRs'!O4","v":0.62727228797134804},{"$f":"'Taxon EQRs'!S4","v":0.43480743463478566},{"$f":"'Taxon EQRs'!W4","v":0.60859559763354332},{"$f":"'Taxon EQRs'!AA4","v":0.43594796059186558},{"$f":"'Taxon EQRs'!AE4","v":0.62545266236087005},{"$f":"'Taxon EQRs'!AI4","v":""},{"$f":"'Taxon EQRs'!AM4","v":""}]
["PTI EQR",{"$f":"'Taxon EQRs'!G5","v":0.78429145565983194},{"$f":"'Taxon EQRs'!K5","v":0.89665725061653789},{"$f":"'Taxon EQRs'!O5","v":0.87982714458811562},{"$f":"'Taxon EQRs'!S5","v":0.77473567165888091},{"$f":"'Taxon EQRs'!W5","v":0.87024289641339214},{"$f":"'Taxon EQRs'!AA5","v":0.77540531934902546},{"$f":"'Taxon EQRs'!AE5","v":0.87889843960993552},{"$f":"'Taxon EQRs'!AI5","v":{"$error":"#DIV/0!"}},{"$f":"'Taxon EQRs'!AM5","v":{"$error":"#DIV/0!"}}]
["Ref PTI",{"$f":"'Taxon EQRs'!G6","v":0.45247031250351161},{"$f":"'Taxon EQRs'!K6","v":0.45247031250351161},{"$f":"'Taxon EQRs'!O6","v":0.45247031250351161},{"$f":"'Taxon EQRs'!S6","v":0.45247031250351161},{"$f":"'Taxon EQRs'!W6","v":0.45247031250351161},{"$f":"'Taxon EQRs'!AA6","v":0.45247031250351161},{"$f":"'Taxon EQRs'!AE6","v":0.45247031250351161},{"$f":"'Taxon EQRs'!AI6","v":0.45247031250351161},{"$f":"'Taxon EQRs'!AM6","v":0.45247031250351161}]
["PTI",{"$f":"'Taxon EQRs'!G7","v":0.5166500082913642},{"$f":"'Taxon EQRs'!K7","v":0.48321784843260102},{"$f":"'Taxon EQRs'!O7","v":0.48822530461977026},{"$f":"'Taxon EQRs'!S7","v":0.51949313771895111},{"$f":"'Taxon EQRs'!W7","v":0.49107690298408452},{"$f":"'Taxon EQRs'!AA7","v":0.51929389765096967},{"$f":"'Taxon EQRs'!AE7","v":0.4885016219217046},{"$f":"'Taxon EQRs'!AI7","v":{"$error":"#DIV/0!"}},{"$f":"'Taxon EQRs'!AM7","v":{"$error":"#DIV/0!"}}]
["Cyan Class",{"$f":"'Taxon EQRs'!G8","v":"Moderate"},{"$f":"'Taxon EQRs'!K8","v":"Moderate"},{"$f":"'Taxon EQRs'!O8","v":"Moderate"},{"$f":"'Taxon EQRs'!S8","v":"Good"},{"$f":"'Taxon EQRs'!W8","v":"Moderate"},{"$f":"'Taxon EQRs'!AA8","v":"Poor"},{"$f":"'Taxon EQRs'!AE8","v":"Moderate"},{"$f":"'Taxon EQRs'!AI8","v":""},{"$f":"'Taxon EQRs'!AM8","v":""}]
["Cyan EQRNorm",{"$f":"'Taxon EQRs'!G9","v":0.54115886468399066},{"$f":"'Taxon EQRs'!K9","v":0.50565740502405288},{"$f":"'Taxon EQRs'!O9","v":0.42119514962879967},{"$f":"'Taxon EQRs'!S9","v":0.66944757698252855},{"$f":"'Taxon EQRs'!W9","v":0.40169259676909241},{"$f":"'Taxon EQRs'!AA9","v":0.33976580508334953},{"$f":"'Taxon EQRs'!AE9","v":0.5173618601339024},{"$f":"'Taxon EQRs'!AI9","v":""},{"$f":"'Taxon EQRs'!AM9","v":""}]
["Cyan EQR",{"$f":"'Taxon EQRs'!G10","v":0.2935214891077958},{"$f":"'Taxon EQRs'!K10","v":0.2775458322608238},{"$f":"'Taxon EQRs'!O10","v":0.23953781733295984},{"$f":"'Taxon EQRs'!S10","v":0.37208568273689646},{"$f":"'Taxon EQRs'!W10","v":0.23076166854609159},{"$f":"'Taxon EQRs'!AA10","v":0.19988290254167476},{"$f":"'Taxon EQRs'!AE10","v":0.28281283706025606},{"$f":"'Taxon EQRs'!AI10","v":""},{"$f":"'Taxon EQRs'!AM10","v":""}]
["Ref Cyan",{"$f":"'Taxon EQRs'!G11","v":0},{"$f":"'Taxon EQRs'!K11","v":0},{"$f":"'Taxon EQRs'!O11","v":0},{"$f":"'Taxon EQRs'!S11","v":0},{"$f":"'Taxon EQRs'!W11","v":0},{"$f":"'Taxon EQRs'!AA11","v":0},{"$f":"'Taxon EQRs'!AE11","v":0},{"$f":"'Taxon EQRs'!AI11","v":0},{"$f":"'Taxon EQRs'!AM11","v":0}]
["Cyan Bvol (mm3/l)",{"$f":"'Taxon EQRs'!G12","v":0.74030525203291053},{"$f":"'Taxon EQRs'!K12","v":0.90557029490161822},{"$f":"'Taxon EQRs'!O12","v":1.4625643791576184},{"$f":"'Taxon EQRs'!S12","v":0.27479305146599176},{"$f":"'Taxon EQRs'!W12","v":1.6337520551650808},{"$f":"'Taxon EQRs'!AA12","v":2.4116901606386891},{"$f":"'Taxon EQRs'!AE12","v":0.84736562627557688},{"$f":"'Taxon EQRs'!AI12","v":0},{"$f":"'Taxon EQRs'!AM12","v":0}]
["Cyan %",{"$f":"'Taxon EQRs'!G13","v":0},{"$f":"'Taxon EQRs'!K13","v":0},{"$f":"'Taxon EQRs'!O13","v":0},{"$f":"'Taxon EQRs'!S13","v":0},{"$f":"'Taxon EQRs'!W13","v":0},{"$f":"'Taxon EQRs'!AA13","v":0},{"$f":"'Taxon EQRs'!AE13","v":0},{"$f":"'Taxon EQRs'!AI13","v":0},{"$f":"'Taxon EQRs'!AM13","v":0}]
[]
["Water body classification results"]
[]
[{"$f":"Classification!A5","v":"Metric"},null,{"$f":"Classification!B5","v":"Years Classified"},{"$f":"Classification!D5","v":"EQRnorm"},{"$f":"Classification!E5","v":"N"},{"$f":"Classification!O5","v":"FV Class"},{"$f":"Classification!Q5","v":"High"},{"$f":"Classification!R5","v":"Good"},{"$f":"Classification!S5","v":"Moderate"},{"$f":"Classification!T5","v":"Poor"},{"$f":"Classification!U5","v":"Bad"}]
[{"$f":"Classification!A6","v":"Chlorophyll"},null,{"$f":"Classification!B6","v":"2010-2012"},{"$f":"Classification!D6","v":0.69728324695168642},{"$f":"Classification!E6","v":36},{"$f":"Classification!O6","v":"Good"},{"$f":"Classification!Q6","v":2.5566287740197424E-6},{"$f":"Classification!R6","v":0.99999138771641483},{"$f":"Classification!S6","v":6.055654811107358E-6},{"$f":"Classification!T6","v":1.3339796890132147E-17},{"$f":"Classification!U6","v":8.5262625976048483E-25}]
[{"$f":"Classification!A7","v":"PTI"},null,{"$f":"Classification!B7","v":"2010-2012"},{"$f":"Classification!D7","v":0.54912537174425979},{"$f":"Classification!E7","v":7},{"$f":"Classification!O7","v":"Moderate"},{"$f":"Classification!Q7","v":3.2655239624357346E-4},{"$f":"Classification!R7","v":0.11876997511136189},{"$f":"Classification!S7","v":0.87661988488594667},{"$f":"Classification!T7","v":4.2305575131155486E-3},{"$f":"Classification!U7","v":5.3030093332267254E-5}]
[{"$f":"Classification!A8","v":"Cyanobacteria"},null,{"$f":"Classification!B8","v":"2010-2012"},{"$f":"Classification!D8","v":0.48518275118653087},{"$f":"Classification!E8","v":7},{"$f":"Classification!O8","v":"Moderate"},{"$f":"Classification!Q8","v":1.2839811704290494E-4},{"$f":"Classification!R8","v":1.5506288518261857E-2},{"$f":"Classification!S8","v":0.94273466791080374},{"$f":"Classification!T8","v":4.1410214432625804E-2},{"$f":"Classification!U8","v":2.2043102126572813E-4}]
[{"$f":"Classification!A12","v":"Combined Phytoplankton Status"},null,null,{"$f":"Classification!D12","v":0.57719712329415895},null,{"$f":"Classification!O12","v":"Moderate"},{"$f":"Classification!Q12","v":9.4195762301296782E-12},{"$f":"Classification!R12","v":0.13095130080853057},{"$f":"Classification!S12","v":0.86904869807913754},{"$f":"Classification!T12","v":1.1029122779741467E-9},{"$f":"Classification!U12","v":4.7230098039687922E-17}]

{"sheet":"UKOptima","index":11,"n_rows":654,"n_cols":23,"rows_kept":654,"cut":false,"hidden":false,"merged":[]}
["WH_Code","on UK Counter List","GenusRecord","DAT_TaxaList2009_Taxon_Name","Mixed Taxon Optima ","Optima Genus","Substitute genus optima","Genus","Species","Optima used","Optima type","Reason use genus","Warning","Ignore","IgnoreReason","WH_Code_touse","GenusCode","Mixed Taxon Optima","MxTaxN2","TBL_GenusCodes2009_Taxon_Name","Optima Genus","GenusN2","NinDataSet"]
["01000000",true,1,"Unidentified Cyanophyte",null,0.58099999999999996,null,"Unidentified Cyanophyte",null,0.58099999999999996,"group",null,null,false,"",null,"0100",0.57399999999999995,41.14,"Unidentified Cyanophyte",0.58099999999999996,40.25,201]
["01020000",true,1,"Anabaena",null,0.56799999999999995,null,"Anabaena",null,0.56799999999999995,"genus",null,null,false,"",null,"0102",0.51500000000000001,85.14,"Anabaena",0.56799999999999995,96.64,430]
["01020040",true,"","Anabaena catenula",0.71299999999999997,null,null,null,"Anabaena catenula",0.71299999999999997,"species",null,null,false,"",null,"0102",0.71299999999999997,22.88,"Anabaena",0.56799999999999995,96.64,67]
["01020042",true,"","Anabaena catenula var. solitaria",0.70099999999999996,null,null,null,"Anabaena catenula var. solitaria",0.70099999999999996,"species",null,null,false,"",null,"0102",0.70099999999999996,9.1199999999999992,"Anabaena",0.56799999999999995,96.64,31]
["01020050",true,"","Anabaena circinalis",0.74299999999999999,null,null,null,"Anabaena circinalis",0.74299999999999999,"species",null,null,false,"",null,"0102",0.74299999999999999,14.26,"Anabaena",0.56799999999999995,96.64,34]
["01020090",true,"","Anabaena flos-aquae",0.65200000000000002,null,null,null,"Anabaena flos-aquae",0.65200000000000002,"species",null,null,false,"",null,"0102",0.65200000000000002,50.41,"Anabaena",0.56799999999999995,96.64,156]
["01020130",false,"","Anabaena planctonica",0.61799999999999999,null,null,null,"Anabaena planctonica",0.61799999999999999,"species",null,null,false,"",null,"0102",0.61799999999999999,3.84,"Anabaena",0.56799999999999995,96.64,7]
["01020140",true,"","Anabaena spiroides",0.63100000000000001,null,null,null,"Anabaena spiroides",0.63100000000000001,"species",null,null,false,"",null,"0102",0.63100000000000001,13.93,"Anabaena",0.56799999999999995,96.64,46]
["01020210",false,"","Anabaena curva",null,null,0.56799999999999995,null,"Anabaena curva",0.56799999999999995,"genus","not in training data",null,false,"","01020000","0102",{"$error":"#N/A"},{"$error":"#N/A"},"Anabaena",0.56799999999999995,96.64,2]
["01020230",false,"","ANABAENA CRASSA",0.44800000000000001,null,0.56799999999999995,null,"Anabaena crassa",0.56799999999999995,"genus","too few records",null,false,"",null,"0102",0.44800000000000001,1,"Anabaena",0.56799999999999995,96.64,1]
["01020240",false,"","ANABAENA FARCIMINIFORMIS",0.34100000000000003,null,0.56799999999999995,null,"Anabaena farciminiformis",0.56799999999999995,"genus","too few records",null,false,"",null,"0102",0.34100000000000003,1.99,"Anabaena",0.56799999999999995,96.64,2]
["01030000",false,1,"Anabaenopsis",null,0.72899999999999998,null,"Anabaenopsis",null,0.72899999999999998,"genus",null,"genus optima derived few records",false,"",null,"0103",0.73099999999999998,1.99,"Anabaenopsis",0.72899999999999998,1.98,8]
["01040000",true,1,"Aphanizomenon",null,0.71699999999999997,null,"Aphanizomenon",null,0.71699999999999997,"genus",null,null,false,"",null,"0104",0.68,33.03,"Aphanizomenon",0.71699999999999997,54.86,152]
["01040020",true,"","Aphanizomenon flos-aquae",0.748,null,null,null,"Aphanizomenon flos-aquae",0.748,"species",null,null,false,"",null,"0104",0.748,32.85,"Aphanizomenon",0.71699999999999997,54.86,124]
["01040040",true,"","Aphanizomenon issatschenkoi",null,null,0.71699999999999997,null,"Aphanizomenon issatschenkoi",0.71699999999999997,"genus","not in training data",null,false,"","01040000","0104",{"$error":"#N/A"},{"$error":"#N/A"},"Aphanizomenon",0.71699999999999997,54.86,1]
["01050000",true,1,"Aphanocapsa",null,0.53900000000000003,null,"Aphanocapsa",null,0.53900000000000003,"genus",null,null,false,"",null,"0105",0.53200000000000003,83.91,"Aphanocapsa",0.53900000000000003,81.12,380]
["01050020",true,"","Aphanocapsa delicatissima",null,null,0.53900000000000003,null,"Aphanocapsa delicatissima",0.53900000000000003,"genus","not in training data",null,false,"","01050000","0105",{"$error":"#N/A"},{"$error":"#N/A"},"Aphanocapsa",0.53900000000000003,81.12,7]
["01050030",true,"","Aphanocapsa elachista",0.40500000000000003,null,null,null,"Aphanocapsa elachista",0.40500000000000003,"species",null,null,false,"",null,"0105",0.40500000000000003,5.74,"Aphanocapsa",0.53900000000000003,81.12,21]
["01060000",true,1,"Aphanothece",null,0.45900000000000002,null,"Aphanothece",null,0.45900000000000002,"genus",null,null,false,"",null,"0106",0.47399999999999998,32.56,"Aphanothece",0.45900000000000002,37.18,96]
["01060020",true,"","Aphanothece clathrata",null,null,0.45900000000000002,null,"Aphanothece clathrata",0.45900000000000002,"genus","not in training data",null,false,"","01060000","0106",{"$error":"#N/A"},{"$error":"#N/A"},"Aphanothece",0.45900000000000002,37.18,8]
["01060050",true,"","Aphanothece minutissima",0.30099999999999999,null,null,null,"Aphanothece minutissima",0.30099999999999999,"species",null,null,false,"",null,"0106",0.30099999999999999,17.170000000000002,"Aphanothece",0.45900000000000002,37.18,46]
["01130000",true,1,"Chroococcus",null,0.438,null,"Chroococcus",null,0.438,"genus",null,null,false,"",null,"0113",0.442,44.02,"Chroococcus",0.438,43.87,145]
["01130020",true,"","Chroococcus dispersus",0.53500000000000003,null,0.438,null,"Chroococcus dispersus",0.438,"genus","too few records",null,false,"",null,"0113",0.53500000000000003,1,"Chroococcus",0.438,43.87,3]
["01130040",false,"","Chroococcus limneticus",null,null,0.438,null,"Chroococcus limneticus",0.438,"genus","not in training data",null,false,"","01130000","0113",{"$error":"#N/A"},{"$error":"#N/A"},"Chroococcus",0.438,43.87,2]
["01130060",true,"","Chroococcus minutus",0.34899999999999998,null,null,null,"Chroococcus minutus",0.34899999999999998,"species",null,null,false,"",null,"0113",0.34899999999999998,10.52,"Chroococcus",0.438,43.87,15]
["01150000",true,1,"Coelosphaerium",null,0.496,null,"Coelosphaerium",null,0.496,"genus",null,null,false,"",null,"0115",0.54500000000000004,6.56,"Coelosphaerium",0.496,12.53,18]
["01150010",true,"","Coelosphaerium kuetzingianum",0.495,null,null,null,"Coelosphaerium kuetzingianum",0.495,"species",null,null,false,"",null,"0115",0.495,2.95,"Coelosphaerium",0.496,12.53,4]
["01150020",false,"","Coelosphaerium naegelianum",0.63800000000000001,null,0.496,null,"Coelosphaerium naegelianum",0.496,"genus","too few records",null,false,"",null,"0115",0.63800000000000001,1,"Coelosphaerium",0.496,12.53,2]
["01150030",false,"","COELOSPHAERIUM SUBARCTICUM",0.23300000000000001,null,null,null,"coelosphaerium subarcticum",0.23300000000000001,"species",null,null,false,"",null,"0115",0.23300000000000001,4.9400000000000004,"Coelosphaerium",0.496,12.53,9]
["01170000",false,1,"Cyanodictyon",null,0.32500000000000001,null,"Cyanodictyon",null,0.32500000000000001,"genus",null,null,false,"",null,"0117",0.222,7.56,"Cyanodictyon",0.32500000000000001,17.12,21]
["01170010",false,"","Cyanodictyon imperfectum",0.41799999999999998,null,null,null,"Cyanodictyon imperfectum",0.41799999999999998,"species",null,null,false,"",null,"0117",0.41799999999999998,8.19,"Cyanodictyon",0.32500000000000001,17.12,11]
["01170020",true,"","Cyanodictyon planctonicum",0.32200000000000001,null,null,null,"Cyanodictyon planctonicum",0.32200000000000001,"species",null,null,false,"",null,"0117",0.32200000000000001,12.78,"Cyanodictyon",0.32500000000000001,17.12,33]
["01170040",false,"","Cyanodictyon cf. filiforme",null,null,0.32500000000000001,null,"Cyanodictyon cf. filiforme",0.32500000000000001,"genus","not in training data",null,false,"","01170000","0117",{"$error":"#N/A"},{"$error":"#N/A"},"Cyanodictyon",0.32500000000000001,17.12,1]
["01200000",false,1,"Cylindrospermum",null,0.193,null,"Cylindrospermum",null,0.193,"genus",null,"genus optima derived few records",false,"",null,"0120",0.193,1,"Cylindrospermum",0.193,1,1]
["01300000",false,1,"Gloeothece",null,0.36499999999999999,null,"Gloeothece",null,0.36499999999999999,"genus",null,"genus optima derived few records",false,"",null,"0130",0.33900000000000002,1.87,"Gloeothece",0.36499999999999999,1.64,2]
["01310000",false,1,"Gloeotrichia",null,0.60199999999999998,null,"Gloeotrichia",null,0.60199999999999998,"genus",null,null,false,"",null,"0131",0.60299999999999998,3.96,"Gloeotrichia",0.60199999999999998,3.96,16]
["01320000",true,1,"Gomphosphaeria",null,0.46,null,"Gomphosphaeria",null,0.46,"genus",null,null,false,"",null,"0132",0.45100000000000001,12.43,"Gomphosphaeria",0.46,12.65,45]
["01320010",true,"","Gomphosphaeria aponina",0.436,null,null,null,"Gomphosphaeria aponina",0.436,"species",null,null,false,"",null,"0132",0.436,2.9,"Gomphosphaeria",0.46,12.65,3]
["01350010",false,"",null,null,null,null,null,null,null,"species","not in training data",null,false,"",null,"0135",{"$error":"#N/A"},{"$error":"#N/A"},"Microcrocis",{"$error":"#N/A"},{"$error":"#N/A"},{"$error":"#N/A"}]
["01430000",true,1,"Lyngbya",null,0.71,null,"Lyngbya",null,0.71,"genus",null,null,false,"",null,"0143",0.69499999999999995,9.09,"Lyngbya",0.71,7.94,29]
["01430050",true,"","Lyngbya contorta",0.69599999999999995,null,0.71,null,"Lyngbya contorta",0.71,"genus","too few records",null,false,"",null,"0143",0.69599999999999995,1.39,"Lyngbya",0.71,7.94,10]
["01430100",false,"","Planktolyngbya limnetica",null,null,0.71,null,"Planktolyngbya limnetica",0.71,"genus","not in training data",null,false,"","01430000","0143",{"$error":"#N/A"},{"$error":"#N/A"},"Lyngbya",0.71,7.94,1]
["01460000",true,1,"Merismopedia",null,0.48,null,"Merismopedia",null,0.48,"genus",null,null,false,"",null,"0146",0.50900000000000001,45.87,"Merismopedia",0.48,47.74,157]
["01460020",false,"","Merismopedia glauca",null,null,0.48,null,"Merismopedia glauca",0.48,"genus","not in training data",null,false,"","01460000","0146",{"$error":"#N/A"},{"$error":"#N/A"},"Merismopedia",0.48,47.74,4]
["01460030",false,"","Merismopedia punctata",null,null,0.48,null,"Merismopedia punctata",0.48,"genus","not in training data",null,false,"","01460000","0146",{"$error":"#N/A"},{"$error":"#N/A"},"Merismopedia",0.48,47.74,6]
["01460040",false,"","Merismopedia tenuissima",null,null,0.48,null,"Merismopedia tenuissima",0.48,"genus","not in training data",null,false,"","01460000","0146",{"$error":"#N/A"},{"$error":"#N/A"},"Merismopedia",0.48,47.74,4]
["01460050",true,"","Merismopedia warmingiana",0.22500000000000001,null,null,null,"Merismopedia warmingiana",0.22500000000000001,"species",null,null,false,"",null,"0146",0.22500000000000001,21.32,"Merismopedia",0.48,47.74,52]
["01490000",true,1,"Microcystis",null,0.67200000000000004,null,"Microcystis",null,0.67200000000000004,"genus",null,null,false,"",null,"0149",0.66500000000000004,37.96,"Microcystis",0.67200000000000004,36.79,177]
["01490010",true,"","Microcystis aeruginosa",null,null,0.67200000000000004,null,"Microcystis aeruginosa",0.67200000000000004,"genus","not in training data",null,false,"","01490000","0149",{"$error":"#N/A"},{"$error":"#N/A"},"Microcystis",0.67200000000000004,36.79,18]
["01490020",true,"","Microcystis flos-aquae",null,null,0.67200000000000004,null,"Microcystis flos-aquae",0.67200000000000004,"genus","not in training data",null,false,"","01490000","0149",{"$error":"#N/A"},{"$error":"#N/A"},"Microcystis",0.67200000000000004,36.79,20]
["01490030",true,"","Microcystis wesenbergii",null,null,0.67200000000000004,null,"Microcystis wesenbergii",0.67200000000000004,"genus","not in training data",null,false,"","01490000","0149",{"$error":"#N/A"},{"$error":"#N/A"},"Microcystis",0.67200000000000004,36.79,13]
["01520000",false,1,"Nostoc",null,0,null,null,null,null,"species",null,null,false,"",null,"0152",0,1,"Nostoc",0,1,1]
["01530000",true,1,"Oscillatoria",null,0.56699999999999995,null,"Oscillatoria",null,0.56699999999999995,"genus",null,null,false,"",null,"0153",0.54,79.3,"Oscillatoria",0.56699999999999995,92.37,354]
["01530010",true,"","Oscillatoria agardhii",0.55200000000000005,null,null,null,"Oscillatoria agardhii",0.55200000000000005,"species",null,null,false,"",null,"0153",0.55200000000000005,28.4,"Oscillatoria",0.56699999999999995,92.37,144]
["01530012",true,"","Oscillatoria agardhii var. isothrix",0.32200000000000001,null,null,null,"Oscillatoria agardhii var. isothrix",0.32200000000000001,"species",null,null,false,"",null,"0153",0.32200000000000001,2.88,"Oscillatoria",0.56699999999999995,92.37,21]
["01530070",false,"","Oscillatoria bornetii",null,null,0.56699999999999995,null,"Oscillatoria bornetii",0.56699999999999995,"genus","not in training data",null,false,"","01530000","0153",{"$error":"#N/A"},{"$error":"#N/A"},"Oscillatoria",0.56699999999999995,92.37,1]
["01530160",true,"","Oscillatoria limnetica",0.64300000000000002,null,null,null,"Oscillatoria limnetica",0.64300000000000002,"species",null,null,false,"",null,"0153",0.64300000000000002,31.31,"Oscillatoria",0.56699999999999995,92.37,168]
["01530170",true,"","Oscillatoria limosa",null,null,0.56699999999999995,null,"Oscillatoria limosa",0.56699999999999995,"genus","not in training data",null,false,"","01530000","0153",{"$error":"#N/A"},{"$error":"#N/A"},"Oscillatoria",0.56699999999999995,92.37,13]
["01530230",true,"","Oscillatoria redekei",null,null,0.56699999999999995,null,"Oscillatoria redekei",0.56699999999999995,"genus","not in training data",null,false,"","01530000","0153",{"$error":"#N/A"},{"$error":"#N/A"},"Oscillatoria",0.56699999999999995,92.37,31]
["01530240",false,"","Planktothrix cf. rubescens",null,null,0.56699999999999995,null,"Planktothrix cf. rubescens",0.56699999999999995,"genus","not in training data",null,false,"","01530000","0153",{"$error":"#N/A"},{"$error":"#N/A"},"Oscillatoria",0.56699999999999995,92.37,7]
["01530260",false,"","Geitlerinema splendida",0.33100000000000002,null,0.56699999999999995,null,"Geitlerinema splendida",0.56699999999999995,"genus","too few records",null,false,"",null,"0153",0.33100000000000002,1,"Oscillatoria",0.56699999999999995,92.37,1]
["01530290",false,"","Oscillatoria tenuis",null,null,0.56699999999999995,null,"Oscillatoria tenuis",0.56699999999999995,"genus","not in training data",null,false,"","01530000","0153",{"$error":"#N/A"},{"$error":"#N/A"},"Oscillatoria",0.56699999999999995,92.37,4]
["01550000",false,1,"Phormidium",null,0.188,null,"Phormidium",null,0.188,"genus",null,null,false,"",null,"0155",0.188,1,"Phormidium",0.188,1,{"$error":"#N/A"}]
["01550170",false,"","Phormidium tenue",null,null,0.188,null,"Phormidium tenue",0.188,"genus","not in training data","genus optima derived few records",false,"","01550000","0155",{"$error":"#N/A"},{"$error":"#N/A"},"Phormidium",0.188,1,3]
["01570030",false,"","Pleurocapsa minor",0.49199999999999999,null,0.49199999999999999,null,"Pleurocapsa minor",0.49199999999999999,"genus","too few records",null,false,"",null,"0157",0.49199999999999999,1,"Pleurocapsa",0.49199999999999999,1,1]
["01580000",true,1,"Pseudanabaena",null,0.503,null,"Pseudanabaena",null,0.503,"genus",null,null,false,"",null,"0158",0.49,33.020000000000003,"Pseudanabaena",0.503,31.15,87]
["01580020",false,"","PSEUDANABAENA ACICULARIS",0.245,null,0.503,null,"Pseudanabaena acicularis",0.503,"genus","too few records",null,false,"",null,"0158",0.245,1.74,"Pseudanabaena",0.503,31.15,2]
["01610000",false,1,"Rhabdoderma",null,0.21099999999999999,null,"Rhabdoderma",null,0.21099999999999999,"genus",null,"genus optima derived few records",false,"",null,"0161",0.28499999999999998,1,"Rhabdoderma",0.21099999999999999,1.62,1]
["01610010",false,"","RHABDODERMA LINEARE",0,null,0.21099999999999999,null,"Rhabdoderma lineare",0.21099999999999999,"genus","too few records",null,false,"",null,"0161",0,1,"Rhabdoderma",0.21099999999999999,1.62,1]
["01660000",false,1,null,null,null,null,null,null,null,"species","not in training data",null,false,"",null,"0166",{"$error":"#N/A"},{"$error":"#N/A"},"Spirulina",{"$error":"#N/A"},{"$error":"#N/A"},{"$error":"#N/A"}]
["01690000",false,1,"Synechococcus",null,0.45800000000000002,null,"Synechococcus",null,0.45800000000000002,"genus",null,null,false,"",null,"0169",0.34200000000000003,5.75,"Synechococcus",0.45800000000000002,6.87,13]
["01690010",false,"","Synechococcus aeruginosus",0.65500000000000003,null,0.45800000000000002,null,"Synechococcus aeruginosus",0.45800000000000002,"genus","too few records",null,false,"",null,"0169",0.65500000000000003,2,"Synechococcus",0.45800000000000002,6.87,2]
["01690040",false,"","Synechococcus cf. capitatus",null,null,0.45800000000000002,null,"Synechococcus cf. capitatus",0.45800000000000002,"genus","not in training data",null,false,"","01690000","0169",{"$error":"#N/A"},{"$error":"#N/A"},"Synechococcus",0.45800000000000002,6.87,1]
["01700000",false,1,"Synechocystis",null,0.33700000000000002,null,"Synechocystis",null,0.33700000000000002,"genus",null,"genus optima derived few records",false,"",null,"0170",0.33700000000000002,1,"Synechocystis",0.33700000000000002,1,3]
["01750000",true,1,"Snowella",null,0.51300000000000001,null,"Snowella",null,0.51300000000000001,"genus",null,null,false,"",null,"0175",0.46800000000000003,39.380000000000003,"Snowella",0.51300000000000001,57.79,151]
["01750010",true,"","Snowella lacustris",0.63900000000000001,null,null,null,"Snowella lacustris",0.63900000000000001,"species",null,null,false,"",null,"0175",0.63900000000000001,18.510000000000002,"Snowella",0.51300000000000001,57.79,73]
["01750020",true,"","Snowella septentrionalis",0.309,null,null,null,"Snowella septentrionalis",0.309,"species",null,null,false,"",null,"0175",0.309,14.24,"Snowella",0.51300000000000001,57.79,34]
["01750030",true,"","Snowella atomus",0.311,null,null,null,"Snowella atomus",0.311,"species",null,null,false,"",null,"0175",0.311,21.64,"Snowella",0.51300000000000001,57.79,49]
["01750040",false,"","SNOWELLA LITORALIS",0.23,null,0.51300000000000001,null,"snowella litoralis",0.51300000000000001,"genus","too few records",null,false,"",null,"0175",0.23,1,"Snowella",0.51300000000000001,57.79,1]
["01760000",false,1,"Radiocystis",null,0.187,null,"Radiocystis",null,0.187,"genus",null,null,null,null,null,"0176",null,null,"Radiocystis",0.187,2.62,{"$error":"#N/A"}]
["01760010",false,"","Radiocystis geminata",0.17299999999999999,null,null,null,"Radiocystis geminata",0.17299999999999999,"species",null,null,false,"",null,"0176",0.17299999999999999,2.9,"Radiocystis",0.187,2.62,3]
["01780000",true,1,"Woronichinia",null,0.503,null,"Woronichinia",null,0.503,"genus",null,null,false,"",null,"0178",0.47,21.74,"Woronichinia",0.503,27.29,67]
["01780010",true,"","Woronichinia naegeliana",0.52600000000000002,null,null,null,"Woronichinia naegeliana",0.52600000000000002,"species",null,null,false,"",null,"0178",0.52600000000000002,15.02,"Woronichinia",0.503,27.29,44]
["01780030",false,"","Woronichinia karelica",0.23,null,0.503,null,"Woronichinia karelica",0.503,"genus","too few records",null,false,"",null,"0178",0.23,1,"Woronichinia",0.503,27.29,1]
["04000000",false,1,"EUGLENOPHYCEAE",null,null,null,null,null,null,"species","not in training data",null,false,"",null,"0400",{"$error":"#N/A"},{"$error":"#N/A"},"EUGLENOPHYCEAE",{"$error":"#N/A"},{"$error":"#N/A"},1]
["04010000",false,1,"COLACIUM",null,null,null,null,null,null,"species","not in training data",null,false,"",null,"0401",{"$error":"#N/A"},{"$error":"#N/A"},"Colacium",{"$error":"#N/A"},{"$error":"#N/A"},{"$error":"#N/A"}]
["04010020",false,"","Colacium vesiculosum",null,null,null,null,null,null,"species","not in training data",null,false,"","04010000","0401",{"$error":"#N/A"},{"$error":"#N/A"},"Colacium",{"$error":"#N/A"},{"$error":"#N/A"},2]
["04020000",true,1,"Euglena",null,0.58699999999999997,null,"Euglena",null,0.58699999999999997,"genus",null,null,false,"",null,"0402",0.57799999999999996,48.92,"Euglena",0.58699999999999997,47.36,151]
["04020170",false,"","Euglena hemichromata",null,null,0.58699999999999997,null,"Euglena hemichromata",0.58699999999999997,"genus","not in training data",null,false,"","04020000","0402",{"$error":"#N/A"},{"$error":"#N/A"},"Euglena",0.58699999999999997,47.36,1]
["04070000",true,1,"Phacus",null,0.71499999999999997,null,"Phacus",null,0.71499999999999997,"genus",null,null,false,"",null,"0407",0.71099999999999997,30.31,"Phacus",0.71499999999999997,29.8,96]
["04070030",false,"","Phacus agilis",0.94199999999999995,null,0.71499999999999997,null,"Phacus agilis",0.71499999999999997,"genus","too few records",null,false,"",null,"0407",0.94199999999999995,1,"Phacus",0.71499999999999997,29.8,1]
["04070160",false,"","Phacus longicauda",null,null,0.71499999999999997,null,"Phacus longicauda",0.71499999999999997,"genus","not in training data",null,false,"","04070000","0407",{"$error":"#N/A"},{"$error":"#N/A"},"Phacus",0.71499999999999997,29.8,2]
["04070250",false,"","Phacus pyrum",null,null,0.71499999999999997,null,"Phacus pyrum",0.71499999999999997,"genus","not in training data",null,false,"","04070000","0407",{"$error":"#N/A"},{"$error":"#N/A"},"Phacus",0.71499999999999997,29.8,2]
["04090000",true,1,"Strombomonas",null,0.63300000000000001,null,"Strombomonas",null,0.63300000000000001,"genus",null,"genus optima derived few records",false,"",null,"0409",0.63300000000000001,1,"Strombomonas",0.63300000000000001,1,1]
["04100000",true,1,"Trachelomonas",null,0.621,null,"Trachelomonas",null,0.621,"genus",null,null,false,"",null,"0410",0.621,75.709999999999994,"Trachelomonas",0.621,75.459999999999994,371]
["04100120",false,"","Trachelomonas globularis",0.71699999999999997,null,0.621,null,"Trachelomonas globularis",0.621,"genus","too few records",null,false,"",null,"0410",0.71699999999999997,1,"Trachelomonas",0.621,75.459999999999994,1]
["04100150",false,"","Trachelomonas hispida",0.45100000000000001,null,null,null,"Trachelomonas hispida",0.45100000000000001,"species",null,null,false,"",null,"0410",0.45100000000000001,6.95,"Trachelomonas",0.621,75.459999999999994,12]
["04100153",false,"","Trachelomonas hispida v. crenulatocollis",0.71699999999999997,null,0.621,null,"Trachelomonas hispida v. crenulatocollis",0.621,"genus","too few records",null,false,"",null,"0410",0.71699999999999997,1,"Trachelomonas",0.621,75.459999999999994,1]
["04100160",false,"","Trachelomonas intermedia",0.48799999999999999,null,null,null,"Trachelomonas intermedia",0.48799999999999999,"species",null,null,false,"",null,"0410",0.48799999999999999,2.96,"Trachelomonas",0.621,75.459999999999994,6]
["04100210",false,"","TRACHELOMONAS OBLONGA",0.19500000000000001,null,0.621,null,"Trachelomonas oblonga",0.621,"genus","too few records",null,false,"",null,"0410",0.19500000000000001,1,"Trachelomonas",0.621,75.459999999999994,1]
["04100230",false,"","Trachelomonas polonica",null,null,0.621,null,"Trachelomonas polonica",0.621,"genus","not in training data",null,false,"",null,"0410",{"$error":"#N/A"},{"$error":"#N/A"},"Trachelomonas",0.621,75.459999999999994,1]
["04100270",false,"","Trachelomonas rugulosa",null,null,0.621,null,"Trachelomonas rugulosa",0.621,"genus","not in training data",null,false,"","04100000","0410",{"$error":"#N/A"},{"$error":"#N/A"},"Trachelomonas",0.621,75.459999999999994,1]
["04100290",false,"","Trachelomonas similis",null,null,0.621,null,"Trachelomonas similis",0.621,"genus","not in training data",null,false,"","04100000","0410",{"$error":"#N/A"},{"$error":"#N/A"},"Trachelomonas",0.621,75.459999999999994,4]
["04100350",false,"","Trachelomonas volvocina",null,null,0.621,null,"Trachelomonas volvocina",0.621,"genus","not in training data",null,false,"","04100000","0410",{"$error":"#N/A"},{"$error":"#N/A"},"Trachelomonas",0.621,75.459999999999994,2]
["04100360",false,"","Trachelomonas volvocinopsis",0.50600000000000001,null,null,null,"Trachelomonas volvocinopsis",0.50600000000000001,"species",null,null,false,"",null,"0410",0.50600000000000001,6.65,"Trachelomonas",0.621,75.459999999999994,11]
["05020000",true,1,"Chroomonas",null,0.54400000000000004,null,"Chroomonas",null,0.54400000000000004,"genus",null,null,false,"",null,"0502",0.55900000000000005,54.47,"Chroomonas",0.54400000000000004,60.75,188]
["05020010",true,"","Chroomonas acuta",0.502,null,null,null,"Chroomonas acuta",0.502,"species",null,null,false,"",null,"0502",0.502,25.4,"Chroomonas",0.54400000000000004,60.75,73]
["05040000",true,1,"Cryptomonas",null,0.54700000000000004,null,"Cryptomonas",null,0.54700000000000004,"genus",null,null,false,"",null,"0504",0.42699999999999999,27.51,"Cryptomonas",0.54700000000000004,127.01,113]
["05040001",true,"","Cryptomonas (small) Length <20 µm",0.53,null,null,null,"Cryptomonas (small) Length <20 µm",0.53,"species",null,null,false,"",null,"0504",0.53,102.75,"Cryptomonas",0.54700000000000004,127.01,556]
["05040002",true,"","Cryptomonas (medium) Length 20-30 µm",0.53300000000000003,null,null,null,"Cryptomonas (medium) Length 20-30 µm",0.53300000000000003,"species",null,null,false,"",null,"0504",0.53300000000000003,115.79,"Cryptomonas",0.54700000000000004,127.01,754]
["05040003",true,"","Cryptomonas (large) Length >30 µm",0.58899999999999997,null,null,null,"Cryptomonas (large) Length >30 µm",0.58899999999999997,"species",null,null,false,"",null,"0504",0.58899999999999997,86.54,"Cryptomonas",0.54700000000000004,127.01,314]
["05040030",true,"","Cryptomonas erosa",null,null,0.54700000000000004,null,"Cryptomonas erosa",0.54700000000000004,"genus","not in training data",null,false,"","05040000","0504",{"$error":"#N/A"},{"$error":"#N/A"},"Cryptomonas",0.54700000000000004,127.01,8]
["05040040",true,"","Cryptomonas marssonii",0.63100000000000001,null,null,null,"Cryptomonas marssonii",0.63100000000000001,"species",null,null,false,"",null,"0504",0.63100000000000001,22.23,"Cryptomonas",0.54700000000000004,127.01,105]
["05040050",true,"","Cryptomonas ovata",0.50800000000000001,null,null,null,"Cryptomonas ovata",0.50800000000000001,"species",null,null,false,"",null,"0504",0.50800000000000001,10.79,"Cryptomonas",0.54700000000000004,127.01,37]
["05060000",false,1,"Cyathomonas",null,0.60599999999999998,null,"Cyathomonas",null,0.60599999999999998,"genus",null,"genus optima derived few records",false,"",null,"0506",0.60699999999999998,2,"Cyathomonas",0.60599999999999998,1.99,2]
["05100000",true,1,"Rhodomonas",null,0.53900000000000003,null,"Rhodomonas",null,0.53900000000000003,"genus",null,null,false,"",null,"0510",0.51700000000000002,74.06,"Rhodomonas",0.53900000000000003,122.58,309]
["05100010",true,"","Rhodomonas lacustris",0.35799999999999998,null,null,null,"Rhodomonas lacustris",0.35799999999999998,"species",null,null,false,"",null,"0510",0.35799999999999998,32.97,"Rhodomonas",0.53900000000000003,122.58,99]
["05100012",true,"","Rhodomonas lacustris var. nannoplanctica",0.47299999999999998,null,null,null,"Rhodomonas lacustris var. nannoplanctica",0.47299999999999998,"species",null,null,false,"",null,"0510",0.47299999999999998,81.900000000000006,"Rhodomonas",0.53900000000000003,122.58,456]
["05109910",true,"","Rhodomonas lens",null,null,0.53900000000000003,null,"Rhodomonas lens",0.53900000000000003,"genus","not in training data",null,false,"","05100000","0510",{"$error":"#N/A"},{"$error":"#N/A"},"Rhodomonas",0.53900000000000003,122.58,3]
["05110000",false,1,"Plagioselmis",null,0.35499999999999998,null,"Plagioselmis",null,0.35499999999999998,"genus",null,"genus optima derived few records",false,"",null,"0511",0.35499999999999998,1,"Plagioselmis",0.35499999999999998,1,3]
["06000000",false,1,"indet. dinoflagellate",null,0.28799999999999998,null,"indet. dinoflagellate",null,0.28799999999999998,"group",null,null,false,"",null,"0600",0.28999999999999998,34.29,"indet. dinoflagellate",0.28799999999999998,33.94,116]
["06020000",false,1,"CERATIUM",null,0.505,null,"Ceratium",null,0.505,"genus",null,null,false,"",null,"0602",0.26600000000000001,3.92,"Ceratium",0.505,69.040000000000006,{"$error":"#N/A"}]
["06020010",true,"","Ceratium carolinianum",null,null,0.505,null,"Ceratium carolinianum",0.505,"genus","not in training data",null,false,"",null,"0602",{"$error":"#N/A"},{"$error":"#N/A"},"Ceratium",0.505,69.040000000000006,9]
["06020020",true,"","Ceratium cornutum",null,null,0.505,null,"Ceratium cornutum",0.505,"genus","not in training data",null,false,"","06020000","0602",{"$error":"#N/A"},{"$error":"#N/A"},"Ceratium",0.505,69.040000000000006,5]
["06020030",true,"","Ceratium furcoides",0.64400000000000002,null,null,null,"Ceratium furcoides",0.64400000000000002,"species",null,null,false,"",null,"0602",0.64400000000000002,8.24,"Ceratium",0.505,69.040000000000006,36]
["06020040",true,"","Ceratium hirundinella",0.49299999999999999,null,null,null,"Ceratium hirundinella",0.49299999999999999,"species",null,null,false,"",null,"0602",0.49299999999999999,66.819999999999993,"Ceratium",0.505,69.040000000000006,293]
["06050000",true,1,"Glenodinium",null,0.56100000000000005,null,"Glenodinium",null,0.56100000000000005,"genus",null,null,false,"",null,"0605",0.55800000000000005,27.16,"Glenodinium",0.56100000000000005,26.57,89]
["06070000",true,1,"Gymnodinium",null,0.46,null,"Gymnodinium",null,0.46,"genus",null,null,false,"",null,"0607",0.42799999999999999,70.37,"Gymnodinium",0.46,82.29,242]
["06070060",false,"","Gymnodinium fuscum",null,null,0.46,null,"Gymnodinium fuscum",0.46,"genus","not in training data",null,false,"",null,"0607",{"$error":"#N/A"},{"$error":"#N/A"},"Gymnodinium",0.46,82.29,2]
["06070110",true,"","Gymnodinium helveticum",0.47899999999999998,null,null,null,"Gymnodinium helveticum",0.47899999999999998,"species",null,null,false,"",null,"0607",0.47899999999999998,31.1,"Gymnodinium",0.46,82.29,117]
["06100000",false,1,"Peridiniopsis cf. elpatiewskyi",null,0.40600000000000003,null,"Peridiniopsis cf. elpatiewskyi",null,0.40600000000000003,"genus",null,"genus optima derived few records",false,"",null,"0610",0.40600000000000003,1,"Peridiniopsis cf. elpatiewskyi",0.40600000000000003,1,2]
["06110000",true,1,"Peridinium",null,0.48499999999999999,null,"Peridinium",null,0.48499999999999999,"genus",null,null,false,"",null,"0611",0.48899999999999999,87.07,"Peridinium",0.48499999999999999,90.33,357]
["06110040",false,"","PERIDINIUM BIPES",0.29299999999999998,null,null,null,"Peridinium bipes",0.29299999999999998,"species",null,null,false,"",null,"0611",0.29299999999999998,5.9,"Peridinium",0.48499999999999999,90.33,15]
["06110050",true,"","Peridinium cinctum",null,null,0.48499999999999999,null,"Peridinium cinctum",0.48499999999999999,"genus","not in training data",null,false,"","06110000","0611",{"$error":"#N/A"},{"$error":"#N/A"},"Peridinium",0.48499999999999999,90.33,44]
["06110090",true,"","Peridinium inconspicum",0.22900000000000001,null,null,null,"Peridinium inconspicum",0.22900000000000001,"species",null,null,false,"",null,"0611",0.22900000000000001,17.739999999999998,"Peridinium",0.48499999999999999,90.33,48]
["06110100",true,"","Peridinium willei",0.33200000000000002,null,null,null,"Peridinium willei",0.33200000000000002,"species",null,null,false,"",null,"0611",0.33200000000000002,11.84,"Peridinium",0.48499999999999999,90.33,24]
["07010000",false,1,"Gonyostomum",null,0.29699999999999999,null,"Gonyostomum",null,0.29699999999999999,"genus",null,null,false,"",null,"0701",0.29099999999999998,6.58,"Gonyostomum",0.29699999999999999,6.28,2]
["07010010",true,"","Gonyostomum semen",null,null,0.29699999999999999,null,"Gonyostomum semen",0.29699999999999999,"genus","not in training data",null,false,"","07010000","0701",{"$error":"#N/A"},{"$error":"#N/A"},"Gonyostomum",0.29699999999999999,6.28,6]
["07010020",false,"","Gonyostomum cf. latum",null,null,0.29699999999999999,null,"Gonyostomum cf. latum",0.29699999999999999,"genus","not in training data",null,false,"","07010000","0701",{"$error":"#N/A"},{"$error":"#N/A"},"Gonyostomum",0.29699999999999999,6.28,6]
["08010000",true,1,"Chrysochromulina",null,0.34100000000000003,null,"Chrysochromulina",null,0.34100000000000003,"genus",null,null,false,"",null,"0801",0.32500000000000001,46.26,"Chrysochromulina",0.34100000000000003,50.04,151]
["08010010",true,"","Chrysochromulina parva",0.34799999999999998,null,null,null,"Chrysochromulina parva",0.34799999999999998,"species",null,null,false,"",null,"0801",0.34799999999999998,23.47,"Chrysochromulina",0.34100000000000003,50.04,59]
["08040000",true,1,"Prymnesium",null,0.83799999999999997,null,"Prymnesium",null,0.83799999999999997,"genus",null,"genus optima derived few records",false,"",null,"0804",0.83799999999999997,1,"Prymnesium",0.83799999999999997,1,6]
["09000000",true,1,"Chrysophyceae",null,0.32400000000000001,null,"Chrysophyceae",null,0.32400000000000001,"genus",null,null,false,"",null,"0900",0.32200000000000001,57.35,"Chrysophyceae",0.32400000000000001,56.72,234]
["09030000",true,1,"Bitrichia",null,0.28799999999999998,null,"Bitrichia",null,0.28799999999999998,"genus",null,null,false,"",null,"0903",0.29699999999999999,36.03,"Bitrichia",0.28799999999999998,41.29,130]
["09030010",true,"","Bitrichia chodatii",0.23499999999999999,null,null,null,"Bitrichia chodatii",0.23499999999999999,"species",null,null,false,"",null,"0903",0.23499999999999999,25.26,"Bitrichia",0.28799999999999998,41.29,69]
["09030020",true,"","Bitrichia longispina",null,null,0.28799999999999998,null,"Bitrichia longispina",0.28799999999999998,"genus","not in training data",null,false,"","09030000","0903",{"$error":"#N/A"},{"$error":"#N/A"},"Bitrichia",0.28799999999999998,41.29,3]
["09050000",true,1,"Chromulina",null,0.41,null,"Chromulina",null,0.41,"genus",null,null,false,"",null,"0905",0.40100000000000002,44.11,"Chromulina",0.41,42.7,124]
["09050030",true,"","Chromulina nebulosa",null,null,0.41,null,"Chromulina nebulosa",0.41,"genus","not in training data",null,false,"","09050000","0905",{"$error":"#N/A"},{"$error":"#N/A"},"Chromulina",0.41,42.7,5]
["09060000",true,1,"Chrysamoeba",null,0.25600000000000001,null,"Chrysamoeba",null,0.25600000000000001,"genus",null,null,false,"",null,"0906",0.255,4.9800000000000004,"Chrysamoeba",0.25600000000000001,4.9800000000000004,6]
["09080000",true,1,"Chrysidiastrum",null,0.27600000000000002,null,"Chrysidiastrum",null,0.27600000000000002,"genus",null,null,false,"",null,"0908",0.30399999999999999,5.97,"Chrysidiastrum",0.27600000000000002,17.760000000000002,13]
["09080010",true,"","Chrysidiastrum catenatum",0.26700000000000002,null,null,null,"Chrysidiastrum catenatum",0.26700000000000002,"species",null,null,false,"",null,"0908",0.26700000000000002,15.18,"Chrysidiastrum",0.27600000000000002,17.760000000000002,27]
["09130000",true,1,"Chrysococcus",null,0.42699999999999999,null,"Chrysococcus",null,0.42699999999999999,"genus",null,null,false,"",null,"0913",0.42399999999999999,50,"Chrysococcus",0.42699999999999999,50.04,168]
["09130010",false,"","Chrysococcus cordiformis",0.157,null,null,null,"Chrysococcus cordiformis",0.157,"species",null,null,false,"",null,"0913",0.157,7.45,"Chrysococcus",0.42699999999999999,50.04,12]
["09130050",false,"","Chrysococcus rufescens",null,null,0.42699999999999999,null,"Chrysococcus rufescens",0.42699999999999999,"genus","not in training data",null,false,"","09130000","0913",{"$error":"#N/A"},{"$error":"#N/A"},"Chrysococcus",0.42699999999999999,50.04,3]
["09130070",false,"","Chrysococcus biporus",null,null,0.42699999999999999,null,"Chrysococcus biporus",0.42699999999999999,"genus","not in training data",null,false,"","09130000","0913",{"$error":"#N/A"},{"$error":"#N/A"},"Chrysococcus",0.42699999999999999,50.04,4]
["09150000",true,1,"Chrysolykos",null,0.23300000000000001,null,"Chrysolykos",null,0.23300000000000001,"genus",null,null,false,"",null,"0915",0.23499999999999999,11.64,"Chrysolykos",0.23300000000000001,19.22,35]
["09150010",true,"","Chrysolykos planctonicus",0.245,null,null,null,"Chrysolykos planctonicus",0.245,"species",null,null,false,"",null,"0915",0.245,7.71,"Chrysolykos",0.23300000000000001,19.22,16]
["09150020",false,"","Chrysolykos skujae",0.122,null,null,null,"Chrysolykos skujae",0.122,"species",null,null,false,"",null,"0915",0.122,7.84,"Chrysolykos",0.23300000000000001,19.22,14]
["09230000",true,1,"Dinobryon",null,0.41099999999999998,null,"Dinobryon",null,0.41099999999999998,"genus",null,null,false,"",null,"0923",0.42899999999999999,60.47,"Dinobryon",0.41099999999999998,85.13,210]
["09230010",true,"","Dinobryon bavaricum",0.32800000000000001,null,null,null,"Dinobryon bavaricum",0.32800000000000001,"species",null,null,false,"",null,"0923",0.32800000000000001,31.06,"Dinobryon",0.41099999999999998,85.13,112]
["09230030",true,"","Dinobryon crenulatum",0.20100000000000001,null,null,null,"Dinobryon crenulatum",0.20100000000000001,"species",null,null,false,"",null,"0923",0.20100000000000001,30.98,"Dinobryon",0.41099999999999998,85.13,99]
["09230040",true,"","Dinobryon cylindricum",0.21099999999999999,null,null,null,"Dinobryon cylindricum",0.21099999999999999,"species",null,null,false,"",null,"0923",0.21099999999999999,16.55,"Dinobryon",0.41099999999999998,85.13,40]
["09230050",true,"","Dinobryon divergens",0.39200000000000002,null,null,null,"Dinobryon divergens",0.39200000000000002,"species",null,null,false,"",null,"0923",0.39200000000000002,47.72,"Dinobryon",0.41099999999999998,85.13,186]
["09230052",true,"","Dinobryon divergens var. schauninslandii",0.318,null,null,null,"Dinobryon divergens var. schauninslandii",0.318,"species",null,null,false,"",null,"0923",0.318,8.17,"Dinobryon",0.41099999999999998,85.13,19]
["09230070",true,"","Dinobryon sertularia",null,0.41099999999999998,0.41099999999999998,null,"Dinobryon sertularia",0.41099999999999998,"genus","not in training data",null,false,"","09230000","0923",{"$error":"#N/A"},{"$error":"#N/A"},"Dinobryon",0.41099999999999998,85.13,14]
["09230080",true,"","Dinobryon sociale",0.41,null,null,null,"Dinobryon sociale",0.41,"species",null,null,false,"",null,"0923",0.41,24.25,"Dinobryon",0.41099999999999998,85.13,64]
["09230090",true,"","Dinobryon suecicum",0.23300000000000001,null,null,null,"Dinobryon suecicum",0.23300000000000001,"species",null,null,false,"",null,"0923",0.23300000000000001,16.510000000000002,"Dinobryon",0.41099999999999998,85.13,44]
["09230110",true,"","Dinobryon borgei",0.20499999999999999,null,null,null,"Dinobryon borgei",0.20499999999999999,"species",null,null,false,"",null,"0923",0.20499999999999999,26.3,"Dinobryon",0.41099999999999998,85.13,73]
["09250000",true,1,"Epipyxis",null,0.41099999999999998,null,"Epipyxis",null,0.41099999999999998,"genus",null,null,false,"",null,"0925",0.40500000000000003,10.33,"Epipyxis",0.41099999999999998,9.99,18]
["09290000",false,1,"Kephyrion",null,0.434,null,"Kephyrion",null,0.434,"genus",null,null,false,"",null,"0929",0.439,60.3,"Kephyrion",0.434,59.29,202]
["09290010",false,"","Kephyrion littorale",null,null,0.434,null,"Kephyrion littorale",0.434,"genus","not in training data",null,false,"","09290000","0929",{"$error":"#N/A"},{"$error":"#N/A"},"Kephyrion",0.434,59.29,2]
["09290030",false,"","KEPHYRION RUBRI-CLAUSTRI",0.245,null,0.434,null,"kephyrion rubri-claustri",0.434,"genus","too few records",null,false,"",null,"0929",0.245,1,"Kephyrion",0.434,59.29,1]
["09290040",false,"","Kephyrion boreale",0.17799999999999999,null,null,null,"Kephyrion boreale",0.17799999999999999,"species",null,null,false,"",null,"0929",0.17799999999999999,5.73,"Kephyrion",0.434,59.29,12]
["09290050",false,"","Kephyrion cupuliforme",0.121,null,null,null,"Kephyrion cupuliforme",0.121,"species",null,null,false,"",null,"0929",0.121,5.76,"Kephyrion",0.434,59.29,9]
["09290060",false,"","Kephyrion skujae",0.23100000000000001,null,null,null,"Kephyrion skujae",0.23100000000000001,"species",null,null,false,"",null,"0929",0.23100000000000001,5.83,"Kephyrion",0.434,59.29,8]
["09290070",false,"","Kephyrion spirale",null,null,0.434,null,"Kephyrion spirale",0.434,"genus","not in training data",null,false,"","09290000","0929",{"$error":"#N/A"},{"$error":"#N/A"},"Kephyrion",0.434,59.29,10]
["09290080",false,"","KEPHYRION OVUM",null,null,0.434,null,"KEPHYRION OVUM",0.434,"genus","not in training data",null,false,"",null,"0929",{"$error":"#N/A"},{"$error":"#N/A"},"Kephyrion",0.434,59.29,1]
["09310000",true,1,"Mallomonas",null,0.45200000000000001,null,"Mallomonas",null,0.45200000000000001,"genus",null,null,false,"",null,"0931",0.44500000000000001,85.23,"Mallomonas",0.45200000000000001,87.16,406]
["09310010",false,"","Mallomonas cf acaroides",null,null,0.45200000000000001,null,"Mallomonas cf acaroides",0.45200000000000001,"genus","not in training data",null,false,"","09310000","0931",{"$error":"#N/A"},{"$error":"#N/A"},"Mallomonas",0.45200000000000001,87.16,{"$error":"#N/A"}]
["09310030",true,"","Mallomonas akrokomos",0.47299999999999998,null,null,null,"Mallomonas akrokomos",0.47299999999999998,"species",null,null,false,"",null,"0931",0.47299999999999998,20.48,"Mallomonas",0.45200000000000001,87.16,64]
["09310080",true,"","Mallomonas caudata",0.34599999999999997,null,null,null,"Mallomonas caudata",0.34599999999999997,"species",null,null,false,"",null,"0931",0.34599999999999997,26.15,"Mallomonas",0.45200000000000001,87.16,40]
["09310380",false,"","Mallomonas cf. teilingii",null,null,0.45200000000000001,null,"Mallomonas cf. teilingii",0.45200000000000001,"genus","not in training data",null,false,"","09310000","0931",{"$error":"#N/A"},{"$error":"#N/A"},"Mallomonas",0.45200000000000001,87.16,1]
["09310400",false,"","Mallomonas tonsurata",null,null,0.45200000000000001,null,"Mallomonas tonsurata",0.45200000000000001,"genus","not in training data",null,false,"","09310000","0931",{"$error":"#N/A"},{"$error":"#N/A"},"Mallomonas",0.45200000000000001,87.16,1]
["09330000",false,1,"Monochrysis",null,0.23,null,"Monochrysis",null,0.23,"genus",null,null,false,"",null,"0933",0.23,25.93,"Monochrysis",0.23,24.48,75]
["09350000",true,1,"Ochromonas",null,0.40899999999999997,null,"Ochromonas",null,0.40899999999999997,"genus",null,null,false,"",null,"0935",0.40400000000000003,26.88,"Ochromonas",0.40899999999999997,25.68,62]
["09370000",true,1,"Phaeaster",null,0.252,null,"Phaeaster",null,0.252,"genus",null,null,false,"",null,"0937",0.24299999999999999,9.76,"Phaeaster",0.252,13.41,28]
["09370020",false,"","PHAEASTER APHANASTER",0.28299999999999997,null,null,null,"Phaeaster aphanaster",0.28299999999999997,"species",null,null,false,"",null,"0937",0.28299999999999997,3.92,"Phaeaster",0.252,13.41,7]
["09430000",true,1,"Pseudokephyrion",null,0.34499999999999997,null,"Pseudokephyrion",null,0.34499999999999997,"genus",null,null,false,"",null,"0943",0.34799999999999998,16.09,"Pseudokephyrion",0.34499999999999997,16.23,32]
["09430060",false,"","Pseudokephyrion ruttneri",null,null,0.34499999999999997,null,"Pseudokephyrion ruttneri",0.34499999999999997,"genus","not in training data",null,false,"","09430000","0943",{"$error":"#N/A"},{"$error":"#N/A"},"Pseudokephyrion",0.34499999999999997,16.23,1]
["09430090",false,"","PSEUDOKEPHYRION CONICUM",0.245,null,0.34499999999999997,null,"pseudokephyrion conicum",0.34499999999999997,"genus","too few records",null,false,"",null,"0943",0.245,1,"Pseudokephyrion",0.34499999999999997,16.23,1]
["09430100",false,"","PSEUDOKEPHYRION TATRICUM",0.17899999999999999,null,null,null,"pseudokephyrion tatricum",0.17899999999999999,"species",null,null,false,"",null,"0943",0.17899999999999999,2.94,"Pseudokephyrion",0.34499999999999997,16.23,4]
["09450000",true,1,"Spiniferomonas",null,0.21099999999999999,null,"Spiniferomonas",null,0.21099999999999999,"genus",null,null,false,"",null,"0945",0.20599999999999999,17.21,"Spiniferomonas",0.21099999999999999,16.52,35]
["09480000",true,1,"Stichogloea",null,0.29299999999999998,null,"Stichogloea",null,0.29299999999999998,"genus",null,null,false,"",null,"0948",0.28899999999999998,31.18,"Stichogloea",0.29299999999999998,31.49,83]
["09480010",false,"","STICHOGLOEA DOEDERLEINII",0.24399999999999999,null,0.29299999999999998,null,"Stichogloea doederleinii",0.29299999999999998,"genus","too few records",null,false,"",null,"0948",0.24399999999999999,1,"Stichogloea",0.29299999999999998,31.49,1]
["09530000",true,1,"Synura",null,0.36499999999999999,null,"Synura",null,0.36499999999999999,"genus",null,null,false,"",null,"0953",0.36299999999999999,29.49,"Synura",0.36499999999999999,29.02,74]
["09540000",true,1,"Uroglena",null,0.443,null,"Uroglena",null,0.443,"genus",null,null,false,"",null,"0954",0.435,21.66,"Uroglena",0.443,20.73,59]
["09550000",false,1,"Pseudopedinella",null,0.372,null,"Pseudopedinella",null,0.372,"genus",null,null,false,null,null,"0955",{"$error":"#N/A"},{"$error":"#N/A"},"Pseudopedinella",0.372,73.540000000000006,{"$error":"#N/A"}]
["09559900",false,"","Pseudopedinella",0.27400000000000002,null,0.372,null,"Pseudopedinella",0.372,"genus","uncertain what taxon this refers to",null,false,"",null,"0955",0.27400000000000002,50.59,"Pseudopedinella",0.372,73.540000000000006,177]
["09559910",true,"","Pseudopedinella (small <5um)",0.47099999999999997,null,null,null,"Pseudopedinella (small <5um)",0.47099999999999997,"species",null,null,false,"",null,"0955",0.47099999999999997,24.1,"Pseudopedinella",0.372,73.540000000000006,60]
["09559920",true,"","Pseudopedinella (big >5um)",0.37,null,null,null,"Pseudopedinella (big >5um)",0.37,"species",null,null,false,"",null,"0955",0.37,52.94,"Pseudopedinella",0.372,73.540000000000006,164]
["10050000",true,1,"Centritractus",null,0.32600000000000001,null,"Centritractus",null,0.32600000000000001,"genus",null,"genus optima derived few records",false,"",null,"1005",0.31900000000000001,1.97,"Centritractus",0.32600000000000001,1.94,4]
["10090000",true,1,"Goniochloris",null,0.76400000000000001,null,"Goniochloris",null,0.76400000000000001,"genus",null,null,false,"",null,"1009",0.75900000000000001,20.28,"Goniochloris",0.76400000000000001,20.010000000000002,47]
["10090010",false,"","Goniochloris fallax",null,null,0.76400000000000001,null,"Goniochloris fallax",0.76400000000000001,"genus","not in training data",null,false,"","10090000","1009",{"$error":"#N/A"},{"$error":"#N/A"},"Goniochloris",0.76400000000000001,20.010000000000002,2]
["10090020",false,"","Goniochloris mutica",null,null,0.76400000000000001,null,"Goniochloris mutica",0.76400000000000001,"genus","not in training data",null,false,"","10090000","1009",{"$error":"#N/A"},{"$error":"#N/A"},"Goniochloris",0.76400000000000001,20.010000000000002,4]
["10110000",true,1,"Isthmochloron",null,0.184,null,"Isthmochloron",null,0.184,"genus",null,null,false,"",null,"1011",0.182,2.98,"Isthmochloron",0.184,2.96,2]
["10110020",false,"","Isthmochloron cf. trispinatum",null,null,0.184,null,"Isthmochloron cf. trispinatum",0.184,"genus","not in training data",null,false,"","10110000","1011",{"$error":"#N/A"},{"$error":"#N/A"},"Isthmochloron",0.184,2.96,1]
["10140000",true,1,"Ophiocytium",null,0.54500000000000004,null,"Ophiocytium",null,0.54500000000000004,"genus",null,"genus optima derived few records",false,"",null,"1014",0.54500000000000004,1,"Ophiocytium",0.54500000000000004,1,4]
["10160000",true,1,"Pseudostaurastrum",null,0.71399999999999997,null,"Pseudostaurastrum",null,0.71399999999999997,"genus",null,null,false,"",null,"1016",0.71099999999999997,9.66,"Pseudostaurastrum",0.71399999999999997,9.59,19]
["10180000",false,1,"Tetraedriella",null,0.13800000000000001,null,"Tetraedriella",null,0.13800000000000001,"genus",null,null,false,null,null,"1018",{"$error":"#N/A"},{"$error":"#N/A"},"Tetraedriella",0.13800000000000001,4.4800000000000004,{"$error":"#N/A"}]
["10180010",false,"","Tetraedriella jovetii",0.13700000000000001,null,null,null,"Tetraedriella jovetii",0.13700000000000001,"species",null,null,false,"",null,"1018",0.13700000000000001,4.6900000000000004,"Tetraedriella",0.13800000000000001,4.4800000000000004,13]
["10190000",false,1,"Tribonema",null,0.36599999999999999,null,"Tribonema",null,0.36599999999999999,"genus",null,null,false,"",null,"1019",0.34599999999999997,2.81,"Tribonema",0.36599999999999999,2.65,4]
["10220000",false,1,"Gloeobotrys",null,0.312,null,"Gloeobotrys",null,0.312,"genus",null,null,false,"",null,"1022",0.308,7.64,"Gloeobotrys",0.312,7.4,14]
["12000000",false,1,"BACILLARIALES",null,0.57099999999999995,null,"Bacillariales",null,0.57099999999999995,"group",null,null,false,"",null,"1200",0.18099999999999999,5.62,"Centric diatoms",0.57099999999999995,103.78,23]
["12000001",true,"","Small centric diatom (5 - <10 µm diam.)",0.57299999999999995,null,null,null,"Small centric diatom (5 - <10 µm diam.)",0.57299999999999995,"group",null,null,false,"",null,"1200",0.57299999999999995,97.64,"Centric diatoms",0.57099999999999995,103.78,456]
["12000002",true,"","Medium centric diatom (10-20 µm diam.)",0.56799999999999995,null,null,null,"Medium centric diatom (10-20 µm diam.)",0.56799999999999995,"group",null,null,false,"",null,"1200",0.56799999999999995,76.16,"Centric diatoms",0.57099999999999995,103.78,381]
["12000003",true,"","Large centric diatom (>20 µm diam.)",0.59899999999999998,null,null,null,"Large centric diatom (>20 µm diam.)",0.59899999999999998,"group",null,null,false,"",null,"1200",0.59899999999999998,44.44,"Centric diatoms",0.57099999999999995,103.78,176]
["12000004",true,"","Very small centric diatom (<5 µm diam.)",0.57399999999999995,null,null,null,"Very small centric diatom (<5 µm diam.)",0.57399999999999995,"group",null,null,false,"",null,"1200",0.57399999999999995,57.83,"Centric diatoms",0.57099999999999995,103.78,187]
["12010000",false,1,"Acanthoceras",null,0.72099999999999997,null,"Acanthoceras",null,0.72099999999999997,"genus",null,null,null,null,null,"1201",{"$error":"#N/A"},{"$error":"#N/A"},"Acanthoceras",0.72099999999999997,2.98,{"$error":"#N/A"}]
["12010010",true,"","Acanthoceras zachariasi",0.71599999999999997,null,null,null,"Acanthoceras zachariasi",0.71599999999999997,"species",null,null,false,"",null,"1201",0.71599999999999997,2.99,"Acanthoceras",0.72099999999999997,2.98,10]
["12030000",true,1,"Aulacoseira",null,0.60599999999999998,null,"Aulacoseira",null,0.60599999999999998,"genus",null,null,false,"",null,"1203",0.56399999999999995,62.11,"Aulacoseira",0.60599999999999998,80.67,394]
["12030010",false,"","Aulacoseira alpigena",null,null,0.60599999999999998,null,"Aulacoseira alpigena",0.60599999999999998,"genus","not in training data",null,false,"","12030000","1203",{"$error":"#N/A"},{"$error":"#N/A"},"Aulacoseira",0.60599999999999998,80.67,2]
["12030020",true,"","Aulacoseira ambigua",null,null,0.60599999999999998,null,"Aulacoseira ambigua",0.60599999999999998,"genus","not in training data",null,false,"","12030000","1203",{"$error":"#N/A"},{"$error":"#N/A"},"Aulacoseira",0.60599999999999998,80.67,11]
["12030050",false,"","Aulacoseira distans",0.155,null,null,null,"Aulacoseira distans",0.155,"species",null,null,false,"",null,"1203",0.155,2.97,"Aulacoseira",0.60599999999999998,80.67,7]
["12030060",true,"","Aulacoseira granulata",0.71699999999999997,null,null,null,"Aulacoseira granulata",0.71699999999999997,"species",null,null,false,"",null,"1203",0.71699999999999997,22.82,"Aulacoseira",0.60599999999999998,80.67,122]
["12030062",true,"","Aulacoseira granulata var. angustissima",0.71899999999999997,null,null,null,"Aulacoseira granulata var. angustissima",0.71899999999999997,"species",null,null,false,"",null,"1203",0.71899999999999997,18.399999999999999,"Aulacoseira",0.60599999999999998,80.67,70]
["12030070",false,"","Aulacoseira islandica",0.66300000000000003,null,null,null,"Aulacoseira islandica",0.66300000000000003,"species",null,null,false,"",null,"1203",0.66300000000000003,3.83,"Aulacoseira",0.60599999999999998,80.67,12]
["12030080",true,"","Aulacoseira italica",0.47499999999999998,null,null,null,"Aulacoseira italica",0.47499999999999998,"species",null,null,false,"",null,"1203",0.47499999999999998,12.61,"Aulacoseira",0.60599999999999998,80.67,25]
["12030084",true,"","Aulacoseira italica v.tenuissima",0.435,null,null,null,"Aulacoseira italica v.tenuissima",0.435,"species",null,null,false,"",null,"1203",0.435,10.63,"Aulacoseira",0.60599999999999998,80.67,27]
["12030150",true,"","Aulacoseira subarctica",0.56299999999999994,null,null,null,"Aulacoseira subarctica",0.56299999999999994,"species",null,null,false,"",null,"1203",0.56299999999999994,15.27,"Aulacoseira",0.60599999999999998,80.67,96]
["12040000",false,1,"Chaetoceros",null,1,null,"Chaetoceros",null,1,"genus",null,"genus optima derived few records",false,"",null,"1204",1,1,"Chaetoceros",1,1,5]
["12040010",true,"","Chaetoceros muelleri",null,1,1,null,"Chaetoceros muelleri",1,"genus","not in training data","genus optima derived few records",false,"",null,"1204",{"$error":"#N/A"},{"$error":"#N/A"},"Chaetoceros",1,1,2]
["12060000",false,1,"Jaaginema sp. [Oscillatoriales]",null,null,null,null,null,null,"species","not in training data",null,false,"",null,"1206",{"$error":"#N/A"},{"$error":"#N/A"},"Jaaginema sp. [Oscillatoriales]",{"$error":"#N/A"},{"$error":"#N/A"},{"$error":"#N/A"}]
["12070000",true,1,"Cyclotella",null,0.35499999999999998,null,"Cyclotella",null,0.35499999999999998,"genus",null,null,false,"",null,"1207",0.34599999999999997,22.68,"Cyclotella",0.35499999999999998,24.76,53]
["12070220",false,"","Cyclotella glomerata",null,null,0.35499999999999998,null,"Cyclotella glomerata",0.35499999999999998,"genus","not in training data",null,false,"","12070000","1207",{"$error":"#N/A"},{"$error":"#N/A"},"Cyclotella",0.35499999999999998,24.76,10]
["12070370",false,"","Cyclotella comta",0.34899999999999998,null,null,null,"Cyclotella comta",0.34899999999999998,"species",null,null,false,"",null,"1207",0.34899999999999998,7.72,"Cyclotella",0.35499999999999998,24.76,14]
["12110000",true,1,"Melosira",null,0.71,null,"Melosira",null,0.71,"genus",null,null,false,"",null,"1211",0.57499999999999996,2.84,"Melosira",0.71,20.350000000000001,4]
["12110080",true,"","Melosira varians",0.72199999999999998,null,null,null,"Melosira varians",0.72199999999999998,"species",null,null,false,"",null,"1211",0.72199999999999998,18.010000000000002,"Melosira",0.71,20.350000000000001,52]
["12160000",false,1,"Skeletonema",null,0.8,null,"Skeletonema",null,0.8,"genus",null,null,false,"",null,"1216",0.79200000000000004,2.61,"Skeletonema",0.8,2.48,4]
["12160030",false,"","Skeletonema cf.subsalsum",null,null,0.8,null,"Skeletonema cf.subsalsum",0.8,"genus","not in training data",null,false,"",null,"1216",{"$error":"#N/A"},{"$error":"#N/A"},"Skeletonema",0.8,2.48,2]
["12180000",true,1,"Stephanodiscus",null,0.63400000000000001,null,"Stephanodiscus",null,0.63400000000000001,"genus",null,null,false,"",null,"1218",0.629,14.72,"Stephanodiscus",0.63400000000000001,19.78,150]
["12180090",false,"","Stephanodiscus hantzschii",0.61599999999999999,null,null,null,"Stephanodiscus hantzschii",0.61599999999999999,"species",null,null,false,"",null,"1218",0.61599999999999999,5.71,"Stephanodiscus",0.63400000000000001,19.78,21]
["12180190",false,"","STEPHANODISCUS PARVUS",null,null,0.63400000000000001,null,"Stephanodiscus parvus",0.63400000000000001,"genus","not in training data",null,false,"",null,"1218",{"$error":"#N/A"},{"$error":"#N/A"},"Stephanodiscus",0.63400000000000001,19.78,1]
["12190000",false,1,"Geitlerinema sp. [Oscillatoriales]",null,null,null,null,null,null,"species","not in training data",null,false,"",null,"1219",{"$error":"#N/A"},{"$error":"#N/A"},"Geitlerinema sp. [Oscillatoriales]",{"$error":"#N/A"},{"$error":"#N/A"},{"$error":"#N/A"}]
["12200000",true,1,"Urosolenia",null,0.3,null,"Urosolenia",null,0.3,"genus",null,null,false,"",null,"1220",0.29199999999999998,23.54,"Urosolenia",0.3,34.049999999999997,83]
["12200010",true,"","Urosolenia eriensis",0.25800000000000001,null,null,null,"Urosolenia eriensis",0.25800000000000001,"species",null,null,false,"",null,"1220",0.25800000000000001,21.28,"Urosolenia",0.3,34.049999999999997,98]
["12200020",true,"","Urosolenia longiseta",0.34599999999999997,null,null,null,"Urosolenia longiseta",0.34599999999999997,"species",null,null,false,"",null,"1220",0.34599999999999997,14.44,"Urosolenia",0.3,34.049999999999997,57]
["13000000",false,1,"Pennate diatoms",null,0.41799999999999998,null,"Pennate diatoms",null,0.41799999999999998,"group",null,null,null,null,null,"1300",{"$error":"#N/A"},{"$error":"#N/A"},"Pennate diatoms",0.41299999999999998,48.69,{"$error":"#N/A"}]
["13000001",true,"","Small pennate diatom <10 µm diam",0.35599999999999998,null,null,null,"Small pennate diatom <10 µm diam",0.35599999999999998,"group",null,null,false,"",null,"1300",0.35599999999999998,26.58,"Pennate diatoms",0.41299999999999998,48.69,86]
["13000002",true,"","Medium pennate diatom 10-20 µm diam",0.34899999999999998,null,null,null,"Medium pennate diatom 10-20 µm diam",0.34899999999999998,"group",null,null,false,"",null,"1300",0.34899999999999998,33.14,"Pennate diatoms",0.41299999999999998,48.69,77]
["13000003",true,"","Large pennate diatom >20 µm diam",0.379,null,null,null,"Large pennate diatom >20 µm diam",0.379,"group",null,null,false,"",null,"1300",0.379,30.4,"Pennate diatoms",0.41299999999999998,48.69,125]
["13020000",false,1,"Achnanthidium",null,null,null,null,null,null,"species","not in training data",null,false,"",null,"1302",{"$error":"#N/A"},{"$error":"#N/A"},"Achnanthidium",{"$error":"#N/A"},{"$error":"#N/A"},1]
["13050000",false,1,"Amphora",null,0.30499999999999999,null,"Amphora",null,0.30499999999999999,"genus",null,"genus optima derived few records",false,"",null,"1305",0.30599999999999999,1,"Amphora",0.30499999999999999,1,1]
["13050280",false,"","Amphora ovalis",null,0.30499999999999999,0.30499999999999999,null,"Amphora ovalis",0.30499999999999999,"genus","not in training data","genus optima derived few records",false,"","13050000","1305",{"$error":"#N/A"},{"$error":"#N/A"},"Amphora",0.30499999999999999,1,1]
["13080000",false,1,"Asterionella",null,0.49199999999999999,null,"Asterionella",null,0.49199999999999999,"genus",null,null,false,"",null,"1308",0.432,1,"Asterionella",0.49199999999999999,88.95,1]
["13080010",true,"","Asterionella formosa",0.49099999999999999,null,null,null,"Asterionella formosa",0.49099999999999999,"species",null,null,false,"",null,"1308",0.49099999999999999,89.93,"Asterionella",0.49199999999999999,88.95,569]
["13200000",false,1,"CYLINDROTHECA",null,1,null,"Cylindrotheca",null,1,"genus",null,"genus optima derived few records",false,"",null,"1320",1,1,"Cylindrotheca",1,1,{"$error":"#N/A"}]
["13200010",false,"","Cylindrotheca closterium",null,1,1,null,"Cylindrotheca closterium",1,"genus","not in training data","genus optima derived few records",false,"","13200000","1320",{"$error":"#N/A"},{"$error":"#N/A"},"Cylindrotheca",1,1,1]
["13210000",false,1,"Cymatopleura",null,0.56999999999999995,null,"Cymatopleura",null,0.56999999999999995,"genus",null,null,false,"",null,"1321",0.56200000000000006,3.91,"Cymatopleura",0.56999999999999995,3.96,2]
["13210020",false,"","Cymatopleura elliptica",0.70799999999999996,null,0.56999999999999995,null,"Cymatopleura elliptica",0.56999999999999995,"genus","too few records",null,false,"",null,"1321",0.70799999999999996,1,"Cymatopleura",0.56999999999999995,3.96,1]
["13210030",false,"","Cymatopleura solea",null,null,0.56999999999999995,null,"Cymatopleura solea",0.56999999999999995,"genus","not in training data",null,false,"","13210000","1321",{"$error":"#N/A"},{"$error":"#N/A"},"Cymatopleura",0.56999999999999995,3.96,4]
["13260000",true,1,"Diatoma",null,0.56699999999999995,null,"Diatoma",null,0.56699999999999995,"genus",null,null,false,"",null,"1326",0.53900000000000003,26.94,"Diatoma",0.56699999999999995,34.04,80]
["13260040",true,"","Diatoma tenuis",0.57299999999999995,null,null,null,"Diatoma tenuis",0.57299999999999995,"species",null,null,false,"",null,"1326",0.57299999999999995,19.059999999999999,"Diatoma",0.56699999999999995,34.04,56]
["13280000",false,1,"Didymosphaenia sp.",null,0.20300000000000001,null,"Didymosphaenia sp.",null,0.20300000000000001,"genus",null,"genus optima derived few records",false,"",null,"1328",0.20300000000000001,1,"Didymosphaenia",0.20300000000000001,1,1]
["13370000",true,1,"Fragilaria",null,0.44,null,"Fragilaria",null,0.44,"genus",null,null,false,"",null,"1337",0.42,71.59,"Fragilaria",0.44,81.93,330]
["13370030",true,"","Fragilaria capucina",0.53400000000000003,null,null,null,"Fragilaria capucina",0.53400000000000003,"species",null,null,false,"",null,"1337",0.53400000000000003,8.75,"Fragilaria",0.44,81.93,15]
["13370040",true,"","Fragilaria crotonensis",0.46700000000000003,null,null,null,"Fragilaria crotonensis",0.46700000000000003,"species",null,null,false,"",null,"1337",0.46700000000000003,31.36,"Fragilaria",0.44,81.93,148]
["13390034",false,"",null,null,null,null,null,null,null,"species","not in training data",null,false,"",null,"1339",{"$error":"#N/A"},{"$error":"#N/A"},"Frustulia",{"$error":"#N/A"},{"$error":"#N/A"},{"$error":"#N/A"}]
["13420000",false,1,"Gyrosigma",null,0.71199999999999997,null,"Gyrosigma",null,0.71199999999999997,"genus",null,null,false,"",null,"1342",0.71099999999999997,2.87,"Gyrosigma",0.71199999999999997,2.89,4]
["13520000",true,1,"Navicula",null,0.497,null,"Navicula",null,0.497,"genus",null,null,false,"",null,"1352",0.48699999999999999,27.15,"Navicula",0.497,26.14,64]
["13540000",true,1,"Nitzschia",null,0.628,null,"Nitzschia",null,0.628,"genus",null,null,false,"",null,"1354",0.6,49.85,"Nitzschia",0.628,69.81,165]
["13540010",false,"","Nitzschia acicularioides",0.70799999999999996,null,0.628,null,"Nitzschia acicularioides",0.628,"genus","too few records",null,false,"",null,"1354",0.70799999999999996,1,"Nitzschia",0.628,69.81,1]
["13540020",true,"","Nitzschia acicularis",0.67300000000000004,null,null,null,"Nitzschia acicularis",0.67300000000000004,"species",null,null,false,"",null,"1354",0.67300000000000004,41,"Nitzschia",0.628,69.81,168]
["13541200",false,"","Nitzschia cf. sigma",null,null,0.628,null,"Nitzschia cf. sigma",0.628,"genus","not in training data",null,false,"","13540000","1354",{"$error":"#N/A"},{"$error":"#N/A"},"Nitzschia",0.628,69.81,2]
["13541210",false,"","Nitzschia sigmoidea",null,null,0.628,null,"Nitzschia sigmoidea",0.628,"genus","not in training data",null,false,"",null,"1354",{"$error":"#N/A"},{"$error":"#N/A"},"Nitzschia",0.628,69.81,2]
["13570000",false,1,null,null,null,null,null,null,null,null,"not in training data",null,false,"",null,"1357",{"$error":"#N/A"},{"$error":"#N/A"},"PERONIA",{"$error":"#N/A"},{"$error":"#N/A"},{"$error":"#N/A"}]
["13770000",false,1,"STAUROSIRA",null,0.35,null,"Staurosira",null,0.35,"genus",null,null,null,null,null,"1377",{"$error":"#N/A"},{"$error":"#N/A"},"STAUROSIRA",0.35,10.82,{"$error":"#N/A"}]
["13770013",true,"","Fragilaria construens",0.34699999999999998,null,null,null,"Fragilaria construens",0.34699999999999998,"species",null,null,false,"",null,"1377",0.34699999999999998,11.19,"STAUROSIRA",0.35,10.82,18]
["13780050",false,"","Fragilaria cf. pinnata",0.47,null,0.47,null,"Fragilaria cf. pinnata",0.47,"genus",null,null,false,"","13780050","1378",0.47,2,"STAUROSIRELLA",0.47,2,3]
["13800180",false,"","Surirella elegans",0.70799999999999996,null,0.70799999999999996,null,"Surirella elegans",0.70799999999999996,"genus","too few records",null,false,"",null,"1380",0.70799999999999996,1,"Surirella",0.70799999999999996,1,1]
["13810000",true,1,"Synedra",null,0.50600000000000001,null,"Synedra",null,0.50600000000000001,"genus",null,null,false,"",null,"1381",0.47699999999999998,61.43,"Synedra",0.50600000000000001,82.39,185]
["13810010",true,"","Synedra acus",0.54400000000000004,null,null,null,"Synedra acus",0.54400000000000004,"species",null,null,false,"",null,"1381",0.54400000000000004,39.03,"Synedra",0.50600000000000001,82.39,119]
["13810120",true,"","Synedra nana",null,null,0.50600000000000001,null,"Synedra nana",0.50600000000000001,"genus","not in training data",null,false,"","13810000","1381",{"$error":"#N/A"},{"$error":"#N/A"},"Synedra",0.50600000000000001,82.39,20]
["13810180",true,"","Synedra ulna",0.38100000000000001,null,null,null,"Synedra ulna",0.38100000000000001,"species",null,null,false,"",null,"1381",0.38100000000000001,26.91,"Synedra",0.50600000000000001,82.39,89]
["13810190",false,"","Synedra berolinensis",null,null,0.50600000000000001,null,"Synedra berolinensis",0.50600000000000001,"genus","not in training data",null,false,"","13810000","1381",{"$error":"#N/A"},{"$error":"#N/A"},"Synedra",0.50600000000000001,82.39,3]
["13820000",true,1,"Tabellaria",null,0.32700000000000001,null,"Tabellaria",null,0.32700000000000001,"genus",null,null,false,"",null,"1382",0.33900000000000002,1.87,"Tabellaria",0.32700000000000001,69.34,3]
["13820010",true,"","Tabellaria fenestrata",0.29699999999999999,null,null,null,"Tabellaria fenestrata",0.29699999999999999,"species",null,null,false,"",null,"1382",0.29699999999999999,45.84,"Tabellaria",0.32700000000000001,69.34,185]
["13820020",true,"","Tabellaria flocculosa",0.29499999999999998,null,null,null,"Tabellaria flocculosa",0.29499999999999998,"species",null,null,false,"",null,"1382",0.29499999999999998,58.13,"Tabellaria",0.32700000000000001,69.34,378]
["13820022",true,"","Tabellaria flocculosa var. asterionelloides",0.33300000000000002,null,null,null,"Tabellaria flocculosa var. asterionelloides",0.33300000000000002,"species",null,null,false,"",null,"1382",0.33300000000000002,27.46,"Tabellaria",0.32700000000000001,69.34,122]
["15030000",false,1,"Monomastix",null,0.30499999999999999,null,"Monomastix",null,0.30499999999999999,"genus",null,null,false,"",null,"1503",0.30099999999999999,14.56,"Monomastix",0.30499999999999999,14.1,34]
["15050000",false,1,"Neproselsmis pyriformis",null,0.40200000000000002,null,"Neproselsmis pyriformis",null,0.40200000000000002,"genus",null,null,false,"","15050000","1505",0.40500000000000003,4.83,"Neproselsmis pyriformis",0.40200000000000002,4.7,1]
["15050010",false,"","Nephroselmis olivacea",null,null,0.40200000000000002,null,"Nephroselmis olivacea",0.40200000000000002,"genus","not in training data",null,false,"","15050000","1505",{"$error":"#N/A"},{"$error":"#N/A"},"Neproselsmis pyriformis",0.40200000000000002,4.7,5]
["15110000",false,1,"Pyramimonas",null,0.503,null,"Pyramimonas",null,0.503,"genus",null,null,false,"",null,"1511",0.495,3.81,"Pyramimonas",0.503,3.68,8]
["15120000",false,1,"Scourfeldia",null,0.52900000000000003,null,"Scourfeldia",null,0.52900000000000003,"genus",null,null,false,"",null,"1512",0.52700000000000002,9.9,"Scourfeldia",0.52900000000000003,9.82,21]
["16000000",false,1,"Unidentified green",null,0.28499999999999998,null,"Unidentified green",null,0.28499999999999998,"genus",null,"genus optima derived few records",false,"",null,"1600",0.28499999999999998,1,"Unidentified green",0.28499999999999998,1,2]
["16020000",false,1,"Asterococcus",null,0.313,null,"Asterococcus",null,0.313,"genus",null,null,false,"",null,"1602",0.312,7.77,"Asterococcus",0.313,7.63,8]
["16060000",true,1,"Carteria",null,0.58599999999999997,null,"Carteria",null,0.58599999999999997,"genus",null,null,false,"",null,"1606",0.57499999999999996,16.95,"Carteria",0.58599999999999997,16.440000000000001,37]
["16170000",false,1,"Chlamydocapsa",null,0.27500000000000002,null,"Chlamydocapsa",null,0.27500000000000002,"genus",null,null,false,"",null,"1617",0.27200000000000002,4.9000000000000004,"Chlamydocapsa",0.27500000000000002,5.4,3]
["16170010",false,"","Chlamydocapsa ampla",null,null,0.27500000000000002,null,"Chlamydocapsa ampla",0.27500000000000002,"genus","not in training data",null,false,"","16170000","1617",{"$error":"#N/A"},{"$error":"#N/A"},"Chlamydocapsa",0.27500000000000002,5.4,3]
["16170020",false,"","CHLAMYDOCAPSA PLANCTONICA",0.24399999999999999,null,0.27500000000000002,null,"Chlamydocapsa planctonica",0.27500000000000002,"genus","too few records",null,false,"",null,"1617",0.24399999999999999,1,"Chlamydocapsa",0.27500000000000002,5.4,1]
["16180000",true,1,"Chlamydomonas",null,0.51100000000000001,null,"Chlamydomonas",null,0.51100000000000001,"genus",null,null,false,"",null,"1618",0.5,59.97,"Chlamydomonas",0.51100000000000001,58.35,259]
["16190000",true,1,"Chlorogonium",null,0.49199999999999999,null,"Chlorogonium",null,0.49199999999999999,"genus",null,"genus optima derived few records",false,"",null,"1619",0.49199999999999999,1,"Chlorogonium",0.49199999999999999,1,4]
["16260000",false,1,"Eudorina",null,0.54400000000000004,null,"Eudorina",null,0.54400000000000004,"genus",null,null,null,null,null,"1626",{"$error":"#N/A"},{"$error":"#N/A"},"Eudorina",0.54400000000000004,22.6,{"$error":"#N/A"}]
["16260010",true,"","Eudorina elegans",0.53900000000000003,null,null,null,"Eudorina elegans",0.53900000000000003,"species",null,null,false,"",null,"1626",0.53900000000000003,23.02,"Eudorina",0.54400000000000004,22.6,58]
["16330000",true,1,"Gonium",null,0.29199999999999998,null,"Gonium",null,0.29199999999999998,"genus",null,"genus optima derived few records",false,"",null,"1633",0.29899999999999999,1.98,"Gonium",0.29199999999999998,1.94,3]
["16470000",true,1,"Pandorina",null,0.68300000000000005,null,"Pandorina",null,0.68300000000000005,"genus",null,null,false,"",null,"1647",0.73899999999999999,8.49,"Pandorina",0.68300000000000005,25.9,21]
["16470010",true,"","Pandorina morum",0.65200000000000002,null,null,null,"Pandorina morum",0.65200000000000002,"species",null,null,false,"",null,"1647",0.65200000000000002,21.13,"Pandorina",0.68300000000000005,25.9,45]
["16490000",false,1,"Paulschulzia",null,0.30399999999999999,null,"Paulschulzia",null,0.30399999999999999,"genus",null,null,false,"",null,"1649",0.30499999999999999,10.62,"Paulschulzia",0.30399999999999999,10.43,15]
["16490010",false,"","Paulschulzia pseudovolvox",null,null,0.30399999999999999,null,"Paulschulzia pseudovolvox",0.30399999999999999,"genus","not in training data",null,false,"","16490000","1649",{"$error":"#N/A"},{"$error":"#N/A"},"Paulschulzia",0.30399999999999999,10.43,3]
["16490020",false,"","Paulschulzia tenera",null,null,0.30399999999999999,null,"Paulschulzia tenera",0.30399999999999999,"genus","not in training data",null,false,"","16490000","1649",{"$error":"#N/A"},{"$error":"#N/A"},"Paulschulzia",0.30399999999999999,10.43,2]
["16590010",true,"","Pseudosphaerocystis lacustris",0.29899999999999999,null,null,null,"Pseudosphaerocystis lacustris",0.29899999999999999,"species",null,null,false,"",null,"1659",0.29899999999999999,10.55,"PSEUDOSPHAEROCYSTIS",0.29799999999999999,10.130000000000001,22]
["16600000",true,1,"Pteromonas",null,0.90200000000000002,null,"Pteromonas",null,0.90200000000000002,"genus",null,null,false,"",null,"1660",0.88100000000000001,5.64,"Pteromonas",0.90200000000000002,5.44,16]
["16680000",false,1,"PYROBOTRYS",null,0.58199999999999996,null,"Pyrobotrys",null,0.58199999999999996,"genus",null,"genus optima derived few records",false,"",null,"1668",0.58299999999999996,1.8,"PYROBOTRYS",0.58199999999999996,1.7,{"$error":"#N/A"}]
["16680010",false,"","Spermatozopsis exsultans",null,0.58199999999999996,0.58199999999999996,null,"Spermatozopsis exsultans",0.58199999999999996,"genus","not in training data","genus optima derived few records",false,"","16680000","1668",{"$error":"#N/A"},{"$error":"#N/A"},"PYROBOTRYS",0.58199999999999996,1.7,3]
["16700000",false,1,"Sphaerellopsis",null,null,null,null,null,null,"species","not in training data",null,false,"",null,"1670",{"$error":"#N/A"},{"$error":"#N/A"},"Sphaerellopsis",{"$error":"#N/A"},{"$error":"#N/A"},3]
["16740000",false,1,"TETRASPORA",null,0.44800000000000001,null,"Tetraspora",null,0.44800000000000001,"genus",null,"genus optima derived few records",false,"",null,"1674",0.44800000000000001,1,"TETRASPORA",0.44800000000000001,1,1]
["16770000",false,1,"Volvocales",null,0.54400000000000004,null,"Volvocales",null,0.54400000000000004,"genus",null,null,false,"",null,"1677",0.24099999999999999,6.6,"Volvocales",0.54400000000000004,15.44,14]
["16770010",true,"","Volvox aureus",0.66400000000000003,null,null,null,"Volvox aureus",0.66400000000000003,"species",null,null,false,"",null,"1677",0.66400000000000003,10.48,"Volvocales",0.54400000000000004,15.44,24]
["17000000",true,1,"Chlorococcales",null,0.503,null,"Chlorococcales",null,0.503,"genus",null,null,false,"",null,"1700",0.501,97.49,"Chlorococcales",0.503,96.63,838]
["17020000",false,1,null,null,0.80300000000000005,null,"Actinastrum",null,0.80300000000000005,"genus","not in training data",null,false,"",null,"1702",{"$error":"#N/A"},{"$error":"#N/A"},"ACTINASTRUM",0.80300000000000005,18.54,{"$error":"#N/A"}]
["17020010",true,"","Actinastrum hantzschii",0.78900000000000003,null,null,null,"Actinastrum hantzschii",0.78900000000000003,"species",null,null,false,"",null,"1702",0.78900000000000003,19.68,"ACTINASTRUM",0.80300000000000005,18.54,80]
["17050000",true,1,"Ankistrodesmus",null,0.42499999999999999,null,"Ankistrodesmus",null,0.42499999999999999,"genus",null,null,false,"",null,"1705",0.33300000000000002,26.93,"Ankistrodesmus",0.42499999999999999,40.82,115]
["17050030",true,"","Ankistrodesmus falcatus",0.48199999999999998,null,null,null,"Ankistrodesmus falcatus",0.48199999999999998,"species",null,null,false,"",null,"1705",0.48199999999999998,16.32,"Ankistrodesmus",0.42499999999999999,40.82,37]
["17050050",true,"","Ankistrodesmus fusiformis",0.34799999999999998,null,null,null,"Ankistrodesmus fusiformis",0.34799999999999998,"species",null,null,false,"",null,"1705",0.34799999999999998,29.24,"Ankistrodesmus",0.42499999999999999,40.82,85]
["17050060",true,"","Ankistrodesmus spiralis",0.443,null,null,null,"Ankistrodesmus spiralis",0.443,"species",null,null,false,"",null,"1705",0.443,10.37,"Ankistrodesmus",0.42499999999999999,40.82,40]
["17060000",true,1,"Ankyra lanceolata",null,0.627,null,"Ankyra lanceolata",null,0.627,"genus",null,null,false,"",null,"1706",0.60699999999999998,8.7100000000000009,"Ankyra lanceolata",0.627,44.45,28]
["17060020",true,"","Ankyra judayi",0.625,null,null,null,"Ankyra judayi",0.625,"species",null,null,false,"",null,"1706",0.625,40.380000000000003,"Ankyra lanceolata",0.627,44.45,133]
["17080000",true,1,"Botryococcus",null,0.313,null,"Botryococcus",null,0.313,"genus",null,null,false,"",null,"1708",0.3,43.75,"Botryococcus",0.313,46.82,190]
["17080010",true,"","Botryococcus braunii",0.34399999999999997,null,null,null,"Botryococcus braunii",0.34399999999999997,"species",null,null,false,"",null,"1708",0.34399999999999997,15.43,"Botryococcus",0.313,46.82,40]
["17080050",false,"","BOTRYOCOCCUS TERRIBILIS",0.16700000000000001,null,null,null,"Botryococcus terribilis",0.16700000000000001,"species",null,null,false,"",null,"1708",0.16700000000000001,3.82,"Botryococcus",0.313,46.82,8]
["17170000",true,1,"Closteriopsis",null,0.69599999999999995,null,"Closteriopsis",null,0.69599999999999995,"genus",null,null,false,"",null,"1717",0.752,18.010000000000002,"Closteriopsis",0.69599999999999995,25.35,29]
["17170010",true,"","Closteriopsis acicularis",null,null,0.69599999999999995,null,"Closteriopsis acicularis",0.69599999999999995,"genus","not in training data",null,false,"","17170000","1717",{"$error":"#N/A"},{"$error":"#N/A"},"Closteriopsis",0.69599999999999995,25.35,50]
["17170020",true,"","Closteriopsis longissima",0.48399999999999999,null,null,null,"Closteriopsis longissima",0.48399999999999999,"species",null,null,false,"",null,"1717",0.48399999999999999,10.85,"Closteriopsis",0.69599999999999995,25.35,25]
["17180000",false,1,"Coccomyxa",null,null,null,null,null,null,"species","not in training data",null,false,"",null,"1718",{"$error":"#N/A"},{"$error":"#N/A"},"Coccomyxa",{"$error":"#N/A"},{"$error":"#N/A"},1]
["17200000",true,1,"Coelastrum",null,0.69899999999999995,null,"Coelastrum",null,0.69899999999999995,"genus",null,null,false,"",null,"1720",0.67500000000000004,35.340000000000003,"Coelastrum",0.69899999999999995,52.52,99]
["17200010",true,"","Coelastrum astroideum",0.72599999999999998,null,null,null,"Coelastrum astroideum",0.72599999999999998,"species",null,null,false,"",null,"1720",0.72599999999999998,21.8,"Coelastrum",0.69899999999999995,52.52,73]
["17200020",true,"","Coelastrum microporum",0.71799999999999997,null,null,null,"Coelastrum microporum",0.71799999999999997,"species",null,null,false,"",null,"1720",0.71799999999999997,26.25,"Coelastrum",0.69899999999999995,52.52,87]
["17200070",true,"","Coelastrum sphaericum",null,null,0.69899999999999995,null,"Coelastrum sphaericum",0.69899999999999995,"genus","not in training data",null,false,"","17200000","1720",{"$error":"#N/A"},{"$error":"#N/A"},"Coelastrum",0.69899999999999995,52.52,3]
["17210000",false,1,"Coenochloris",null,0.437,null,"Coenochloris",null,0.437,"genus",null,null,false,"",null,"1721",0.42199999999999999,13.38,"Coenochloris",0.437,12.42,18]
["17210010",true,"","Coenochloris fottii",null,null,0.437,null,"Coenochloris fottii",0.437,"genus","not in training data",null,false,"","17210000","1721",{"$error":"#N/A"},{"$error":"#N/A"},"Coenochloris",0.437,12.42,9]
["17220000",false,1,"COENOCOCCUS",null,0.13,null,"Coenococcus",null,0.13,"genus",null,null,false,"",null,"1722",0.15,2.67,"COENOCOCCUS",0.13,2.41,3]
["17230000",false,1,"COENOCYSTIS",null,0.247,null,"Coenocystis",null,0.247,"genus",null,null,false,"",null,"1723",0.246,3.17,"COENOCYSTIS",0.247,2.99,1]
["17230020",true,"","Coenocystis planctonica",null,null,0.247,null,"Coenocystis planctonica",0.247,"genus","not in training data",null,false,"","17230000","1723",{"$error":"#N/A"},{"$error":"#N/A"},"COENOCYSTIS",0.247,2.99,5]
["17250000",true,1,"Crucigenia",null,0.55200000000000005,null,"Crucigenia",null,0.55200000000000005,"genus",null,null,false,"",null,"1725",0.58399999999999996,22.29,"Crucigenia",0.55200000000000005,33.5,68]
["17250020",false,"","Crucigenia lauterbornii",null,null,0.55200000000000005,null,"Crucigenia lauterbornii",0.55200000000000005,"genus","not in training data",null,false,"","17250000","1725",{"$error":"#N/A"},{"$error":"#N/A"},"Crucigenia",0.55200000000000005,33.5,1]
["17250030",true,"","Crucigenia tetrapedia",0.53500000000000003,null,null,null,"Crucigenia tetrapedia",0.53500000000000003,"species",null,null,false,"",null,"1725",0.53500000000000003,21.26,"Crucigenia",0.55200000000000005,33.5,70]
["17260000",true,1,"Crucigeniella",null,0.504,null,"Crucigeniella",null,0.504,"genus",null,null,false,"",null,"1726",0.55000000000000004,16.16,"Crucigeniella",0.504,17.48,42]
["17260010",false,"","Crucigeniella pulchra",null,null,0.504,null,"Crucigeniella pulchra",0.504,"genus","not in training data",null,false,"","17260000","1726",{"$error":"#N/A"},{"$error":"#N/A"},"Crucigeniella",0.504,17.48,1]
["17260020",false,"","WILLEA IRREGULARIS",3.0000000000000001E-3,null,0.504,null,"Willea irregularis",0.504,"genus","too few records",null,false,"",null,"1726",3.0000000000000001E-3,2,"Crucigeniella",0.504,17.48,6]
["17260040",false,"","Willea wilhelmii",null,null,0.504,null,"Willea wilhelmii",0.504,"genus","not in training data",null,false,"","17260000","1726",{"$error":"#N/A"},{"$error":"#N/A"},"Crucigeniella",0.504,17.48,1]
["17300000",false,1,"DICHOTOMOCOCCUS",null,0.45200000000000001,null,"Dichotomococcus",null,0.45200000000000001,"genus",null,"genus optima derived few records",false,"",null,"1730",0.44900000000000001,1.96,"DICHOTOMOCOCCUS",0.45200000000000001,1.92,{"$error":"#N/A"}]
["17300010",false,"","Dichotomococcus curvatus",null,0.45200000000000001,0.45200000000000001,null,"Dichotomococcus curvatus",0.45200000000000001,"genus","not in training data","genus optima derived few records",false,"","17300000","1730",{"$error":"#N/A"},{"$error":"#N/A"},"DICHOTOMOCOCCUS",0.45200000000000001,1.92,2]
["17330000",true,1,"Dictyosphaerium",null,0.55600000000000005,null,"Dictyosphaerium",null,0.55600000000000005,"genus",null,null,false,"",null,"1733",0.40600000000000003,47.86,"Dictyosphaerium",0.55600000000000005,76.819999999999993,171]
["17330040",true,"","Dictyosphaerium pulchellum",0.61799999999999999,null,null,null,"Dictyosphaerium pulchellum",0.61799999999999999,"species",null,null,false,"",null,"1733",0.61799999999999999,54.35,"Dictyosphaerium",0.55600000000000005,76.819999999999993,207]
["17330050",false,"","Dictyosphaerium tetrachotomum",null,null,0.55600000000000005,null,"Dictyosphaerium tetrachotomum",0.55600000000000005,"genus","not in training data",null,false,"","17330000","1733",{"$error":"#N/A"},{"$error":"#N/A"},"Dictyosphaerium",0.55600000000000005,76.819999999999993,14]
["17340000",true,1,"Didymocystis",null,0.42399999999999999,null,"Didymocystis",null,0.42399999999999999,"genus",null,"genus optima derived few records",false,"",null,"1734",0.41499999999999998,1.9,"Didymocystis",0.42399999999999999,1.86,2]
["17350020",true,"","Didymogenes palatina",0.49199999999999999,null,0.49199999999999999,null,"Didymogenes palatina",0.49199999999999999,"genus","too few records",null,false,"",null,"1735",0.49199999999999999,1,"DIDYMOGENES",0.49199999999999999,1,1]
["17410000",false,1,"Franceia",null,0.59299999999999997,null,"Franceia",null,0.59299999999999997,"genus",null,"genus optima derived few records",false,"",null,"1741",0.59299999999999997,1,"Franceia",0.59299999999999997,1,1]
["17410030",false,"","Franceia ovalis",null,0.59299999999999997,0.59299999999999997,null,"Franceia ovalis",0.59299999999999997,"genus","not in training data","genus optima derived few records",false,"","17410000","1741",{"$error":"#N/A"},{"$error":"#N/A"},"Franceia",0.59299999999999997,1,1]
["17420000",true,1,"Gloeocystis",null,0.82,null,"Gloeocystis",null,0.82,"genus",null,null,false,"",null,"1742",0.80700000000000005,2.93,"Gloeocystis",0.82,2.88,7]
["17430000",true,1,"Golenkinia",null,0.61799999999999999,null,"Golenkinia",null,0.61799999999999999,"genus",null,null,false,"",null,"1743",0.59899999999999998,11.47,"Golenkinia",0.61799999999999999,10.73,14]
["17430020",true,"","Golenkinia radiata",null,null,0.61799999999999999,null,"Golenkinia radiata",0.61799999999999999,"genus","not in training data",null,false,"","17430000","1743",{"$error":"#N/A"},{"$error":"#N/A"},"Golenkinia",0.61799999999999999,10.73,15]
["17440000",false,1,"GOLENKINIOPSIS",null,0.33700000000000002,null,"Golenkiniopsis",null,0.33700000000000002,"genus",null,"genus optima derived few records",false,"",null,"1744",0.33700000000000002,1,"GOLENKINIOPSIS",0.33700000000000002,1,{"$error":"#N/A"}]
["17440020",true,"","Golenkiniopsis longispina",null,0.33700000000000002,0.33700000000000002,null,"Golenkiniopsis longispina",0.33700000000000002,"genus","not in training data","genus optima derived few records",false,"","17440000","1744",{"$error":"#N/A"},{"$error":"#N/A"},"GOLENKINIOPSIS",0.33700000000000002,1,3]
["17500000",false,1,"Keratococcus",null,0.33700000000000002,null,"Keratococcus",null,0.33700000000000002,"genus",null,null,false,"",null,"1750",0.33500000000000002,2.95,"Keratococcus",0.33700000000000002,2.92,7]
["17510000",true,1,"Kirchneriella",null,0.60499999999999998,null,"Kirchneriella",null,0.60499999999999998,"genus",null,null,false,"",null,"1751",0.58599999999999997,36.25,"Kirchneriella",0.60499999999999998,34.549999999999997,96]
["17510050",false,"","Kirchneriella obesa",null,null,0.60499999999999998,null,"Kirchneriella obesa",0.60499999999999998,"genus","not in training data",null,false,"","17510000","1751",{"$error":"#N/A"},{"$error":"#N/A"},"Kirchneriella",0.60499999999999998,34.549999999999997,6]
["17530000",true,1,"Korshikoviella",null,0.60099999999999998,null,"Korshikoviella",null,0.60099999999999998,"genus",null,"genus optima derived few records",false,"",null,"1753",0.59299999999999997,1.95,"Korshikoviella",0.60099999999999998,1.87,5]
["17540000",true,1,"Lagerheimia",null,0.77800000000000002,null,"Lagerheimia",null,0.77800000000000002,"genus",null,null,false,"",null,"1754",0.83,12.61,"Lagerheimia",0.77800000000000002,25.31,31]
["17540010",false,"","Lagerheimia chodatii",null,null,0.77800000000000002,null,"Lagerheimia chodatii",0.77800000000000002,"genus","not in training data",null,false,"","17540000","1754",{"$error":"#N/A"},{"$error":"#N/A"},"Lagerheimia",0.77800000000000002,25.31,2]
["17540040",true,"","Lagerheimia genevensis",0.76700000000000002,null,null,null,"Lagerheimia genevensis",0.76700000000000002,"species",null,null,false,"",null,"1754",0.76700000000000002,20.14,"Lagerheimia",0.77800000000000002,25.31,60]
["17570000",true,1,"Micractinium",null,0.629,null,"Micractinium",null,0.629,"genus",null,null,false,"",null,"1757",0.63,11.02,"Micractinium",0.629,10.67,18]
["17570010",true,"","Micractinium pusillum",null,null,0.629,null,"Micractinium pusillum",0.629,"genus","not in training data",null,false,"","17570000","1757",{"$error":"#N/A"},{"$error":"#N/A"},"Micractinium",0.629,10.67,3]
["17580000",true,1,"Monoraphidium",null,0.53800000000000003,null,"Monoraphidium",null,0.53800000000000003,"genus",null,null,false,"",null,"1758",0.44700000000000001,71.56,"Monoraphidium",0.53800000000000003,117.84,302]
["17580010",true,"","Monoraphidium arcuatum",0.71299999999999997,null,null,null,"Monoraphidium arcuatum",0.71299999999999997,"species",null,null,false,"",null,"1758",0.71299999999999997,28.33,"Monoraphidium",0.53800000000000003,117.84,108]
["17580020",true,"","Monoraphidium contortum",0.59599999999999997,null,null,null,"Monoraphidium contortum",0.59599999999999997,"species",null,null,false,"",null,"1758",0.59599999999999997,88.04,"Monoraphidium",0.53800000000000003,117.84,513]
["17580030",true,"","Monoraphidium convolutum",0.68500000000000005,null,null,null,"Monoraphidium convolutum",0.68500000000000005,"species",null,null,false,"",null,"1758",0.68500000000000005,25.98,"Monoraphidium",0.53800000000000003,117.84,91]
["17580040",true,"","Monoraphidium griffithii",0.55300000000000005,null,null,null,"Monoraphidium griffithii",0.55300000000000005,"species",null,null,false,"",null,"1758",0.55300000000000005,56.83,"Monoraphidium",0.53800000000000003,117.84,250]
["17580050",true,"","Monoraphidium irregulare",0.64,null,null,null,"Monoraphidium irregulare",0.64,"species",null,null,false,"",null,"1758",0.64,24.91,"Monoraphidium",0.53800000000000003,117.84,55]
["17580060",false,"","Monoraphidium litorale",0.72699999999999998,null,0.53800000000000003,null,"Monoraphidium litorale",0.53800000000000003,"genus","too few records",null,false,"",null,"1758",0.72699999999999998,1.89,"Monoraphidium",0.53800000000000003,117.84,3]
["17580070",true,"","Monoraphidium komarkovae",0.61399999999999999,null,null,null,"Monoraphidium komarkovae",0.61399999999999999,"species",null,null,false,"",null,"1758",0.61399999999999999,33.56,"Monoraphidium",0.53800000000000003,117.84,110]
["17580080",true,"","Monoraphidium minutum",0.623,null,null,null,"Monoraphidium minutum",0.623,"species",null,null,false,"",null,"1758",0.623,78.13,"Monoraphidium",0.53800000000000003,117.84,314]
["17580090",false,"","Monoraphidium mirabile",0.31,null,null,null,"Monoraphidium mirabile",0.31,"species",null,null,false,"",null,"1758",0.31,3.88,"Monoraphidium",0.53800000000000003,117.84,9]
["17580100",false,"","Monoraphidium obtusum",null,null,0.53800000000000003,null,"Monoraphidium obtusum",0.53800000000000003,"genus","not in training data",null,false,"",null,"1758",{"$error":"#N/A"},{"$error":"#N/A"},"Monoraphidium",0.53800000000000003,117.84,1]
["17580120",true,"","Monoraphidium tortile",null,null,0.53800000000000003,null,"Monoraphidium tortile",0.53800000000000003,"genus","not in training data",null,false,"","17580000","1758",{"$error":"#N/A"},{"$error":"#N/A"},"Monoraphidium",0.53800000000000003,117.84,6]
["17580130",true,"","Monoraphidium dybowskii",0.41899999999999998,null,null,null,"Monoraphidium dybowskii",0.41899999999999998,"species",null,null,false,"",null,"1758",0.41899999999999998,57.81,"Monoraphidium",0.53800000000000003,117.84,169]
["17620020",false,"","NEPHROCHLAMYS SUBSOLITARIA",0.33100000000000002,null,0.33100000000000002,null,"Nephrochlamys subsolitaria",0.33100000000000002,"genus","too few records",null,false,"",null,"1762",0.33100000000000002,1,"NEPHROCHLAMYS",0.33100000000000002,1,1]
["17630000",false,1,"Nephrocytium",null,0.436,null,"Nephrocytium",null,0.436,"genus",null,null,false,"",null,"1763",0.441,14.09,"Nephrocytium",0.436,14.37,16]
["17630010",false,"","Nephrocytium agardhianum",0.255,null,null,null,"Nephrocytium agardhianum",0.255,"species",null,null,false,"",null,"1763",0.255,4.45,"Nephrocytium",0.436,14.37,10]
["17630020",false,"","Nephrocytium limneticum",null,null,0.436,null,"Nephrocytium limneticum",0.436,"genus","not in training data",null,false,"","17630000","1763",{"$error":"#N/A"},{"$error":"#N/A"},"Nephrocytium",0.436,14.37,6]
["17640000",true,1,"Oocystis",null,0.54,null,"Oocystis",null,0.54,"genus",null,null,false,"",null,"1764",0.53400000000000003,99.4,"Oocystis",0.54,101.07,515]
["17640030",false,"","Oocystis borgei",0.40600000000000003,null,null,null,"Oocystis borgei",0.40600000000000003,"species",null,null,false,"",null,"1764",0.40600000000000003,13,"Oocystis",0.54,101.07,29]
["17640050",true,"","Oocystis lacustris",0.54200000000000004,null,null,null,"Oocystis lacustris",0.54200000000000004,"species",null,null,false,"",null,"1764",0.54200000000000004,9.61,"Oocystis",0.54,101.07,19]
["17640060",false,"","Oocystis marssonii",null,null,0.54,null,"Oocystis marssonii",0.54,"genus","not in training data",null,false,"","17640000","1764",{"$error":"#N/A"},{"$error":"#N/A"},"Oocystis",0.54,101.07,3]
["17640120",true,"","Oocystis parva",0.432,null,null,null,"Oocystis parva",0.432,"species",null,null,false,"",null,"1764",0.432,10.74,"Oocystis",0.54,101.07,32]
["17670000",false,1,"Palmodictyon",null,0.223,null,"Palmodictyon",null,0.223,"genus",null,"genus optima derived few records",false,"",null,"1767",0.223,1,"Palmodictyon",0.223,1,1]
["17680000",true,1,"Pediastrum",null,0.68600000000000005,null,"Pediastrum",null,0.68600000000000005,"genus",null,null,false,"",null,"1768",0.70699999999999996,14.25,"Pediastrum",0.68600000000000005,78.94,27]
["17680010",false,"","Pediastrum angulosum",null,null,0.68600000000000005,null,"Pediastrum angulosum",0.68600000000000005,"genus","not in training data",null,false,"","17680000","1768",{"$error":"#N/A"},{"$error":"#N/A"},"Pediastrum",0.68600000000000005,78.94,3]
["17680020",true,"","Pediastrum biradiatum",null,null,0.68600000000000005,null,"Pediastrum biradiatum",0.68600000000000005,"genus","not in training data",null,false,"",null,"1768",{"$error":"#N/A"},{"$error":"#N/A"},"Pediastrum",0.68600000000000005,78.94,2]
["17680030",true,"","Pediastrum boryanum",0.70599999999999996,null,null,null,"Pediastrum boryanum",0.70599999999999996,"species",null,null,false,"",null,"1768",0.70599999999999996,61.75,"Pediastrum",0.68600000000000005,78.94,239]
["17680032",false,"","Pediastrum boryanum var. cornutum",0.56599999999999995,null,null,null,"Pediastrum boryanum var. cornutum",0.56599999999999995,"species",null,null,false,"",null,"1768",0.56599999999999995,2.97,"Pediastrum",0.68600000000000005,78.94,7]
["17680033",false,"","Pediastrum boryanum v. longicorne",null,null,0.70599999999999996,null,"Pediastrum boryanum v. longicorne",0.70599999999999996,"genus","not in training data",null,false,"","17680030","1768",{"$error":"#N/A"},{"$error":"#N/A"},"Pediastrum",0.68600000000000005,78.94,16]
["17680050",true,"","Pediastrum duplex",0.72599999999999998,null,null,null,"Pediastrum duplex",0.72599999999999998,"species",null,null,false,"",null,"1768",0.72599999999999998,52.76,"Pediastrum",0.68600000000000005,78.94,178]
["17680052",false,"","Pediastrum duplex var. gracillimum",null,null,0.72599999999999998,null,"Pediastrum duplex var. gracillimum",0.72599999999999998,"genus","not in training data",null,false,"","17680050","1768",{"$error":"#N/A"},{"$error":"#N/A"},"Pediastrum",0.68600000000000005,78.94,1]
["17680054",false,"","PEDIASTRUM DUPLEX V. SUBGRANULATUM",null,null,0.68600000000000005,null,"pediastrum duplex v. subgranulatum",0.68600000000000005,"genus","not in training data",null,false,"",null,"1768",{"$error":"#N/A"},{"$error":"#N/A"},"Pediastrum",0.68600000000000005,78.94,3]
["17680060",false,"","PEDIASTRUM INTEGRUM",0.23,null,0.68600000000000005,null,"pediastrum integrum",0.68600000000000005,"genus","too few records",null,false,"",null,"1768",0.23,1,"Pediastrum",0.68600000000000005,78.94,1]
["17680070",false,"","Pediastrum kawraiskyi",null,null,0.68600000000000005,null,"Pediastrum kawraiskyi",0.68600000000000005,"genus","not in training data",null,false,"","17680000","1768",{"$error":"#N/A"},{"$error":"#N/A"},"Pediastrum",0.68600000000000005,78.94,4]
["17680080",true,"","Pediastrum simplex",null,null,0.68600000000000005,null,"Pediastrum simplex",0.68600000000000005,"genus","not in training data",null,false,"","17680000","1768",{"$error":"#N/A"},{"$error":"#N/A"},"Pediastrum",0.68600000000000005,78.94,7]
["17680090",true,"","Pediastrum tetras",0.628,null,null,null,"Pediastrum tetras",0.628,"species",null,null,false,"",null,"1768",0.628,34.74,"Pediastrum",0.68600000000000005,78.94,152]
["17690010",true,"","Planktosphaeria gelatinosa",0.309,null,null,null,"Planktosphaeria gelatinosa",0.309,"species",null,null,false,"",null,"1769",0.309,10.52,"PLANKTOSPHAERIA",0.312,10.130000000000001,30]
["17740010",false,"","Dictyosphaerium subsolitarium",0.155,null,0.151,null,"Dictyosphaerium subsolitarium",0.151,"genus","too few records",null,false,"",null,"1774",0.155,2,"PSEUDODICTYOSPHAERIUM",0.151,2,2]
["17780000",true,1,"Quadrigula",null,0.27100000000000002,null,"Quadrigula",null,0.27100000000000002,"genus",null,null,false,"",null,"1778",0.29399999999999998,19.95,"Quadrigula",0.27100000000000002,25.12,88]
["17780010",false,"","Quadrigula closterioides",0.252,null,null,null,"Quadrigula closterioides",0.252,"species",null,null,false,"",null,"1778",0.252,5.74,"Quadrigula",0.27100000000000002,25.12,7]
["17780020",true,"","Quadrigula pfitzeri",0.186,null,null,null,"Quadrigula pfitzeri",0.186,"species",null,null,false,"",null,"1778",0.186,12.06,"Quadrigula",0.27100000000000002,25.12,37]
["17790020",false,"","Radiococcus planktonicus",null,null,null,null,null,null,"species","not in training data",null,false,"",null,"1779",{"$error":"#N/A"},{"$error":"#N/A"},"RADIOCOCCUS",{"$error":"#N/A"},{"$error":"#N/A"},{"$error":"#N/A"}]
["17800000",true,1,"Raphidocelis",null,0.51100000000000001,null,"Raphidocelis",null,0.51100000000000001,"genus",null,null,false,"",null,"1780",0.48599999999999999,17.36,"Raphidocelis",0.51100000000000001,15.85,47]
["17800010",false,"","Kirchneriella contorta",null,null,0.51100000000000001,null,"Kirchneriella contorta",0.51100000000000001,"genus","not in training data",null,false,"","17800000","1780",{"$error":"#N/A"},{"$error":"#N/A"},"Raphidocelis",0.51100000000000001,15.85,6]
["17800040",false,"","Kirchneriella subcapitata",null,null,0.51100000000000001,null,"Kirchneriella subcapitata",0.51100000000000001,"genus","not in training data",null,false,"","17800000","1780",{"$error":"#N/A"},{"$error":"#N/A"},"Raphidocelis",0.51100000000000001,15.85,2]
["17810000",true,1,"Scenedesmus",null,0.61599999999999999,null,"Scenedesmus",null,0.61599999999999999,"genus",null,null,false,"",null,"1781",0.60499999999999998,97.84,"Scenedesmus",0.61599999999999999,97.65,801]
["17810010",false,"","Scenedesmus sempervirens",0.59299999999999997,null,null,null,"Scenedesmus sempervirens",0.59299999999999997,"species",null,null,false,"",null,"1781",0.59299999999999997,7.39,"Scenedesmus",0.61599999999999999,97.65,14]
["17810020",false,"","Scenedesmus aculeolatus",0.27500000000000002,null,null,null,"Scenedesmus aculeolatus",0.27500000000000002,"species",null,null,false,"",null,"1781",0.27500000000000002,5.81,"Scenedesmus",0.61599999999999999,97.65,6]
["17810050",false,"","Scenedesmus acutus",null,null,0.61599999999999999,null,"Scenedesmus acutus",0.61599999999999999,"genus","not in training data",null,false,"","17810000","1781",{"$error":"#N/A"},{"$error":"#N/A"},"Scenedesmus",0.61599999999999999,97.65,1]
["17810080",true,"","Scenedesmus armatus",0.60299999999999998,null,null,null,"Scenedesmus armatus",0.60299999999999998,"species",null,null,false,"",null,"1781",0.60299999999999998,11.37,"Scenedesmus",0.61599999999999999,97.65,35]
["17810160",true,"","Scenedesmus communis",0.70099999999999996,null,null,null,"Scenedesmus communis",0.70099999999999996,"species",null,null,false,"",null,"1781",0.70099999999999996,35.380000000000003,"Scenedesmus",0.61599999999999999,97.65,151]
["17810210",false,"","Scenedesmus protuberans",null,null,0.61599999999999999,null,"Scenedesmus protuberans",0.61599999999999999,"genus","not in training data",null,false,"",null,"1781",{"$error":"#N/A"},{"$error":"#N/A"},"Scenedesmus",0.61599999999999999,97.65,1]
["17810220",true,"","Scenedesmus falcatus",0.85899999999999999,null,null,null,"Scenedesmus falcatus",0.85899999999999999,"species",null,null,false,"",null,"1781",0.85899999999999999,17.18,"Scenedesmus",0.61599999999999999,97.65,79]
["17810300",false,"","Scenedesmus cf. magnus",null,null,0.61599999999999999,null,"Scenedesmus cf. magnus",0.61599999999999999,"genus","not in training data",null,false,"","17810000","1781",{"$error":"#N/A"},{"$error":"#N/A"},"Scenedesmus",0.61599999999999999,97.65,3]
["17810320",false,"","Scenedesmus obliquus",null,null,0.61599999999999999,null,"Scenedesmus obliquus",0.61599999999999999,"genus","not in training data",null,false,"","17810000","1781",{"$error":"#N/A"},{"$error":"#N/A"},"Scenedesmus",0.61599999999999999,97.65,2]
["17810330",false,"","Scenedesmus cf. obtusus",null,null,0.61599999999999999,null,"Scenedesmus cf. obtusus",0.61599999999999999,"genus","not in training data",null,false,"","17810000","1781",{"$error":"#N/A"},{"$error":"#N/A"},"Scenedesmus",0.61599999999999999,97.65,5]
["17810340",true,"","Scenedesmus opoliensis",0.81699999999999995,null,null,null,"Scenedesmus opoliensis",0.81699999999999995,"species",null,null,false,"",null,"1781",0.81699999999999995,17.420000000000002,"Scenedesmus",0.61599999999999999,97.65,65]
["17810410",false,"","Scenedesmus spinosus",null,null,0.61599999999999999,null,"Scenedesmus spinosus",0.61599999999999999,"genus","not in training data",null,false,"","17810000","1781",{"$error":"#N/A"},{"$error":"#N/A"},"Scenedesmus",0.61599999999999999,97.65,2]
["17810420",false,"","Scenedesmus cf. subspicatus",null,null,0.61599999999999999,null,"Scenedesmus cf. subspicatus",0.61599999999999999,"genus","not in training data",null,false,"","17810000","1781",{"$error":"#N/A"},{"$error":"#N/A"},"Scenedesmus",0.61599999999999999,97.65,1]
["17810430",false,"","Scenedesmus disciformis f. disciformis",null,null,0.61599999999999999,null,"Scenedesmus disciformis f. disciformis",0.61599999999999999,"genus","not in training data",null,false,"","17810000","1781",{"$error":"#N/A"},{"$error":"#N/A"},"Scenedesmus",0.61599999999999999,97.65,1]
["17810440",false,"","Scenedesmus dimorphus",null,null,0.61599999999999999,null,"Scenedesmus dimorphus",0.61599999999999999,"genus","not in training data",null,false,"","17810000","1781",{"$error":"#N/A"},{"$error":"#N/A"},"Scenedesmus",0.61599999999999999,97.65,5]
["17811899",false,"","Scenedesmus arcuatus",0.88400000000000001,null,0.61599999999999999,null,"Scenedesmus arcuatus",0.61599999999999999,"genus","too few records",null,false,"",null,"1781",0.88400000000000001,1,"Scenedesmus",0.61599999999999999,97.65,4]
["17830000",false,1,"Schroederia",null,0.748,null,"Schroederia",null,0.748,"genus",null,null,false,"",null,"1783",0.68300000000000005,1.92,"Schroederia",0.748,15.9,4]
["17830020",true,"","Schroederia robusta",0.68300000000000005,null,null,null,"Schroederia robusta",0.68300000000000005,"species",null,null,false,"",null,"1783",0.68300000000000005,6.38,"Schroederia",0.748,15.9,14]
["17830030",true,"","Schroederia setigera",0.75700000000000001,null,null,null,"Schroederia setigera",0.75700000000000001,"species",null,null,false,"",null,"1783",0.75700000000000001,9.61,"Schroederia",0.748,15.9,29]
["17860000",true,1,"Selenastrum",null,0.72299999999999998,null,"Selenastrum",null,0.72299999999999998,"genus",null,null,false,"",null,"1786",0.71699999999999997,3.94,"Selenastrum",0.72299999999999998,3.92,15]
["17870000",false,1,"SIDEROCELIS",null,0.25700000000000001,null,"Siderocelis",null,0.25700000000000001,"genus",null,null,false,"",null,"1787",0.253,2.86,"SIDEROCELIS",0.25700000000000001,2.78,{"$error":"#N/A"}]
["17870020",false,"","Siderocelis ornata",null,null,0.25700000000000001,null,"Siderocelis ornata",0.25700000000000001,"genus","not in training data",null,false,"","17870000","1787",{"$error":"#N/A"},{"$error":"#N/A"},"SIDEROCELIS",0.25700000000000001,2.78,3]
["17910000",true,1,"Sphaerocystis",null,0.55800000000000005,null,"Sphaerocystis",null,0.55800000000000005,"genus",null,null,false,"",null,"1791",0.55900000000000005,63.98,"Sphaerocystis",0.55800000000000005,71.23,180]
["17910020",true,"","Sphaerocystis schroeteri",0.47899999999999998,null,null,null,"Sphaerocystis schroeteri",0.47899999999999998,"species",null,null,false,"",null,"1791",0.47899999999999998,26.66,"Sphaerocystis",0.55800000000000005,71.23,58]
["17940010",false,"","TETRACHLORELLA ALTERNANS",0.33100000000000002,null,0.33100000000000002,null,"Tetrachlorella alternans",0.33100000000000002,"genus","too few records",null,false,"",null,"1794",0.33100000000000002,1,"TETRACHLORELLA",0.33100000000000002,1,1]
["17960000",true,1,"Tetraedron",null,0.621,null,"Tetraedron",null,0.621,"genus",null,null,false,"",null,"1796",0.85199999999999998,10.42,"Tetraedron",0.621,60.62,26]
["17960010",true,"","Tetraedron caudatum",0.63300000000000001,null,null,null,"Tetraedron caudatum",0.63300000000000001,"species",null,null,false,"",null,"1796",0.63300000000000001,28.35,"Tetraedron",0.621,60.62,90]
["17960030",true,"","Tetraedron minimum",0.58099999999999996,null,null,null,"Tetraedron minimum",0.58099999999999996,"species",null,null,false,"",null,"1796",0.58099999999999996,48.95,"Tetraedron",0.621,60.62,170]
["17970000",false,1,"Tetrastrum",null,0.65800000000000003,null,"Tetrastrum",null,0.65800000000000003,"genus",null,null,false,"",null,"1797",0.7,21.95,"Tetrastrum",0.65800000000000003,38.61,7]
["17970010",true,"","Tetrastrum elegans",null,null,0.65800000000000003,null,"Tetrastrum elegans",0.65800000000000003,"genus","not in training data",null,false,"","17970000","1797",{"$error":"#N/A"},{"$error":"#N/A"},"Tetrastrum",0.65800000000000003,38.61,3]
["17970040",true,"","Crucigenia quadrata",0.35799999999999998,null,null,null,"Crucigenia quadrata",0.35799999999999998,"species",null,null,false,"",null,"1797",0.35799999999999998,17.309999999999999,"Tetrastrum",0.65800000000000003,38.61,43]
["17970050",true,"","Tetrastrum staurogeniaeforme",0.83399999999999996,null,null,null,"Tetrastrum staurogeniaeforme",0.83399999999999996,"species",null,null,false,"",null,"1797",0.83399999999999996,16.63,"Tetrastrum",0.65800000000000003,38.61,43]
["17970060",true,"","Tetrastrum triangulare",null,null,0.65800000000000003,null,"Tetrastrum triangulare",0.65800000000000003,"genus","not in training data",null,false,"","17970000","1797",{"$error":"#N/A"},{"$error":"#N/A"},"Tetrastrum",0.65800000000000003,38.61,60]
["18010000",false,1,"TREUBARIA",null,0.66600000000000004,null,"Treubaria",null,0.66600000000000004,"genus",null,null,false,"",null,"1801",0.65400000000000003,15.54,"TREUBARIA",0.66600000000000004,15.23,{"$error":"#N/A"}]
["18010010",true,"","Treubaria setigera",null,null,0.66600000000000004,null,"Treubaria setigera",0.66600000000000004,"genus","not in training data",null,false,"","18010000","1801",{"$error":"#N/A"},{"$error":"#N/A"},"TREUBARIA",0.66600000000000004,15.23,33]
["18010020",false,"","Treubaria triappendiculata",null,null,0.66600000000000004,null,"Treubaria triappendiculata",0.66600000000000004,"genus","not in training data",null,false,"","18010000","1801",{"$error":"#N/A"},{"$error":"#N/A"},"TREUBARIA",0.66600000000000004,15.23,4]
["18030000",false,1,"WESTELLA",null,0.442,null,"Westella",null,0.442,"genus",null,"genus optima derived few records",false,"",null,"1803",0.442,1.99,"WESTELLA",0.442,1.99,{"$error":"#N/A"}]
["18030010",false,"","Westella botryoides",null,0.442,0.442,null,"Westella botryoides",0.442,"genus","not in training data","genus optima derived few records",false,"","18030000","1803",{"$error":"#N/A"},{"$error":"#N/A"},"WESTELLA",0.442,1.99,4]
["24170000",true,1,"Gloeotila",null,0.26400000000000001,null,"Gloeotila",null,0.26400000000000001,"genus",null,null,false,"",null,"2417",0.26200000000000001,12.72,"Gloeotila",0.26400000000000001,11.87,34]
["24210000",false,1,"Microspora",null,null,null,null,null,null,"species","not in training data",null,false,"",null,"2421",{"$error":"#N/A"},{"$error":"#N/A"},"Microspora",{"$error":"#N/A"},{"$error":"#N/A"},1]
["24340000",false,1,"Stichococcus",null,0.36499999999999999,null,"Stichococcus",null,0.36499999999999999,"genus",null,null,false,"",null,"2434",0.36899999999999999,3.7,"Stichococcus",0.36499999999999999,3.55,4]
["24380000",false,1,"Ulothrix",null,0.30499999999999999,null,"Ulothrix",null,0.30499999999999999,"genus",null,null,false,"",null,"2438",0.30099999999999999,4.68,"Ulothrix",0.30499999999999999,4.62,18]
["25010000",true,1,"Elakatothrix",null,0.437,null,"Elakatothrix",null,0.437,"genus",null,null,false,"",null,"2501",0.215,11.23,"Elakatothrix",0.437,73.66,48]
["25010010",true,"","Elakatothrix gelatinosa",0.436,null,null,null,"Elakatothrix gelatinosa",0.436,"species",null,null,false,"",null,"2501",0.436,66.650000000000006,"Elakatothrix",0.437,73.66,285]
["25010020",true,"","Elakatothrix genevensis",0.34200000000000003,null,null,null,"Elakatothrix genevensis",0.34200000000000003,"species",null,null,false,"",null,"2501",0.34200000000000003,31.78,"Elakatothrix",0.437,73.66,76]
["25030000",true,1,"Koliella",null,0.439,null,"Koliella",null,0.439,"genus",null,null,false,"",null,"2503",0.64300000000000002,2.88,"Koliella",0.439,17.03,11]
["25030010",true,"","Koliella longiseta",0.53,null,null,null,"Koliella longiseta",0.53,"species",null,null,false,"",null,"2503",0.53,7.32,"Koliella",0.439,17.03,20]
["25030020",true,"","Koliella spiculiformis",0.27100000000000002,null,null,null,"Koliella spiculiformis",0.27100000000000002,"species",null,null,false,"",null,"2503",0.27100000000000002,12.64,"Koliella",0.439,17.03,40]
["27000000",false,1,"Desmidium",null,null,null,null,null,null,"species","not in training data",null,false,"",null,"2700",{"$error":"#N/A"},{"$error":"#N/A"},"Desmidium",{"$error":"#N/A"},{"$error":"#N/A"},2]
["27010070",false,"","Actinotaenium curcubita",0.63800000000000001,null,0.63800000000000001,null,"Actinotaenium curcubita",0.63800000000000001,"genus","too few records",null,false,"",null,"2701",0.63800000000000001,1,"ACTINOTAENIUM",0.63800000000000001,1,1]
["27030000",false,1,"BAMBUSINA",null,null,null,null,null,null,"species","not in training data",null,false,"",null,"2703",{"$error":"#N/A"},{"$error":"#N/A"},"BAMBUSINA",{"$error":"#N/A"},{"$error":"#N/A"},{"$error":"#N/A"}]
["27030010",false,"","Gymnozyga moniliformis",null,null,null,null,null,null,"species","not in training data",null,false,"","27030000","2703",{"$error":"#N/A"},{"$error":"#N/A"},"BAMBUSINA",{"$error":"#N/A"},{"$error":"#N/A"},1]
["27040000",true,1,"Closterium",null,0.59199999999999997,null,"Closterium",null,0.59199999999999997,"genus",null,null,false,"",null,"2704",0.56000000000000005,43.37,"Closterium",0.59199999999999997,80.08,171]
["27040030",true,"","Closterium aciculare",0.61299999999999999,null,null,null,"Closterium aciculare",0.61299999999999999,"species",null,null,false,"",null,"2704",0.61299999999999999,26.24,"Closterium",0.59199999999999997,80.08,99]
["27040040",true,"","Closterium acutum",0.59399999999999997,null,null,null,"Closterium acutum",0.59399999999999997,"species",null,null,false,"",null,"2704",0.59399999999999997,25.52,"Closterium",0.59199999999999997,80.08,79]
["27040044",true,"","Closterium acutum var. variabile",0.57899999999999996,null,null,null,"Closterium acutum var. variabile",0.57899999999999996,"species",null,null,false,"",null,"2704",0.57899999999999996,21.19,"Closterium",0.59199999999999997,80.08,91]
["27040190",false,"","Closterium dianae",null,null,0.59199999999999997,null,"Closterium dianae",0.59199999999999997,"genus","not in training data",null,false,"","27040000","2704",{"$error":"#N/A"},{"$error":"#N/A"},"Closterium",0.59199999999999997,80.08,2]
["27040195",false,"","Closterium dianae var. minus",null,null,0.59199999999999997,null,"Closterium dianae var. minus",0.59199999999999997,"genus","not in training data",null,false,"",null,"2704",{"$error":"#N/A"},{"$error":"#N/A"},"Closterium",0.59199999999999997,80.08,2]
["27040260",false,"","Closterium gracile",0.38200000000000001,null,null,null,"Closterium gracile",0.38200000000000001,"species",null,null,false,"",null,"2704",0.38200000000000001,7.18,"Closterium",0.59199999999999997,80.08,15]
["27040264",false,"","CLOSTERIUM GRACILE V. ELONGATUM",0.44800000000000001,null,0.59199999999999997,null,"closterium gracile v. elongatum",0.59199999999999997,"genus","too few records",null,false,"",null,"2704",0.44800000000000001,1,"Closterium",0.59199999999999997,80.08,1]
["27040320",false,"","Closterium jenneri",null,null,0.59199999999999997,null,"Closterium jenneri",0.59199999999999997,"genus","not in training data",null,false,"","27040000","2704",{"$error":"#N/A"},{"$error":"#N/A"},"Closterium",0.59199999999999997,80.08,2]
["27040340",true,"","Closterium kuetzingii",0.316,null,null,null,"Closterium kuetzingii",0.316,"species",null,null,false,"",null,"2704",0.316,17.71,"Closterium",0.59199999999999997,80.08,40]
["27040380",false,"","Closterium leibleinii",null,null,0.59199999999999997,null,"Closterium leibleinii",0.59199999999999997,"genus","not in training data",null,false,"","27040000","2704",{"$error":"#N/A"},{"$error":"#N/A"},"Closterium",0.59199999999999997,80.08,2]
["27040500",true,"","Closterium parvulum",0.499,null,null,null,"Closterium parvulum",0.499,"species",null,null,false,"",null,"2704",0.499,7.44,"Closterium",0.59199999999999997,80.08,20]
["27040550",false,"","CLOSTERIUM PRONUM",0.44800000000000001,null,0.59199999999999997,null,"closterium pronum",0.59199999999999997,"genus","too few records",null,false,"",null,"2704",0.44800000000000001,1,"Closterium",0.59199999999999997,80.08,1]
["27040610",false,"","Closterium setaceum",null,null,0.59199999999999997,null,"Closterium setaceum",0.59199999999999997,"genus","not in training data",null,false,"","27040000","2704",{"$error":"#N/A"},{"$error":"#N/A"},"Closterium",0.59199999999999997,80.08,3]
["27040760",false,"","Closterium venus",0.27,null,null,null,"Closterium venus",0.27,"species",null,null,false,"",null,"2704",0.27,4.7300000000000004,"Closterium",0.59199999999999997,80.08,8]
["27050000",true,1,"Cosmarium",null,0.45600000000000002,null,"Cosmarium",null,0.45600000000000002,"genus",null,null,false,"",null,"2705",0.45400000000000001,86.93,"Cosmarium",0.45600000000000002,85.69,351]
["27050010",false,"","COSMARIUM ABBREVIATUM",0.23,null,0.45600000000000002,null,"Cosmarium abbreviatum",0.45600000000000002,"genus","too few records",null,false,"",null,"2705",0.23,1,"Cosmarium",0.45600000000000002,85.69,1]
["27050160",false,"","Cosmarium bioculatum",0.24099999999999999,null,null,null,"Cosmarium bioculatum",0.24099999999999999,"species",null,null,false,"",null,"2705",0.24099999999999999,5.88,"Cosmarium",0.45600000000000002,85.69,11]
["27050240",false,"","Cosmarium botrytis",null,null,0.45600000000000002,null,"Cosmarium botrytis",0.45600000000000002,"genus","not in training data",null,false,"","27050000","2705",{"$error":"#N/A"},{"$error":"#N/A"},"Cosmarium",0.45600000000000002,85.69,6]
["27050270",false,"","Cosmarium cf. caelatum",null,null,0.45600000000000002,null,"Cosmarium cf. caelatum",0.45600000000000002,"genus","not in training data",null,false,"","27050000","2705",{"$error":"#N/A"},{"$error":"#N/A"},"Cosmarium",0.45600000000000002,85.69,1]
["27050380",false,"","Cosmarium contractum",0.25600000000000001,null,null,null,"Cosmarium contractum",0.25600000000000001,"species",null,null,false,"",null,"2705",0.25600000000000001,5.81,"Cosmarium",0.45600000000000002,85.69,15]
["27050383",false,"","COSMARIUM CONTRACTUM V. ELLIPSOIDEUM",0.24399999999999999,null,0.45600000000000002,null,"cosmarium contractum v. ellipsoideum",0.45600000000000002,"genus","too few records",null,false,"",null,"2705",0.24399999999999999,1,"Cosmarium",0.45600000000000002,85.69,1]
["27050480",false,"","Cosmarium cucumis",null,null,0.45600000000000002,null,"Cosmarium cucumis",0.45600000000000002,"genus","not in training data",null,false,"","27050000","2705",{"$error":"#N/A"},{"$error":"#N/A"},"Cosmarium",0.45600000000000002,85.69,2]
["27050750",false,"","Cosmarium formosulum",null,null,0.45600000000000002,null,"Cosmarium formosulum",0.45600000000000002,"genus","not in training data",null,false,"","27050000","2705",{"$error":"#N/A"},{"$error":"#N/A"},"Cosmarium",0.45600000000000002,85.69,4]
["27050830",false,"","Cosmarium cf. granatum",null,null,0.45600000000000002,null,"Cosmarium cf. granatum",0.45600000000000002,"genus","not in training data",null,false,"","27050000","2705",{"$error":"#N/A"},{"$error":"#N/A"},"Cosmarium",0.45600000000000002,85.69,1]
["27050900",false,"","Cosmarium humile",0.216,null,null,null,"Cosmarium humile",0.216,"species",null,null,false,"",null,"2705",0.216,4.95,"Cosmarium",0.45600000000000002,85.69,7]
["27050910",false,"","Cosmarium cf. impressulum",null,null,0.45600000000000002,null,"Cosmarium cf. impressulum",0.45600000000000002,"genus","not in training data",null,false,"","27050000","2705",{"$error":"#N/A"},{"$error":"#N/A"},"Cosmarium",0.45600000000000002,85.69,2]
["27051000",false,"","Cosmarium cf. laeve",null,null,0.45600000000000002,null,"Cosmarium cf. laeve",0.45600000000000002,"genus","not in training data",null,false,"","27050000","2705",{"$error":"#N/A"},{"$error":"#N/A"},"Cosmarium",0.45600000000000002,85.69,1]
["27051080",false,"","Cosmarium margaritiferum",0.224,null,null,null,"Cosmarium margaritiferum",0.224,"species",null,null,false,"",null,"2705",0.224,4.93,"Cosmarium",0.45600000000000002,85.69,9]
["27051100",false,"","Cosmarium cf. meneghinii",null,null,0.45600000000000002,null,"Cosmarium cf. meneghinii",0.45600000000000002,"genus","not in training data",null,false,"","27050000","2705",{"$error":"#N/A"},{"$error":"#N/A"},"Cosmarium",0.45600000000000002,85.69,1]
["27051330",false,"","Cosmarium ornatum",null,null,0.45600000000000002,null,"Cosmarium ornatum",0.45600000000000002,"genus","not in training data",null,false,"","27050000","2705",{"$error":"#N/A"},{"$error":"#N/A"},"Cosmarium",0.45600000000000002,85.69,2]
["27051420",false,"","Cosmarium phaseolus",0.33600000000000002,null,null,null,"Cosmarium phaseolus",0.33600000000000002,"species",null,null,false,"",null,"2705",0.33600000000000002,7.65,"Cosmarium",0.45600000000000002,85.69,18]
["27051480",false,"","Cosmarium praemorsum",null,null,0.45600000000000002,null,"Cosmarium praemorsum",0.45600000000000002,"genus","not in training data",null,false,"","27050000","2705",{"$error":"#N/A"},{"$error":"#N/A"},"Cosmarium",0.45600000000000002,85.69,1]
["27051650",true,"","Cosmarium punctulatum",0.38800000000000001,null,null,null,"Cosmarium punctulatum",0.38800000000000001,"species",null,null,false,"",null,"2705",0.38800000000000001,7.8,"Cosmarium",0.45600000000000002,85.69,14]
["27051680",false,"","COSMARIUM PYGMAEUM",0.23,null,0.45600000000000002,null,"cosmarium pygmaeum",0.45600000000000002,"genus","too few records",null,false,"",null,"2705",0.23,1,"Cosmarium",0.45600000000000002,85.69,1]
["27051690",false,"","Cosmarium pyramidatum",null,null,0.45600000000000002,null,"Cosmarium pyramidatum",0.45600000000000002,"genus","not in training data",null,false,"","27050000","2705",{"$error":"#N/A"},{"$error":"#N/A"},"Cosmarium",0.45600000000000002,85.69,1]
["27051830",false,"","COSMARIUM REGNELLII",0.23,null,0.45600000000000002,null,"cosmarium regnellii",0.45600000000000002,"genus","too few records",null,false,"",null,"2705",0.23,1,"Cosmarium",0.45600000000000002,85.69,1]
["27051840",false,"","Cosmarium cf. regnesii",null,null,0.45600000000000002,null,"Cosmarium cf. regnesii",0.45600000000000002,"genus","not in training data",null,false,"","27050000","2705",{"$error":"#N/A"},{"$error":"#N/A"},"Cosmarium",0.45600000000000002,85.69,1]
["27051860",false,"","Cosmarium reniforme",0.30099999999999999,null,null,null,"Cosmarium reniforme",0.30099999999999999,"species",null,null,false,"",null,"2705",0.30099999999999999,5.9,"Cosmarium",0.45600000000000002,85.69,8]
["27052120",true,"","Cosmarium subcrenatum",0.20499999999999999,null,null,null,"Cosmarium subcrenatum",0.20499999999999999,"species",null,null,false,"",null,"2705",0.20499999999999999,2.87,"Cosmarium",0.45600000000000002,85.69,9]
["27052350",false,"","Cosmarium cf. tenue",null,null,0.45600000000000002,null,"Cosmarium cf. tenue",0.45600000000000002,"genus","not in training data",null,false,"","27050000","2705",{"$error":"#N/A"},{"$error":"#N/A"},"Cosmarium",0.45600000000000002,85.69,1]
["27052500",false,"","Cosmarium turpinii",null,null,0.45600000000000002,null,"Cosmarium turpinii",0.45600000000000002,"genus","not in training data",null,false,"","27050000","2705",{"$error":"#N/A"},{"$error":"#N/A"},"Cosmarium",0.45600000000000002,85.69,2]
["27060000",false,1,"COSMOCLADIUM",null,0.33,null,"Cosmocladium",null,0.33,"genus",null,"genus optima derived few records",false,"",null,"2706",0.32600000000000001,1.48,"COSMOCLADIUM",0.33,1.28,{"$error":"#N/A"}]
["27060050",false,"","Cosmocladium saxonicum",null,0.33,0.33,null,"Cosmocladium saxonicum",0.33,"genus","not in training data","genus optima derived few records",false,"","27060000","2706",{"$error":"#N/A"},{"$error":"#N/A"},"COSMOCLADIUM",0.33,1.28,2]
["27070000",false,1,"Cylindrocystis",null,0.193,null,"Cylindrocystis",null,0.193,"genus",null,null,false,"",null,"2707",0.184,3.74,"Cylindrocystis",0.193,7.13,10]
["27070020",false,"","Cylindrocystis brebissonii",0.20200000000000001,null,null,null,"Cylindrocystis brebissonii",0.20200000000000001,"species",null,null,false,"",null,"2707",0.20200000000000001,3.75,"Cylindrocystis",0.193,7.13,9]
["27110000",true,1,"Euastrum",null,0.36699999999999999,null,"Euastrum",null,0.36699999999999999,"genus",null,null,false,"",null,"2711",0.36099999999999999,24.76,"Euastrum",0.36699999999999999,24.13,66]
["27110030",false,"","Euastrum ansatum",null,null,0.36699999999999999,null,"Euastrum ansatum",0.36699999999999999,"genus","not in training data",null,false,"","27110000","2711",{"$error":"#N/A"},{"$error":"#N/A"},"Euastrum",0.36699999999999999,24.13,3]
["27110050",false,"","Euastrum binale",null,null,0.36699999999999999,null,"Euastrum binale",0.36699999999999999,"genus","not in training data",null,false,"","27110000","2711",{"$error":"#N/A"},{"$error":"#N/A"},"Euastrum",0.36699999999999999,24.13,3]
["27110140",false,"","Euastrum denticulatum",null,null,0.36699999999999999,null,"Euastrum denticulatum",0.36699999999999999,"genus","not in training data",null,false,"","27110000","2711",{"$error":"#N/A"},{"$error":"#N/A"},"Euastrum",0.36699999999999999,24.13,2]
["27110150",false,"","Euastrum didelta",null,null,0.36699999999999999,null,"Euastrum didelta",0.36699999999999999,"genus","not in training data",null,false,"","27110000","2711",{"$error":"#N/A"},{"$error":"#N/A"},"Euastrum",0.36699999999999999,24.13,1]
["27110180",false,"","Euastrum elegans",null,null,0.36699999999999999,null,"Euastrum elegans",0.36699999999999999,"genus","not in training data",null,false,"","27110000","2711",{"$error":"#N/A"},{"$error":"#N/A"},"Euastrum",0.36699999999999999,24.13,7]
["27110270",false,"","Euastrum insulare",null,null,0.36699999999999999,null,"Euastrum insulare",0.36699999999999999,"genus","not in training data",null,false,"","27110000","2711",{"$error":"#N/A"},{"$error":"#N/A"},"Euastrum",0.36699999999999999,24.13,5]
["27110390",false,"","Euastrum pulchellum",null,null,0.36699999999999999,null,"Euastrum pulchellum",0.36699999999999999,"genus","not in training data",null,false,"","27110000","2711",{"$error":"#N/A"},{"$error":"#N/A"},"Euastrum",0.36699999999999999,24.13,2]
["27110450",false,"","Euastrum verrucosum",null,null,0.36699999999999999,null,"Euastrum verrucosum",0.36699999999999999,"genus","not in training data",null,false,"","27110000","2711",{"$error":"#N/A"},{"$error":"#N/A"},"Euastrum",0.36699999999999999,24.13,2]
["27120000",false,1,"GENICULARIA",null,0.23200000000000001,null,"Genicularia",null,0.23200000000000001,"genus",null,"genus optima derived few records",false,"",null,"2712",0.23200000000000001,1,"GENICULARIA",0.23200000000000001,1,{"$error":"#N/A"}]
["27120010",false,"","Genicularia elegans",null,0.23200000000000001,0.23200000000000001,null,"Genicularia elegans",0.23200000000000001,"genus","not in training data","genus optima derived few records",false,"","27120000","2712",{"$error":"#N/A"},{"$error":"#N/A"},"GENICULARIA",0.23200000000000001,1,3]
["27130000",true,1,"Gonatozygon",null,0.20300000000000001,null,"Gonatozygon",null,0.20300000000000001,"genus",null,null,false,"",null,"2713",0.19600000000000001,9.25,"Gonatozygon",0.20300000000000001,8.64,5]
["27130020",false,"","Gonatozygon brebissonii",null,null,0.20300000000000001,null,"Gonatozygon brebissonii",0.20300000000000001,"genus","not in training data",null,false,"","27130000","2713",{"$error":"#N/A"},{"$error":"#N/A"},"Gonatozygon",0.20300000000000001,8.64,5]
["27130030",false,"","Gonatozygon kinahanii",null,null,0.20300000000000001,null,"Gonatozygon kinahanii",0.20300000000000001,"genus","not in training data",null,false,"","27130000","2713",{"$error":"#N/A"},{"$error":"#N/A"},"Gonatozygon",0.20300000000000001,8.64,5]
["27130040",false,"","Gonatozygon monotaenium",null,null,0.20300000000000001,null,"Gonatozygon monotaenium",0.20300000000000001,"genus","not in training data",null,false,"","27130000","2713",{"$error":"#N/A"},{"$error":"#N/A"},"Gonatozygon",0.20300000000000001,8.64,4]
["27140000",false,1,"Groenbladia",null,null,null,null,null,null,"species","not in training data",null,false,"",null,"2714",{"$error":"#N/A"},{"$error":"#N/A"},"Groenbladia",{"$error":"#N/A"},{"$error":"#N/A"},3]
["27140020",true,"","Groenbladia undulata",null,null,null,null,null,null,"species","not in training data",null,false,"",null,"2714",{"$error":"#N/A"},{"$error":"#N/A"},"Groenbladia",{"$error":"#N/A"},{"$error":"#N/A"},2]
["27180000",false,1,"Hyalotheca",null,0.23,null,"Hyalotheca",null,0.23,"genus","not in training data","genus optima derived few records",false,"",null,"2718",{"$error":"#N/A"},{"$error":"#N/A"},"Hyalotheca",0.23,1,1]
["27180020",false,"","Hyalotheca mucosa",0.23,null,0.23,null,"Hyalotheca mucosa",0.23,"genus","too few records",null,false,"",null,"2718",0.23,1,"Hyalotheca",0.23,1,2]
["27200000",true,1,"Micrasterias",null,null,null,null,null,null,"species","not in training data",null,false,"",null,"2720",{"$error":"#N/A"},{"$error":"#N/A"},"Micrasterias",{"$error":"#N/A"},{"$error":"#N/A"},4]
["27230000",false,1,"Netrium",null,0.19,null,"Netrium",null,0.19,"genus",null,null,false,"",null,"2723",0.191,3.94,"Netrium",0.19,3.91,5]
["27230010",false,"","Netrium digitus",null,null,0.19,null,"Netrium digitus",0.19,"genus","not in training data",null,false,"","27230000","2723",{"$error":"#N/A"},{"$error":"#N/A"},"Netrium",0.19,3.91,1]
["27230040",false,"","Netrium oblongum",null,null,0.19,null,"Netrium oblongum",0.19,"genus","not in training data",null,false,"","27230000","2723",{"$error":"#N/A"},{"$error":"#N/A"},"Netrium",0.19,3.91,1]
["27240010",false,"","Onychonema filiforme",0.33700000000000002,null,0.33700000000000002,null,"Onychonema filiforme",0.33700000000000002,"genus","too few records",null,false,"",null,"2724",0.33700000000000002,1,"ONYCHONEMA",0.33700000000000002,1,1]
["27260060",false,"","Penium sp.",0.13,null,0.13600000000000001,null,"Penium sp.",0.13600000000000001,"genus","too few records",null,false,"",null,"2726",0.13,1.98,"PENIUM",0.13600000000000001,1.95,2]
["27280000",false,1,"PLEUROTAENIUM",null,0.183,null,"Pleurotaenium",null,0.183,"genus",null,null,false,"",null,"2728",0.17899999999999999,4.63,"PLEUROTAENIUM",0.183,4.47,1]
["27280020",false,"","Pleurotaenium ehrenbergii",null,null,0.183,null,"Pleurotaenium ehrenbergii",0.183,"genus","not in training data",null,false,"","27280000","2728",{"$error":"#N/A"},{"$error":"#N/A"},"PLEUROTAENIUM",0.183,4.47,6]
["27340000",false,1,"Spirogyra",null,null,null,null,null,null,"species","not in training data",null,false,"",null,"2734",{"$error":"#N/A"},{"$error":"#N/A"},"Spirogyra",{"$error":"#N/A"},{"$error":"#N/A"},1]
["27360040",true,"","Spondylosium planum",0.33900000000000002,null,null,null,"Spondylosium planum",0.33900000000000002,"species",null,null,false,"",null,"2736",0.33900000000000002,41.06,"SPONDYLOSIUM",0.34399999999999997,39.950000000000003,158]
["27370000",true,1,"Staurastrum",null,0.45800000000000002,null,"Staurastrum",null,0.45800000000000002,"genus",null,null,false,"",null,"2738",0.45100000000000001,79.33,"Staurastrum",0.45800000000000002,84.15,384]
["27380000",true,1,"Staurastrum",null,0.45800000000000002,null,"Staurastrum",null,0.45800000000000002,"genus",null,null,false,"",null,"2738",0.45100000000000001,79.33,"Staurastrum",0.45800000000000002,84.15,384]
["27380060",true,"","Staurastrum anatinum",null,null,0.45800000000000002,null,"Staurastrum anatinum",0.45800000000000002,"genus","not in training data",null,false,"","27380000","2738",{"$error":"#N/A"},{"$error":"#N/A"},"Staurastrum",0.45800000000000002,84.15,53]
["27380068",false,"","Staurastrum anatinum v. longibrachiatum",0.154,null,0.45800000000000002,null,"Staurastrum anatinum v. longibrachiatum",0.45800000000000002,"genus","too few records",null,false,"",null,"2738",0.154,1,"Staurastrum",0.45800000000000002,84.15,2]
["27380090",false,"","Staurastrum arctiscon",null,null,0.45800000000000002,null,"Staurastrum arctiscon",0.45800000000000002,"genus","not in training data",null,false,"","27380000","2738",{"$error":"#N/A"},{"$error":"#N/A"},"Staurastrum",0.45800000000000002,84.15,1]
["27380130",false,"","Staurastrum avicula",null,null,0.45800000000000002,null,"Staurastrum avicula",0.45800000000000002,"genus","not in training data",null,false,"","27380000","2738",{"$error":"#N/A"},{"$error":"#N/A"},"Staurastrum",0.45800000000000002,84.15,9]
["27380262",false,"","STAURASTRUM BRASILIENSE V. LUNDELLII",0,null,0.45800000000000002,null,"Staurastrum brasiliense v. lundellii",0.45800000000000002,"genus","too few records",null,false,"",null,"2738",0,1,"Staurastrum",0.45800000000000002,84.15,1]
["27380270",false,"","Staurastrum brebissonii",null,null,0.45800000000000002,null,"Staurastrum brebissonii",0.45800000000000002,"genus","not in training data",null,false,"","27380000","2738",{"$error":"#N/A"},{"$error":"#N/A"},"Staurastrum",0.45800000000000002,84.15,1]
["27380310",false,"","staurastrum cf chaetoceras",null,null,0.45800000000000002,null,"Staurastrum cf chaetoceras",0.45800000000000002,"genus","not in training data",null,false,"","27380000","2738",{"$error":"#N/A"},{"$error":"#N/A"},"Staurastrum",0.45800000000000002,84.15,3]
["27380330",true,"","Staurastrum cingulum",0.45100000000000001,null,null,null,"Staurastrum cingulum",0.45100000000000001,"species",null,null,false,"",null,"2738",0.45100000000000001,37.590000000000003,"Staurastrum",0.45800000000000002,84.15,127]
["27380332",false,"","Staurastrum cingulum var obesum",null,null,0.45100000000000001,null,"Staurastrum cingulum var obesum",0.45100000000000001,"genus","not in training data",null,false,"","27380330","2738",{"$error":"#N/A"},{"$error":"#N/A"},"Staurastrum",0.45800000000000002,84.15,11]
["27380390",false,"","Staurastrum crenulatum",null,null,0.45800000000000002,null,"Staurastrum crenulatum",0.45800000000000002,"genus","not in training data",null,false,"","27380000","2738",{"$error":"#N/A"},{"$error":"#N/A"},"Staurastrum",0.45800000000000002,84.15,1]
["27380570",false,"","Staurastrum erasum",null,null,0.45800000000000002,null,"Staurastrum erasum",0.45800000000000002,"genus","not in training data",null,false,"","27380000","2738",{"$error":"#N/A"},{"$error":"#N/A"},"Staurastrum",0.45800000000000002,84.15,3]
["27380620",false,"","Staurastrum furcigerum",null,null,0.45800000000000002,null,"Staurastrum furcigerum",0.45800000000000002,"genus","not in training data",null,false,"","27380000","2738",{"$error":"#N/A"},{"$error":"#N/A"},"Staurastrum",0.45800000000000002,84.15,2]
["27380650",false,"","Staurastrum gracile",null,null,0.45800000000000002,null,"Staurastrum gracile",0.45800000000000002,"genus","not in training data",null,false,"","27380000","2738",{"$error":"#N/A"},{"$error":"#N/A"},"Staurastrum",0.45800000000000002,84.15,1]
["27380710",false,"","Staurastrum cf. hirsutum",null,null,0.45800000000000002,null,"Staurastrum cf. hirsutum",0.45800000000000002,"genus","not in training data",null,false,"","27380000","2738",{"$error":"#N/A"},{"$error":"#N/A"},"Staurastrum",0.45800000000000002,84.15,1]
["27380780",false,"","STAURASTRUM JOHNSSONII",null,null,0.45800000000000002,null,"staurastrum johnssonii",0.45800000000000002,"genus","not in training data",null,false,"",null,"2738",{"$error":"#N/A"},{"$error":"#N/A"},"Staurastrum",0.45800000000000002,84.15,1]
["27380840",true,"","Staurastrum longipes",0.38800000000000001,null,null,null,"Staurastrum longipes",0.38800000000000001,"species",null,null,false,"",null,"2738",0.38800000000000001,2.4700000000000002,"Staurastrum",0.45800000000000002,84.15,9]
["27380860",true,"","Staurastrum lunatum",0.33800000000000002,null,null,null,"Staurastrum lunatum",0.33800000000000002,"species",null,null,false,"",null,"2738",0.33800000000000002,24.25,"Staurastrum",0.45800000000000002,84.15,66]
["27380862",false,"","STAURASTRUM LUNATUM V. PLANCTONICUM",0.245,null,0.45800000000000002,null,"staurastrum lunatum v. planctonicum",0.45800000000000002,"genus","too few records",null,false,"",null,"2738",0.245,1,"Staurastrum",0.45800000000000002,84.15,1]
["27380880",false,"","Staurastrum cf. manfeldii",null,null,0.45800000000000002,null,"Staurastrum cf. manfeldii",0.45800000000000002,"genus","not in training data",null,false,"","27380000","2738",{"$error":"#N/A"},{"$error":"#N/A"},"Staurastrum",0.45800000000000002,84.15,1]
["27380950",false,"","Staurastrum muticum",null,null,0.45800000000000002,null,"Staurastrum muticum",0.45800000000000002,"genus","not in training data",null,false,"","27380000","2738",{"$error":"#N/A"},{"$error":"#N/A"},"Staurastrum",0.45800000000000002,84.15,4]
["27381000",false,"","Staurastrum ophiura",0.27100000000000002,null,0.45800000000000002,null,"Staurastrum ophiura",0.45800000000000002,"genus","too few records",null,false,"",null,"2738",0.27100000000000002,1.9,"Staurastrum",0.45800000000000002,84.15,2]
["27381030",true,"","Staurastrum paradoxum",0.41199999999999998,null,null,null,"Staurastrum paradoxum",0.41199999999999998,"species",null,null,false,"",null,"2738",0.41199999999999998,4.5,"Staurastrum",0.45800000000000002,84.15,8]
["27381031",false,"","STAURASTRUM PARADOXUM V. PARVUM",0,null,0.45800000000000002,null,"Staurastrum paradoxum v. parvum",0.45800000000000002,"genus","too few records",null,false,"",null,"2738",0,1,"Staurastrum",0.45800000000000002,84.15,1]
["27381110",true,"","Staurastrum pingue",0.309,null,null,null,"Staurastrum pingue",0.309,"species",null,null,false,"",null,"2738",0.309,10.3,"Staurastrum",0.45800000000000002,84.15,20]
["27381120",true,"","Staurastrum planctonicum",0.27,null,null,null,"Staurastrum planctonicum",0.27,"species",null,null,false,"",null,"2738",0.27,15.05,"Staurastrum",0.45800000000000002,84.15,36]
["27381130",false,"","Staurastrum polymorphum",null,null,0.45800000000000002,null,"Staurastrum polymorphum",0.45800000000000002,"genus","not in training data",null,false,"","27380000","2738",{"$error":"#N/A"},{"$error":"#N/A"},"Staurastrum",0.45800000000000002,84.15,4]
["27381160",true,"","Stauratsrum pseudopelagicum",0.249,null,null,null,"Stauratsrum pseudopelagicum",0.249,"species",null,null,false,"",null,"2738",0.249,8.52,"Staurastrum",0.45800000000000002,84.15,30]
["27381190",false,"","Staurastrum punctulatum",0.158,null,null,null,"Staurastrum punctulatum",0.158,"species",null,null,false,"",null,"2738",0.158,3.95,"Staurastrum",0.45800000000000002,84.15,8]
["27381320",false,"","Staurastrum cf. setigerum",null,null,0.45800000000000002,null,"Staurastrum cf. setigerum",0.45800000000000002,"genus","not in training data",null,false,"","27380000","2738",{"$error":"#N/A"},{"$error":"#N/A"},"Staurastrum",0.45800000000000002,84.15,1]
["27381400",false,"","Staurastrum subcruciatum",null,null,0.45800000000000002,null,"Staurastrum subcruciatum",0.45800000000000002,"genus","not in training data",null,false,"","27380000","2738",{"$error":"#N/A"},{"$error":"#N/A"},"Staurastrum",0.45800000000000002,84.15,4]
["27381450",false,"","Staurastrum cf. teliferum",null,null,0.45800000000000002,null,"Staurastrum cf. teliferum",0.45800000000000002,"genus","not in training data",null,false,"","27380000","2738",{"$error":"#N/A"},{"$error":"#N/A"},"Staurastrum",0.45800000000000002,84.15,3]
["27381460",true,"","Staurastrum tetracerum",null,null,0.45800000000000002,null,"Staurastrum tetracerum",0.45800000000000002,"genus","not in training data",null,false,"","27380000","2738",{"$error":"#N/A"},{"$error":"#N/A"},"Staurastrum",0.45800000000000002,84.15,13]
["27381554",false,"","STAURASTRUM ANATINUM F. VESTITUM",9.5000000000000001E-2,null,null,null,"Staurastrum anatinum f. vestitum",9.5000000000000001E-2,"species",null,null,false,"",null,"2738",9.5000000000000001E-2,2.96,"Staurastrum",0.45800000000000002,84.15,8]
["27381555",false,"","STAURASTRUM ANATINUM  V. DENTICULATUM",6.0000000000000001E-3,null,0.45800000000000002,null,"Staurastrum anatinum  v. denticulatum",0.45800000000000002,"genus","too few records",null,false,"",null,"2738",6.0000000000000001E-3,1,"Staurastrum",0.45800000000000002,84.15,2]
["27381562",false,"","Staurastrum armigerum f. furcigerum",null,null,0.45800000000000002,null,"Staurastrum armigerum f. furcigerum",0.45800000000000002,"genus","not in training data",null,false,"","27380000","2738",{"$error":"#N/A"},{"$error":"#N/A"},"Staurastrum",0.45800000000000002,84.15,3]
["27390000",true,1,"Staurodesmus",null,0.251,null,"Staurodesmus",null,0.251,"genus",null,null,false,"",null,"2739",0.253,33.11,"Staurodesmus",0.251,37.15,183]
["27390030",false,"","STAURODESMUS AVERSUS",0.26500000000000001,null,null,null,"Staurodesmus aversus",0.26500000000000001,"species",null,null,false,"",null,"2739",0.26500000000000001,2.87,"Staurodesmus",0.251,37.15,6]
["27390130",true,"","Staurodesmus cuspidatus",0.255,null,null,null,"Staurodesmus cuspidatus",0.255,"species",null,null,false,"",null,"2739",0.255,14.45,"Staurodesmus",0.251,37.15,33]
["27390140",false,"","Staurodesmus dejectus",0.27900000000000003,null,null,null,"Staurodesmus dejectus",0.27900000000000003,"species",null,null,false,"",null,"2739",0.27900000000000003,7.45,"Staurodesmus",0.251,37.15,13]
["27390142",false,"","STAURODESMUS DEJECTUS V. APICULATUS",0.14299999999999999,null,0.251,null,"Staurodesmus dejectus v. apiculatus",0.251,"genus","too few records",null,false,"",null,"2739",0.14299999999999999,1.94,"Staurodesmus",0.251,37.15,4]
["27390160",false,"","Staurodesmus extensus",null,null,0.251,null,"Staurodesmus extensus",0.251,"genus","not in training data",null,false,"","27390000","2739",{"$error":"#N/A"},{"$error":"#N/A"},"Staurodesmus",0.251,37.15,3]
["27390170",false,"","Staurodesmus glaber",null,null,0.251,null,"Staurodesmus glaber",0.251,"genus","not in training data",null,false,"","27390000","2739",{"$error":"#N/A"},{"$error":"#N/A"},"Staurodesmus",0.251,37.15,4]
["27390190",false,"","Staurodesmus incus",0.17799999999999999,null,null,null,"Staurodesmus incus",0.17799999999999999,"species",null,null,false,"",null,"2739",0.17799999999999999,4.8600000000000003,"Staurodesmus",0.251,37.15,13]
["27390250",false,"","STAURODESMUS MAMILLATUS",0.23,null,0.251,null,"Staurodesmus mamillatus",0.251,"genus","too few records",null,false,"",null,"2739",0.23,1,"Staurodesmus",0.251,37.15,1]
["27390260",false,"","Staurodesmus megacanthus",0.19400000000000001,null,0.251,null,"Staurodesmus megacanthus",0.251,"genus","too few records",null,false,"",null,"2739",0.19400000000000001,2,"Staurodesmus",0.251,37.15,7]
["27390290",false,"","staurodesmus indentatus",0.17,null,null,null,"Staurodesmus indentatus",0.17,"species",null,null,false,"",null,"2739",0.17,3.79,"Staurodesmus",0.251,37.15,10]
["27390370",false,"","STAURODESMUS SELLATUS",6.0000000000000001E-3,null,0.251,null,"Staurodesmus sellatus",0.251,"genus","too few records",null,false,"",null,"2739",6.0000000000000001E-3,1,"Staurodesmus",0.251,37.15,3]
["27390400",false,"","STAURODESMUS SPETSBERGENSIS",0.23,null,0.251,null,"Staurodesmus spetsbergensis",0.251,"genus","too few records",null,false,"",null,"2739",0.23,1,"Staurodesmus",0.251,37.15,1]
["27390420",false,"","STAURODESMUS SUBTRIANGULARIS",9.8000000000000004E-2,null,null,null,"Staurodesmus subtriangularis",9.8000000000000004E-2,"species",null,null,false,"",null,"2739",9.8000000000000004E-2,3.78,"Staurodesmus",0.251,37.15,9]
["27390440",true,"","Staurodesmus triangularis",0.16900000000000001,null,null,null,"Staurodesmus triangularis",0.16900000000000001,"species",null,null,false,"",null,"2739",0.16900000000000001,13.29,"Staurodesmus",0.251,37.15,47]
["27400000",false,1,"Teilingia",null,0.27100000000000002,null,"Teilingia",null,0.27100000000000002,"genus",null,null,false,"",null,"2740",0.33800000000000002,2.98,"Teilingia",0.27100000000000002,8.57,3]
["27400020",false,"","Teilingia granulata",0.248,null,null,null,"Teilingia granulata",0.248,"species",null,null,false,"",null,"2740",0.248,8.24,"Teilingia",0.27100000000000002,8.57,15]
["27420000",false,1,"TETMEMORUS",null,0.188,null,"Tetmemorus",null,0.188,"genus",null,null,false,"",null,"2742",0.19900000000000001,2,"TETMEMORUS",0.188,3.91,{"$error":"#N/A"}]
["27420010",false,"","Tetmemorus brebissonii",null,null,0.188,null,"Tetmemorus brebissonii",0.188,"genus","not in training data",null,false,"","27420000","2742",{"$error":"#N/A"},{"$error":"#N/A"},"TETMEMORUS",0.188,3.91,1]
["27420020",false,"","Tetmemorus granulatus",null,null,0.188,null,"Tetmemorus granulatus",0.188,"genus","not in training data",null,false,"","27420000","2742",{"$error":"#N/A"},{"$error":"#N/A"},"TETMEMORUS",0.188,3.91,2]
["27420030",false,"","Tetmemorus laevis",0.17499999999999999,null,0.188,null,"Tetmemorus laevis",0.188,"genus","too few records",null,false,"",null,"2742",0.17499999999999999,1.99,"TETMEMORUS",0.188,3.91,3]
["27430000",true,1,"Xanthidium",null,0.34,null,"Xanthidium",null,0.34,"genus",null,null,false,"",null,"2743",0.34399999999999997,15.79,"Xanthidium",0.34,29.07,48]
["27430020",true,"","Xanthidium antilopaeum",0.30199999999999999,null,null,null,"Xanthidium antilopaeum",0.30199999999999999,"species",null,null,false,"",null,"2743",0.30199999999999999,20.27,"Xanthidium",0.34,29.07,56]
["27430110",false,"","Xanthidium octocorne",null,null,0.34,null,"Xanthidium octocorne",0.34,"genus","not in training data",null,false,"","27430000","2743",{"$error":"#N/A"},{"$error":"#N/A"},"Xanthidium",0.34,29.07,2]
["27430150",false,"","XANTHIDIUM SUBHASTIFERUM",0.33100000000000002,null,0.34,null,"Xanthidium subhastiferum",0.34,"genus","too few records",null,false,"",null,"2743",0.33100000000000002,1,"Xanthidium",0.34,29.07,1]
["27440000",false,1,"Zygnema",null,0.20200000000000001,null,"Zygnema",null,0.20200000000000001,"genus",null,null,false,"",null,"2744",0.19400000000000001,2.72,"Zygnema",0.20200000000000001,2.54,5]
["27830000",false,1,"Staurastrum",null,0.45800000000000002,null,null,null,null,null,"not in training data",null,false,"",null,"2738",{"$error":"#N/A"},{"$error":"#N/A"},"Staurastrum",0.45800000000000002,84.15,{"$error":"#N/A"}]
["90000000",true,1,"Picoplankton - unidentified single cells <2 µm diam.",null,0.53900000000000003,null,"Picoplankton - unidentified single cells <2 µm diam.",null,0.53900000000000003,"genus",null,null,false,"",null,"9000",0.56399999999999995,120.48,"Picoplankton - unidentified single cells <2 µm diam.",0.53900000000000003,127.78,844]
["90000003",true,"","Nanoplankton - unidentified single cells 2-20 µm diameter",0.53200000000000003,null,null,"Nanoplankton - unidentified single cells 2-20 µm diameter",null,0.53200000000000003,"group",null,null,false,"",null,"9000",0.53200000000000003,119.39,"Picoplankton - unidentified single cells <2 µm diam.",0.53900000000000003,127.78,833]
["90000004",true,"","Unidentified cells >20 µm diam.",0.6,null,null,"Unidentified cells >20 µm diam.",null,0.6,"group",null,null,false,"",null,"9000",0.6,19.8,"Picoplankton - unidentified single cells <2 µm diam.",0.53900000000000003,127.78,40]
["90000005",true,"","Nanoplankton - unidentified flagellates 2-20 µm diameter",0.51900000000000002,null,null,"Nanoplankton - unidentified flagellates 2-20 µm diameter",null,0.51900000000000002,"group",null,null,false,"",null,"9000",0.51900000000000002,112.57,"Picoplankton - unidentified single cells <2 µm diam.",0.53900000000000003,127.78,854]
["01310010",false,"","Gloeotrichia echinulata",null,null,null,null,null,null,null,null,null,true,"Not planktonic",null,"0131",{"$error":"#N/A"},{"$error":"#N/A"},"Gloeotrichia",0.60199999999999998,3.96,{"$error":"#N/A"}]
["05080000",false,1,"Katablepharis ovalis",null,null,null,null,null,null,null,null,null,true,"Heterotroph",null,"0508",{"$error":"#N/A"},{"$error":"#N/A"},"Katablepharis ovalis",{"$error":"#N/A"},{"$error":"#N/A"},{"$error":"#N/A"}]
["13010000",false,1,"Achnanthes",null,null,null,null,null,null,null,null,null,true,"Benthic",null,"1301",{"$error":"#N/A"},{"$error":"#N/A"},"Achnanthes",{"$error":"#N/A"},{"$error":"#N/A"},{"$error":"#N/A"}]
["13020080",false,"","Achnanthes minutissima",null,null,null,null,null,null,null,null,null,true,"Benthic",null,"1302",{"$error":"#N/A"},{"$error":"#N/A"},"Achnanthidium",{"$error":"#N/A"},{"$error":"#N/A"},{"$error":"#N/A"}]
["13160000",false,1,"Cocconeis",null,null,null,null,null,null,null,null,null,true,"Benthic",null,"1316",{"$error":"#N/A"},{"$error":"#N/A"},"Cocconeis",{"$error":"#N/A"},{"$error":"#N/A"},{"$error":"#N/A"}]
["13160100",false,"","Cocconeis placentula",null,null,null,null,null,null,null,null,null,true,"Benthic",null,"1316",{"$error":"#N/A"},{"$error":"#N/A"},"Cocconeis",{"$error":"#N/A"},{"$error":"#N/A"},{"$error":"#N/A"}]
["13220000",false,1,"Cymbella",null,null,null,null,null,null,null,null,null,true,"Benthic",null,"1322",{"$error":"#N/A"},{"$error":"#N/A"},"Cymbella",{"$error":"#N/A"},{"$error":"#N/A"},{"$error":"#N/A"}]
["13350000",false,1,"Eunotia",null,null,null,null,null,null,null,null,null,true,"Benthic",null,"1335",{"$error":"#N/A"},{"$error":"#N/A"},"Eunotia",{"$error":"#N/A"},{"$error":"#N/A"},{"$error":"#N/A"}]
["13390000",false,1,"Frustulia",null,null,null,null,null,null,null,null,null,true,"Benthic",null,"1339",{"$error":"#N/A"},{"$error":"#N/A"},"Frustulia",{"$error":"#N/A"},{"$error":"#N/A"},{"$error":"#N/A"}]
["13390030",false,"","Frustulia rhomboides",null,null,null,null,null,null,null,null,null,true,"Benthic",null,"1339",{"$error":"#N/A"},{"$error":"#N/A"},"Frustulia",{"$error":"#N/A"},{"$error":"#N/A"},{"$error":"#N/A"}]
["13410000",false,1,"Gomphonema",null,null,null,null,null,null,null,null,null,true,"Benthic",null,"1341",{"$error":"#N/A"},{"$error":"#N/A"},"Gomphonema",{"$error":"#N/A"},{"$error":"#N/A"},{"$error":"#N/A"}]
["13541500",false,"","Nitzschia vermicularis",null,null,null,null,null,null,null,null,null,true,"Benthic",null,"1354",{"$error":"#N/A"},{"$error":"#N/A"},"Nitzschia",0.628,69.81,{"$error":"#N/A"}]
["13590000",false,1,"Pinnularia",null,null,null,null,null,null,null,null,null,true,"Benthic",null,"1359",{"$error":"#N/A"},{"$error":"#N/A"},"Pinnularia",{"$error":"#N/A"},{"$error":"#N/A"},{"$error":"#N/A"}]
["13800000",false,1,"Surirella",null,null,null,null,null,null,null,null,null,true,"Benthic",null,"1380",{"$error":"#N/A"},{"$error":"#N/A"},"Surirella",0.70799999999999996,1,{"$error":"#N/A"}]
["27110040",false,"","Euastrum bidentatum",null,null,null,null,null,null,null,null,null,true,"Benthic",null,"2711",{"$error":"#N/A"},{"$error":"#N/A"},"Euastrum",0.36699999999999999,24.13,{"$error":"#N/A"}]
["27210000",false,1,"Mougeotia",null,null,null,null,null,null,null,null,null,true,"Benthic",null,"2721",{"$error":"#N/A"},{"$error":"#N/A"},"Mougeotia",{"$error":"#N/A"},{"$error":"#N/A"},{"$error":"#N/A"}]
["90000006",false,"","GYROMITUS CORDIFORMIS",null,null,null,null,null,null,null,null,null,true,"Heterotroph",null,"9000",{"$error":"#N/A"},{"$error":"#N/A"},"\"Picoplankton\" - unidentified single cells <2 µm diam.",0.53900000000000003,127.78,{"$error":"#N/A"}]
["90000006",false,"","BORZIA ENDOPHYTICA",null,null,null,null,null,null,null,null,null,true,"Heterotroph",null,"9000",{"$error":"#N/A"},{"$error":"#N/A"},"\"Picoplankton\" - unidentified single cells <2 µm diam.",0.53900000000000003,127.78,{"$error":"#N/A"}]
["90000006",false,"","Prorocentrum minimum",null,null,null,null,null,null,null,null,null,true,"No confirmed ID",null,"9000",{"$error":"#N/A"},{"$error":"#N/A"},"\"Picoplankton\" - unidentified single cells <2 µm diam.",0.53900000000000003,127.78,{"$error":"#N/A"}]
["90000006",false,"","Bicosoeca",null,null,null,null,null,null,null,null,null,true,"Heterotroph",null,"9000",{"$error":"#N/A"},{"$error":"#N/A"},"\"Picoplankton\" - unidentified single cells <2 µm diam.",0.53900000000000003,127.78,{"$error":"#N/A"}]
["90000006",false,"","Bicosoeca ainikkiae",null,null,null,null,null,null,null,null,null,true,"Heterotroph",null,"9000",{"$error":"#N/A"},{"$error":"#N/A"},"\"Picoplankton\" - unidentified single cells <2 µm diam.",0.53900000000000003,127.78,{"$error":"#N/A"}]
["90000006",false,"","Bicosoeca lacustris",null,null,null,null,null,null,null,null,null,true,"Heterotroph",null,"9000",{"$error":"#N/A"},{"$error":"#N/A"},"\"Picoplankton\" - unidentified single cells <2 µm diam.",0.53900000000000003,127.78,{"$error":"#N/A"}]
["90000006",false,"","EUPODISCALES",null,null,null,null,null,null,null,null,null,true,"Heterotroph",null,"9000",{"$error":"#N/A"},{"$error":"#N/A"},"\"Picoplankton\" - unidentified single cells <2 µm diam.",0.53900000000000003,127.78,{"$error":"#N/A"}]
["90000006",false,"","cf. Chrysidiastrum catenatum",null,null,null,null,null,null,null,null,null,true,"No confirmed ID",null,"9000",{"$error":"#N/A"},{"$error":"#N/A"},"\"Picoplankton\" - unidentified single cells <2 µm diam.",0.53900000000000003,127.78,{"$error":"#N/A"}]
["90000006",false,"","Characiopsis",null,null,null,null,null,null,null,null,null,true,"Heterotroph",null,"9000",{"$error":"#N/A"},{"$error":"#N/A"},"\"Picoplankton\" - unidentified single cells <2 µm diam.",0.53900000000000003,127.78,{"$error":"#N/A"}]
["90000006",false,"","PLANKTOCOCCUS SPHAEROCYSTIFORMIS",null,null,null,null,null,null,null,null,null,true,"Heterotroph",null,"9000",{"$error":"#N/A"},{"$error":"#N/A"},"\"Picoplankton\" - unidentified single cells <2 µm diam.",0.53900000000000003,127.78,{"$error":"#N/A"}]
["90000006",false,"","cf. Choricystis minor",null,null,null,null,null,null,null,null,null,true,"No confirmed ID",null,"9000",{"$error":"#N/A"},{"$error":"#N/A"},"\"Picoplankton\" - unidentified single cells <2 µm diam.",0.53900000000000003,127.78,{"$error":"#N/A"}]
["90000006",false,"","cf. Coelomoron pusillum",null,null,null,null,null,null,null,null,null,true,"No confirmed ID",null,"9000",{"$error":"#N/A"},{"$error":"#N/A"},"\"Picoplankton\" - unidentified single cells <2 µm diam.",0.53900000000000003,127.78,{"$error":"#N/A"}]
["90000006",false,"","Nanoplankton heterotrophic",null,null,null,null,null,null,null,null,null,true,"Heterotroph",null,"9000",{"$error":"#N/A"},{"$error":"#N/A"},"\"Picoplankton\" - unidentified single cells <2 µm diam.",0.53900000000000003,127.78,{"$error":"#N/A"}]
["90000006",false,"","Monad het.",null,null,null,null,null,null,null,null,null,true,"Heterotroph",null,"9000",{"$error":"#N/A"},{"$error":"#N/A"},"\"Picoplankton\" - unidentified single cells <2 µm diam.",0.53900000000000003,127.78,{"$error":"#N/A"}]
["90000006",false,"","Choanoflagellates",null,null,null,null,null,null,null,null,null,true,"Heterotroph",null,"9000",{"$error":"#N/A"},{"$error":"#N/A"},"\"Picoplankton\" - unidentified single cells <2 µm diam.",0.53900000000000003,127.78,{"$error":"#N/A"}]
["90000006",false,"","cf. Planktococcus sphaerocystiformis",null,null,null,null,null,null,null,null,null,true,"No confirmed ID",null,"9000",{"$error":"#N/A"},{"$error":"#N/A"},"\"Picoplankton\" - unidentified single cells <2 µm diam.",0.53900000000000003,127.78,{"$error":"#N/A"}]
["90000006",false,"","cf. Phormidium",null,null,null,null,null,null,null,null,null,true,"No confirmed ID",null,"9000",{"$error":"#N/A"},{"$error":"#N/A"},"\"Picoplankton\" - unidentified single cells <2 µm diam.",0.53900000000000003,127.78,{"$error":"#N/A"}]
["90000006",false,"","cf. Hemiselmis virescens",null,null,null,null,null,null,null,null,null,true,"No confirmed ID",null,"9000",{"$error":"#N/A"},{"$error":"#N/A"},"\"Picoplankton\" - unidentified single cells <2 µm diam.",0.53900000000000003,127.78,{"$error":"#N/A"}]
["90000006",false,"","cf. Eutetramorus fottii",null,null,null,null,null,null,null,null,null,true,"No confirmed ID",null,"9000",{"$error":"#N/A"},{"$error":"#N/A"},"\"Picoplankton\" - unidentified single cells <2 µm diam.",0.53900000000000003,127.78,{"$error":"#N/A"}]
["90000006",false,"","cf. Entomoneis",null,null,null,null,null,null,null,null,null,true,"No confirmed ID",null,"9000",{"$error":"#N/A"},{"$error":"#N/A"},"\"Picoplankton\" - unidentified single cells <2 µm diam.",0.53900000000000003,127.78,{"$error":"#N/A"}]
["90000006",false,"","cf. Coenococcus",null,null,null,null,null,null,null,null,null,true,"No confirmed ID",null,"9000",{"$error":"#N/A"},{"$error":"#N/A"},"\"Picoplankton\" - unidentified single cells <2 µm diam.",0.53900000000000003,127.78,{"$error":"#N/A"}]
["90000006",false,"","CRASPEDOPHYCEAE",null,null,null,null,null,null,null,null,null,true,"Heterotroph",null,"9000",{"$error":"#N/A"},{"$error":"#N/A"},"\"Picoplankton\" - unidentified single cells <2 µm diam.",0.53900000000000003,127.78,{"$error":"#N/A"}]
["90000006",false,"","Craspedomonadina",null,null,null,null,null,null,null,null,null,true,"Heterotroph",null,"9000",{"$error":"#N/A"},{"$error":"#N/A"},"\"Picoplankton\" - unidentified single cells <2 µm diam.",0.53900000000000003,127.78,{"$error":"#N/A"}]
["90000007",false,"","Taxa recorded by Finnish or Norwegian counters only and not on UK counting spreadsheet",null,null,null,null,null,null,null,null,null,true,"",null,"9000",{"$error":"#N/A"},{"$error":"#N/A"},"\"Picoplankton\" - unidentified single cells <2 µm diam.",0.53900000000000003,127.78,{"$error":"#N/A"}]

{"sheet":"LU","index":12,"n_rows":59,"n_cols":27,"rows_kept":59,"cut":false,"hidden":false,"merged":[[0,1,0,4],[0,6,0,9]]}
[null,"Cyan Boundaries LA, MA lakes",null,null,null,null,"Cyan Boundaries HA lakes",null,null,null,null,"PTI Lake Types",null,null,"PTI Normalisation parameters",null,null,"UK Type","RefPTI median"]
["UAnch",30,"EQR","Class Wth","NormEQR",null,30,"EQR","Class Wth","NormEQR",null,"CoreType&Humic","PTI_TYPE",null,"PTI_TYPE","a","c","HAS",0.48399999999999999]
["Ref",0,0,0.13,0,null,0.01,0,0.21,0,null,"HADC",2,null,1,4.07E-2,0.15509999999999999,"HAVS",0.50049999999999994]
["PB",5.62,{"$f":"ROUND((LOG(B4+0.0001)-LOG(B$2+0.0001))/(LOG(B$3+0.0001)-LOG(B$2+0.0001)),2)","v":0.13},0.1,0.2,null,5.62,{"$f":"ROUND((LOG(G4+0.0001)-LOG(G$2+0.0001))/(LOG(G$3+0.0001)-LOG(G$2+0.0001)),2)","v":0.21},0.13000000000000003,0.2,null,"HASC",2,null,2,8.9800000000000005E-2,0.15379999999999999,"LAD",0.42]
["MP",1.58,{"$f":"ROUND((LOG(B5+0.0001)-LOG(B$2+0.0001))/(LOG(B$3+0.0001)-LOG(B$2+0.0001)),2)","v":0.23},0.09,0.4,null,2,{"$f":"ROUND((LOG(G5+0.0001)-LOG(G$2+0.0001))/(LOG(G$3+0.0001)-LOG(G$2+0.0001)),2)","v":0.34},8.9999999999999969E-2,0.4,null,"HAVSC",1,null,3,0.1389,0.1515,"LAS",0.44]
["GM",0.56000000000000005,{"$f":"ROUND((LOG(B6+0.0001)-LOG(B$2+0.0001))/(LOG(B$3+0.0001)-LOG(B$2+0.0001)),2)","v":0.32},0.15,0.6,null,1,{"$f":"ROUND((LOG(G6+0.0001)-LOG(G$2+0.0001))/(LOG(G$3+0.0001)-LOG(G$2+0.0001)),2)","v":0.43},0.2,0.6,null,"HASH",2,null,4,0.1512,0.15079999999999999,"LAVS",0.46]
["HG",0.08,{"$f":"ROUND((LOG(B7+0.0001)-LOG(B$2+0.0001))/(LOG(B$3+0.0001)-LOG(B$2+0.0001)),2)","v":0.47},0.53,0.8,null,0.2,{"$f":"ROUND((LOG(G7+0.0001)-LOG(G$2+0.0001))/(LOG(G$3+0.0001)-LOG(G$2+0.0001)),2)","v":0.63},0.37,0.8,null,"HAVSH",1,null,5,0.20039999999999999,0.14699999999999999,"MAD",0.4425]
[null,null,null,null,null,null,null,null,null,null,null,"LADC",5,null,null,null,null,"MarlS",0.48899999999999999]
[null,null,null,null,null,null,null,null,null,null,null,"LADH",3,null,null,null,null,"MarlVS",0.499]
[null,null,null,null,null,null,null,null,null,null,null,"LASC",5,null,null,null,null,"MAS",0.46500000000000002]
[null,null,null,null,null,null,null,null,null,null,null,"LASH",4,null,null,null,null,"MAVS",0.48349999999999999]
[null,null,null,null,null,null,null,null,null,null,null,"LAVSC",3]
[null,null,null,null,null,null,null,null,null,null,null,"LAVSH",2]
[null,null,null,null,null,null,null,null,null,null,null,"MADC",3]
[null,null,null,null,null,null,null,null,null,null,null,"MADH",3]
[null,null,null,null,null,null,null,null,null,null,null,"MarlSC",3]
[null,null,null,null,null,null,null,null,null,null,null,"MarlSH",3]
[null,null,null,null,null,null,null,null,null,null,null,"MarlVSC",2]
[null,null,null,null,null,null,null,null,null,null,null,"MarlVSH",2]
[null,null,null,null,null,null,null,null,null,null,null,"MASC",3]
[null,null,null,null,null,null,null,null,null,null,null,"MASH",3]
[null,null,null,null,null,null,null,null,null,null,null,"MAVSC",2]
[null,null,null,null,null,null,null,null,null,null,null,"MAVSH",2]
[]
[]
["Chla Lake Types",null,null,null,null,null,null,null,null,null,null,null,1,null,null,2,null,null,3,null,null,4,null,null,5]
[null,null,null,null,null,"GIG_Type_Phyto","MinRef","MaxRef","MinGRef","MaxGRef",null,null,"HAS MarlS",null,null,"All VS",null,null,"MAD MAS",null,null,"LAS",null,null,"LAD"]
["CoreType&Humic","GIG_Type_Phyto","EQR_Type","Type Geo Chl Ref",null,"L",null,null,1.3,6,null,null,"EQR Bound","Class Width","N EQR","EQR Bound","Class Width","N EQR","EQR Bound","Class Width","N EQR","EQR Bound","Class Width","N EQR","EQR Bound","Class Width","N EQR"]
["HADC","L",1,3.1,null,"L-CB1",2.6,3.8,{"$f":"G29/EXP(0.5*(2.323*0.285)^2)","v":2.0883056293425519},{"$f":"ROUND(H29/EXP(0.5*(2.323*0.285)^2),1)","v":3.1},null,null,0,{"$f":"M30-M29","v":0.05},0,0,{"$f":"P30-P29","v":0.05},0,0,{"$f":"S30-S29","v":0.05},0,0,{"$f":"V30-V29","v":0.05},0,0,{"$f":"Y30-Y29","v":0.05},0]
["HASC","L-CB1",1,2.2999999999999998,null,"L-CB2",6.2,7.4,{"$f":"G30/EXP(0.5*(2.323*0.285)^2)","v":4.9798057315091624},{"$f":"ROUND(H30/EXP(0.5*(2.323*0.285)^2),1)","v":5.9},null,"PB",0.05,{"$f":"M31-M30","v":0.11},0.2,0.05,{"$f":"P31-P30","v":9.9999999999999992E-2},0.2,0.05,{"$f":"S31-S30","v":0.12000000000000001},0.2,0.05,{"$f":"V31-V30","v":9.9999999999999992E-2},0.2,0.05,{"$f":"Y31-Y30","v":0.12000000000000001},0.2]
["HASH","L-CB1",1,2.2999999999999998,null,"L-N1",2.5,3.5,{"$f":"G31/EXP(0.5*(2.323*0.213)^2)","v":2.211957138521274},3.0967399939297833,null,"MP",0.16,{"$f":"M32-M31","v":0.16},0.4,0.15,{"$f":"P32-P31","v":0.15},0.4,0.17,{"$f":"S32-S31","v":0.16},0.4,0.15,{"$f":"V32-V31","v":0.13999999999999999},0.4,0.17,{"$f":"Y32-Y31","v":0.16},0.4]
["HAVSC","L-CB2",2,4.4000000000000004,null,"L-N2a",1.5,2.5,1.3271742831127644,2.211957138521274,null,"GM",0.32,{"$f":"M33-M32","v":0.23000000000000004},0.6,0.3,{"$f":"P33-P32","v":0.33},0.6,0.33,{"$f":"S33-S32","v":0.16999999999999998},0.6,0.28999999999999998,{"$f":"V33-V32","v":0.35000000000000003},0.6,0.33,{"$f":"Y33-Y32","v":0.31},0.6]
["HAVSH","L-CB2",2,4.4000000000000004,null,"L-N2b",1.5,2.5,1.3271742831127644,2.211957138521274,null,"HG",0.55000000000000004,{"$f":"1-M33","v":0.44999999999999996},0.8,0.63,{"$f":"1-P33","v":0.37},0.8,0.5,{"$f":"1-S33","v":0.5},0.8,0.64,{"$f":"1-V33","v":0.36},0.8,0.64,{"$f":"1-Y33","v":0.36},0.8]
["LADC","L-N2b",5,1.5,null,"L-N3a",2.5,3.5,2.211957138521274,3.0967399939297833]
["LADH","L",5,1.5,null,"L-N8a",3.5,5,3.0967399939297833,4.4239142770425479]
["LASC","L-N2a",4,1.5]
["LASH","L-N3a",4,1.5]
["LAVSC","L",2,3.3]
["LAVSH","L",2,3.3]
["MADC","L",3,1.8]
["MADH","L",3,1.8]
["MarlSC","L",1,2.2999999999999998]
["MarlSH","L",1,2.2999999999999998]
["MarlVSC","L",2,4.4000000000000004]
["MarlVSH","L",2,4.4000000000000004]
["MASC","L-N1",3,2.2999999999999998]
["MASH","L-N8a",3,2.2999999999999998]
["MAVSC","L",2,4.4000000000000004]
["MAVSH","L",2,4.4000000000000004]
[]
[]
[]
["Class"]
[0,"U"]
[1,"B"]
[2,"P"]
[3,"M"]
[4,"G"]
[6,"H"]