{"text_format":"1","workbook":"xlsx","n_sheets":13,"sheets":["Instructions for use","Version","Licence","Site Data","Chlorophyll Data","Taxa_Data","Chl_PivotTable","Taxa_PivotTable","Taxon EQRs","Classification","Data for Export","UKOptima","LU"],"not_rendered":{"charts":2,"images":1,"macros":1,"external_links":1,"defined_names":4,"comments":3,"pivot_tables":2},"unopened":[],"bounds":{"document_bytes":16777216,"sheet_cells":100000,"rows_first":2000,"rows_last":500,"rows_between":2000,"halvings":0,"cell_chars":16384,"cell_head_chars":4096},"cells_cut":0,"cells_raw":0,"read":"whole","date_system":"1900"}

{"sheet":"Instructions for use","index":0,"n_rows":24,"n_cols":1,"rows_kept":24,"cut":false,"hidden":false,"merged":[]}
["PLUTO Single site calculator"]
["This spreadsheet enables the classification of phytoplankton in lakes using the procedure laid out in the following document:"]
["UKTAG Lake Assessment Method, Phytoplankton, PLUTO method statement"]
["Instructions for use"]
["This calculator spreadsheet enables the classification of one lake at a time."]
["1)  Sheet! Site Data"]
["Enter details of lake in green cells, B2:B7.  "]
["Mean alkalinity, mean depth and humic type must be entered as these are needed to determine reference values for metrics"]
{"$rows_left_out":17}
{"sheet":"Version","index":1,"n_rows":36,"n_cols":3,"rows_kept":36,"cut":false,"hidden":false,"merged":[]}
[]
[]
[]
[]
[]
[]
[]
[]
{"$rows_left_out":29}
{"sheet":"Licence","index":2,"n_rows":0,"n_cols":0,"rows_kept":0,"cut":false,"hidden":false,"merged":[]}

{"sheet":"Site Data","index":3,"n_rows":12,"n_cols":9,"rows_kept":12,"cut":false,"hidden":false,"merged":[[0,0,0,1]]}
["Site Details"]
["UK Lake WBID",28986,null,null,null,null,null,"Humic Type"]
["Lake Name","Loweswater",null,null,null,null,null,"Clear","C"]
["Mean alkalinity (mEq/L)",0.19800000000000001,null,null,null,null,null,"Humic","H"]
["Mean depth (m)",8.3699999999999992]
["Humic Type (Clear, Humic)","C"]
["Marl Lake",null,null,null,null,null,null,"Marl"]
[]
{"$rows_left_out":5}
{"sheet":"Chlorophyll Data","index":4,"n_rows":86,"n_cols":19,"rows_kept":86,"cut":false,"hidden":false,"merged":[[0,1,0,3],[5,1,5,2],[1,1,1,2],[2,1,2,2],[3,1,3,2],[4,1,4,2]]}
[null,"Enter Summary Data",null,null,"Calculate from data below",null,null,null,null,null,{"$f":"'Site Data'!B3 &\" (WB\"&'Site Data'!B2&\")\"","v":"Loweswater (WB28986)"}]
[null,"Mean Log10 Chl",null,null,{"$f":"Chl_PivotTable!B17","v":0.67968168515791305},null,null,null,null,null,"Reference Chlorophyll a (ug/l)",null,{"$f":"10^(0.223+0.166*LOG('Site Data'!B4)+0.684*SQRT(1/'Site Data'!B5))","v":2.2012603348627282}]
[null,"StDev Log10 Chl",null,null,{"$f":"Chl_PivotTable!B18","v":0.33088946549756265},null,null,null,null,null,"Min Reference allowed",null,{"$f":"VLOOKUP('Site Data'!$B$11,LU!$F$27:$J$35,4)","v":1.3271742831127644}]
[null,"Count Chl",null,null,{"$f":"Chl_PivotTable!B19","v":36},null,null,null,null,null,"Max Reference allowed",null,{"$f":"VLOOKUP('Site Data'!$B$11,LU!$F$27:$J$35,5)","v":2.211957138521274}]
[null,"Years of data",null,null,{"$f":"Chl_PivotTable!B20","v":3},null,null,null,null,null,"Reference used",null,{"$f":"IF(M2<M3,M3,IF(M2>M4,M4,M2))","v":2.2012603348627282}]
[null,"Set to 1 if chlorophyll samples are not at regular intervals",null,null,null,null,null,null,null,null,"Chlorophyll EQR","ChlEQR",{"$f":"M5/M15","v":0.4602456821654512}]
[null,null,null,null,null,null,null,null,null,null,"Normalised chlorophyll EQR","ChlEQRnorm",{"$f":"IF('Site Data'!$B12=1,((M6-VLOOKUP(M6,LU!$M$29:$O$34,1))/VLOOKUP(M6,LU!$M$29:$O$34,2)*0.2)+VLOOKUP(M6,LU!$M$29:$O$34,3),IF('Site Data'!$B12=2,((M6-VLOOKUP(M6,LU!$P$29:$R$34,1))/VLOOKUP(M6,LU!$P$29:$R$34,2)*0.2)+VLOOKUP(M6,LU!$P$29:$R$34,3),IF('Site Data'!$B12=3,((M6-VLOOKUP(M6,LU!$S$29:$U$34,1))/VLOOKUP(M6,LU!$S$29:$U$34,2)*0.2)+VLOOKUP(M6,LU!$S$29:$U$34,3),IF('Site Data'!$B12=4,((M6-VLOOKUP(M6,LU!$V$29:$X$34,1))/VLOOKUP(M6,LU!$V$29:$X$34,2)*0.2)+VLOOKUP(M6,LU!$V$29:$X$34,3),((M6-VLOOKUP(M6,LU!$Y$29:$AA$34,1))/VLOOKUP(M6,LU!$Y$29:$AA$34,2)*0.2)+VLOOKUP(M6,LU!$Y$29:$AA$34,3)))))","v":0.69728324695168642}]
[null,null,null,null,null,null,null,null,null,null,"Lower 95th confidence limit chlorophyll","L95CL",{"$f":"10^($M$18-TINV(0.05,($M$20-1))*$M$16)","v":4.1293011673299977}]
{"$rows_left_out":79}
{"sheet":"Taxa_Data","index":5,"n_rows":327,"n_cols":5,"rows_kept":327,"cut":false,"hidden":false,"merged":[]}
["Date","SpeciesCode","BioVol",null,"Taxa Name"]
["2010-07-07","01020000",114004.89887719243,null,{"$f":"VLOOKUP(B2,UKOptima!A:D,4,FALSE)","v":"Anabaena"}]
["2010-07-07","01530000",214663.19901731593,null,{"$f":"VLOOKUP(B3,UKOptima!A:D,4,FALSE)","v":"Oscillatoria"}]
["2010-07-07","01780000",411637.1541384022,null,{"$f":"VLOOKUP(B4,UKOptima!A:D,4,FALSE)","v":"Woronichinia"}]
["2010-07-07","04100000",1160.907486544987,null,{"$f":"VLOOKUP(B5,UKOptima!A:D,4,FALSE)","v":"Trachelomonas"}]
["2010-07-07","05040001",330.21368506168517,null,{"$f":"VLOOKUP(B6,UKOptima!A:D,4,FALSE)","v":"Cryptomonas (small) Length <20 µm"}]
["2010-07-07","05040002",87263.589269141172,null,{"$f":"VLOOKUP(B7,UKOptima!A:D,4,FALSE)","v":"Cryptomonas (medium) Length 20-30 µm"}]
["2010-07-07","05040003",27813.021562644804,null,{"$f":"VLOOKUP(B8,UKOptima!A:D,4,FALSE)","v":"Cryptomonas (large) Length >30 µm"}]
{"$rows_left_out":320}
{"sheet":"Chl_PivotTable","index":6,"n_rows":20,"n_cols":4,"rows_kept":20,"cut":false,"hidden":false,"merged":[]}
["Average of Log10Chl","Column Labels"]
["Row Labels",2010,2011,2012]
[1,0.43136376415898736,0.61278385671973545,0.41497334797081797]
[2,0.92941892571429274,0.27875360095282892,0.62324929039790045]
[3,1.1398790864012365,0.71600334363479923,0.93449845124356767]
[4,0.87506126339170009,0.93951925261861846,1.0492180226701815]
[5,0.41497334797081797,1.1238516409670858,0.55630250076728727]
[6,0.36172783601759284,0.85733249643126852,0.86332286012045589]
{"$rows_left_out":13}
{"sheet":"Taxa_PivotTable","index":7,"n_rows":301,"n_cols":10,"rows_kept":301,"cut":false,"hidden":false,"merged":[[17,1,17,10]]}
[{"$f":"'Site Data'!$B$3&\" (WB\"&'Site Data'!$B$2&\")\"","v":"Loweswater (WB28986)"}]
[]
["Warnings: ",{"$f":"IF(OR(MONTH(MIN(C20:K20))<7,MONTH(MAX(C20:K20))>9),\"Month out of range !\",\"Months in range\")","v":"Months in range"}]
[null,{"$f":"IF(B301=\"\",\"Data within range of sheet\",\"Data exceeds range of sheet\")","v":"Data within range of sheet"}]
[]
[]
["Data below are created using a pivot table which takes data in list form from sheet \"Taxa_Data\""]
["Use refresh button to update."]
{"$rows_left_out":294}
{"sheet":"Taxon EQRs","index":8,"n_rows":300,"n_cols":39,"rows_kept":300,"cut":false,"hidden":false,"merged":[]}
["Calculation of Taxonomic Metrics and Class",null,null,null,null,null,"Sample 1",null,null,null,"Sample 2",null,null,null,"Sample 3",null,null,null,"Sample 4",null,null,null,"Sample 5",null,null,null,"Sample 6",null,null,null,"Sample 7",null,null,null,"Sample 8",null,null,null,"Sample 9"]
[null,null,null,null,null,null,{"$f":"IF(Taxa_PivotTable!C20=\"\",\"\",Taxa_PivotTable!C20)","v":"2010-07-07"},null,null,null,{"$f":"IF(Taxa_PivotTable!D20=\"\",\"\",Taxa_PivotTable!D20)","v":"2010-08-12"},null,null,null,{"$f":"IF(Taxa_PivotTable!E20=\"\",\"\",Taxa_PivotTable!E20)","v":"2010-09-13"},null,null,null,{"$f":"IF(Taxa_PivotTable!F20=\"\",\"\",Taxa_PivotTable!F20)","v":"2011-09-27"},null,null,null,{"$f":"IF(Taxa_PivotTable!G20>0,Taxa_PivotTable!G20,\"\")","v":"2012-07-24"},null,null,null,{"$f":"IF(Taxa_PivotTable!H20>0,Taxa_PivotTable!H20,\"\")","v":"2012-08-21"},null,null,null,{"$f":"IF(Taxa_PivotTable!I20>0,Taxa_PivotTable!I20,\"\")","v":"2012-09-26"},null,null,null,{"$f":"IF(Taxa_PivotTable!J20>0,Taxa_PivotTable!J20,\"\")","v":"(blank)"},null,null,null,{"$f":"IF(Taxa_PivotTable!K20>0,Taxa_PivotTable!K20,\"\")","v":""}]
[{"$f":"'Site Data'!A2","v":"UK Lake WBID"},{"$f":"'Site Data'!B2","v":28986},"PTI Class",null,null,null,{"$f":"IF(COUNT(D21:D150)>1,IF(G4>=0.8,\"High\",IF(G4>=0.6,\"Good\",IF(G4>=0.4,\"Moderate\",IF(G4>=0.2,\"Poor\",\"Bad\")))),\"\")","v":"Moderate"},null,null,null,{"$f":"IF(COUNT(H21:H150)>1,IF(K4>=0.8,\"High\",IF(K4>=0.6,\"Good\",IF(K4>=0.4,\"Moderate\",IF(K4>=0.2,\"Poor\",\"Bad\")))),\"\")","v":"Good"},null,null,null,{"$f":"IF(COUNT(L21:L150)>1,IF(O4>=0.8,\"High\",IF(O4>=0.6,\"Good\",IF(O4>=0.4,\"Moderate\",IF(O4>=0.2,\"Poor\",\"Bad\")))),\"\")","v":"Good"},null,null,null,{"$f":"IF(COUNT(P21:P150)>1,IF(S4>=0.8,\"High\",IF(S4>=0.6,\"Good\",IF(S4>=0.4,\"Moderate\",IF(S4>=0.2,\"Poor\",\"Bad\")))),\"\")","v":"Moderate"},null,null,null,{"$f":"IF(COUNT(T21:T150)>1,IF(W4>=0.8,\"High\",IF(W4>=0.6,\"Good\",IF(W4>=0.4,\"Moderate\",IF(W4>=0.2,\"Poor\",\"Bad\")))),\"\")","v":"Good"},null,null,null,{"$f":"IF(COUNT(X21:X150)>1,IF(AA4>=0.8,\"High\",IF(AA4>=0.6,\"Good\",IF(AA4>=0.4,\"Moderate\",IF(AA4>=0.2,\"Poor\",\"Bad\")))),\"\")","v":"Moderate"},null,null,null,{"$f":"IF(COUNT(AB21:AB150)>1,IF(AE4>=0.8,\"High\",IF(AE4>=0.6,\"Good\",IF(AE4>=0.4,\"Moderate\",IF(AE4>=0.2,\"Poor\",\"Bad\")))),\"\")","v":"Good"},null,null,null,{"$f":"IF(COUNT(AF21:AF150)>1,IF(AI4>=0.8,\"High\",IF(AI4>=0.6,\"Good\",IF(AI4>=0.4,\"Moderate\",IF(AI4>=0.2,\"Poor\",\"Bad\")))),\"\")","v":""},null,null,null,{"$f":"IF(COUNT(AJ21:AJ150)>1,IF(AM4>=0.8,\"High\",IF(AM4>=0.6,\"Good\",IF(AM4>=0.4,\"Moderate\",IF(AM4>=0.2,\"Poor\",\"Bad\")))),\"\")","v":""}]
[{"$f":"'Site Data'!A3","v":"Lake Name"},{"$f":"'Site Data'!B3","v":"Loweswater"},"PTI EQRNorm",null,null,null,{"$f":"IF(COUNT(D21:D150)>1,1.228*'Taxon EQRs'!G5^2-VLOOKUP($B11,LU!$O3:$Q7,2,FALSE)*'Taxon EQRs'!G5-VLOOKUP('Taxon EQRs'!$B11,LU!$O3:$Q7,3,FALSE),\"\")","v":0.45118686363877991},null,null,null,{"$f":"IF(COUNT(H21:H150)>1,1.228*'Taxon EQRs'!K5^2-VLOOKUP($B11,LU!$O3:$Q7,2,FALSE)*'Taxon EQRs'!K5-VLOOKUP('Taxon EQRs'!$B11,LU!$O3:$Q7,3,FALSE),\"\")","v":0.66061479537862622},null,null,null,{"$f":"IF(COUNT(L21:L150)>1,1.228*'Taxon EQRs'!O5^2-VLOOKUP($B11,LU!$O3:$Q7,2,FALSE)*'Taxon EQRs'!O5-VLOOKUP('Taxon EQRs'!$B11,LU!$O3:$Q7,3,FALSE),\"\")","v":0.62727228797134804},null,null,null,{"$f":"IF(COUNT(P21:P150)>1,1.228*'Taxon EQRs'!S5^2-VLOOKUP($B11,LU!$O3:$Q7,2,FALSE)*'Taxon EQRs'!S5-VLOOKUP('Taxon EQRs'!$B11,LU!$O3:$Q7,3,FALSE),\"\")","v":0.43480743463478566},null,null,null,{"$f":"IF(COUNT(T21:T150)>1,1.228*'Taxon EQRs'!W5^2-VLOOKUP($B11,LU!$O3:$Q7,2,FALSE)*'Taxon EQRs'!W5-VLOOKUP('Taxon EQRs'!$B11,LU!$O3:$Q7,3,FALSE),\"\")","v":0.60859559763354332},null,null,null,{"$f":"IF(COUNT(X21:X150)>1,1.228*'Taxon EQRs'!AA5^2-VLOOKUP($B11,LU!$O3:$Q7,2,FALSE)*'Taxon EQRs'!AA5-VLOOKUP('Taxon EQRs'!$B11,LU!$O3:$Q7,3,FALSE),\"\")","v":0.43594796059186558},null,null,null,{"$f":"IF(COUNT(AB21:AB150)>1,1.228*'Taxon EQRs'!AE5^2-VLOOKUP($B11,LU!$O3:$Q7,2,FALSE)*'Taxon EQRs'!AE5-VLOOKUP('Taxon EQRs'!$B11,LU!$O3:$Q7,3,FALSE),\"\")","v":0.62545266236087005},null,null,null,{"$f":"IF(COUNT(AF21:AF150)>1,1.228*'Taxon EQRs'!AI5^2-VLOOKUP($B11,LU!$O3:$Q7,2,FALSE)*'Taxon EQRs'!AI5-VLOOKUP('Taxon EQRs'!$B11,LU!$O3:$Q7,3,FALSE),\"\")","v":""},null,null,null,{"$f":"IF(COUNT(AJ21:AJ150)>1,1.228*'Taxon EQRs'!AM5^2-VLOOKUP($B11,LU!$O3:$Q7,2,FALSE)*'Taxon EQRs'!AM5-VLOOKUP('Taxon EQRs'!$B11,LU!$O3:$Q7,3,FALSE),\"\")","v":""}]
["Mean alkalinity used (min 0.005) (mEq/l)",{"$f":"IF('Site Data'!B4<0.005,0.005,'Site Data'!B4)","v":0.19800000000000001},"PTI EQR",null,null,null,{"$f":"(G7-0.75)/(G6-0.75)","v":0.78429145565983194},null,null,null,{"$f":"(K7-0.75)/(K6-0.75)","v":0.89665725061653789},null,null,null,{"$f":"(O7-0.75)/(O6-0.75)","v":0.87982714458811562},null,null,null,{"$f":"(S7-0.75)/(S6-0.75)","v":0.77473567165888091},null,null,null,{"$f":"(W7-0.75)/(W6-0.75)","v":0.87024289641339214},null,null,null,{"$f":"(AA7-0.75)/(AA6-0.75)","v":0.77540531934902546},null,null,null,{"$f":"(AE7-0.75)/(AE6-0.75)","v":0.87889843960993552},null,null,null,{"$f":"(AI7-0.75)/(AI6-0.75)","v":{"$error":"#DIV/0!"}},null,null,null,{"$f":"(AM7-0.75)/(AM6-0.75)","v":{"$error":"#DIV/0!"}}]
["Mean depth used (min 1.0) (m)",{"$f":"IF('Site Data'!B5<1,1,'Site Data'!B5)","v":8.3699999999999992},"Ref PTI",null,null,null,{"$f":"0.028*LOG($B5/$B6)+0.498","v":0.45247031250351161},null,null,null,{"$f":"0.028*LOG($B5/$B6)+0.498","v":0.45247031250351161},null,null,null,{"$f":"0.028*LOG($B5/$B6)+0.498","v":0.45247031250351161},null,null,null,{"$f":"0.028*LOG($B5/$B6)+0.498","v":0.45247031250351161},null,null,null,{"$f":"0.028*LOG($B5/$B6)+0.498","v":0.45247031250351161},null,null,null,{"$f":"0.028*LOG($B5/$B6)+0.498","v":0.45247031250351161},null,null,null,{"$f":"0.028*LOG($B5/$B6)+0.498","v":0.45247031250351161},null,null,null,{"$f":"0.028*LOG($B5/$B6)+0.498","v":0.45247031250351161},null,null,null,{"$f":"0.028*LOG($B5/$B6)+0.498","v":0.45247031250351161}]
["Humic Type",{"$f":"'Site Data'!B6","v":"C"},"PTI",null,null,null,{"$f":"F17/E17","v":0.5166500082913642},null,null,null,{"$f":"J17/I17","v":0.48321784843260102},null,null,null,{"$f":"N17/M17","v":0.48822530461977026},null,null,null,{"$f":"R17/Q17","v":0.51949313771895111},null,null,null,{"$f":"V17/U17","v":0.49107690298408452},null,null,null,{"$f":"Z17/Y17","v":0.51929389765096967},null,null,null,{"$f":"AD17/AC17","v":0.4885016219217046},null,null,null,{"$f":"AH17/AG17","v":{"$error":"#DIV/0!"}},null,null,null,{"$f":"AL17/AK17","v":{"$error":"#DIV/0!"}}]
["Alkalinity Type",{"$f":"'Site Data'!B9","v":"LA"},"Cyan Class",null,null,null,{"$f":"IF(COUNT(D21:D150)>1,IF(G9>=0.8,\"High\",IF(G9>=0.6,\"Good\",IF(G9>=0.4,\"Moderate\",IF(G9>=0.2,\"Poor\",\"Bad\")))),\"\")","v":"Moderate"},null,null,null,{"$f":"IF(COUNT(H21:H150)>1,IF(K9>=0.8,\"High\",IF(K9>=0.6,\"Good\",IF(K9>=0.4,\"Moderate\",IF(K9>=0.2,\"Poor\",\"Bad\")))),\"\")","v":"Moderate"},null,null,null,{"$f":"IF(COUNT(L21:L150)>1,IF(O9>=0.8,\"High\",IF(O9>=0.6,\"Good\",IF(O9>=0.4,\"Moderate\",IF(O9>=0.2,\"Poor\",\"Bad\")))),\"\")","v":"Moderate"},null,null,null,{"$f":"IF(COUNT(P21:P150)>1,IF(S9>=0.8,\"High\",IF(S9>=0.6,\"Good\",IF(S9>=0.4,\"Moderate\",IF(S9>=0.2,\"Poor\",\"Bad\")))),\"\")","v":"Good"},null,null,null,{"$f":"IF(COUNT(T21:T150)>1,IF(W9>=0.8,\"High\",IF(W9>=0.6,\"Good\",IF(W9>=0.4,\"Moderate\",IF(W9>=0.2,\"Poor\",\"Bad\")))),\"\")","v":"Moderate"},null,null,null,{"$f":"IF(COUNT(X21:X150)>1,IF(AA9>=0.8,\"High\",IF(AA9>=0.6,\"Good\",IF(AA9>=0.4,\"Moderate\",IF(AA9>=0.2,\"Poor\",\"Bad\")))),\"\")","v":"Poor"},null,null,null,{"$f":"IF(COUNT(AB21:AB150)>1,IF(AE9>=0.8,\"High\",IF(AE9>=0.6,\"Good\",IF(AE9>=0.4,\"Moderate\",IF(AE9>=0.2,\"Poor\",\"Bad\")))),\"\")","v":"Moderate"},null,null,null,{"$f":"IF(COUNT(AF21:AF150)>1,IF(AI9>=0.8,\"High\",IF(AI9>=0.6,\"Good\",IF(AI9>=0.4,\"Moderate\",IF(AI9>=0.2,\"Poor\",\"Bad\")))),\"\")","v":""},null,null,null,{"$f":"IF(COUNT(AJ21:AJ150)>1,IF(AM9>=0.8,\"High\",IF(AM9>=0.6,\"Good\",IF(AM9>=0.4,\"Moderate\",IF(AM9>=0.2,\"Poor\",\"Bad\")))),\"\")","v":""}]
{"$rows_left_out":293}
{"sheet":"Classification","index":9,"n_rows":19,"n_cols":23,"rows_kept":19,"cut":false,"hidden":false,"merged":[[3,9,3,12],[3,16,3,20],[8,0,8,1],[10,0,10,1]]}
["Classification Results"]
["WBID",{"$f":"'Site Data'!B2","v":28986}]
["Name",{"$f":"'Site Data'!B3","v":"Loweswater"}]
[null,null,null,"Mean",null,null,null,null,null,"Confidence worse than class",null,null,null,null,"Face Value Class",null,"Confidence of class"]
["Metric","Years Classified",null,"EQRnorm","N","DF","Std Dev","Std Err",null,"p<H","p<G","p<M","p<P",null,"FV Class",null,"High","Good","Moderate","Poor","Bad",null,"Check"]
["Chlorophyll",{"$f":"IF(COUNT('Chlorophyll Data'!G14:G73)>1,MIN('Chlorophyll Data'!G14:G73)&\"-\"&MAX('Chlorophyll Data'!G14:G73),\"\")","v":"2010-2012"},null,{"$f":"'Chlorophyll Data'!M7","v":0.69728324695168642},{"$f":"'Chlorophyll Data'!M20","v":36},{"$f":"E6-1","v":35},{"$f":"'Chlorophyll Data'!M14*SQRT('Chlorophyll Data'!M20)","v":0.11460835407116209},{"$f":"'Chlorophyll Data'!M14","v":1.9101392345193681E-2},null,{"$f":"IF($D6>0.8,TDIST(ABS((0.8-$D6)/$H6),$F6,1),1-TDIST(ABS((0.8-$D6)/$H6),$F6,1))","v":0.99999744337122598},{"$f":"IF($D6>0.6,TDIST(ABS((0.6-$D6)/$H6),$F6,1),1-TDIST(ABS((0.6-$D6)/$H6),$F6,1))","v":6.0556548111206979E-6},{"$f":"IF($D6>0.4,TDIST(ABS((0.4-$D6)/$H6),$F6,1),1-TDIST(ABS((0.4-$D6)/$H6),$F6,1))","v":1.3339797742758406E-17},{"$f":"IF($D6>0.2,TDIST(ABS((0.2-$D6)/$H6),$F6,1),1-TDIST(ABS((0.2-$D6)/$H6),$F6,1))","v":8.5262625976048483E-25},null,{"$f":"IF(D6>0.8,\"High\",IF(D6>0.6,\"Good\",IF(D6>0.4,\"Moderate\",IF(D6>0.2,\"Poor\",\"Bad\"))))","v":"Good"},null,{"$f":"1-J6","v":2.5566287740197424E-6},{"$f":"J6-K6","v":0.99999138771641483},6.055654811107358E-6,1.3339796890132147E-17,{"$f":"M6","v":8.5262625976048483E-25},null,{"$f":"SUM(Q6:U6)=1","v":true}]
["PTI",{"$f":"YEAR(MIN('Taxon EQRs'!G2,'Taxon EQRs'!K2,'Taxon EQRs'!O2,'Taxon EQRs'!S2,'Taxon EQRs'!W2,'Taxon EQRs'!AA2,'Taxon EQRs'!AE2,'Taxon EQRs'!AI2,'Taxon EQRs'!AM2))&\"-\"&YEAR(MAX('Taxon EQRs'!G2:AM2))","v":"2010-2012"},null,{"$f":"AVERAGE('Taxon EQRs'!G4:AM4)","v":0.54912537174425979},{"$f":"COUNT('Taxon EQRs'!G4:AM4)","v":7},{"$f":"E7-1","v":6},{"$f":"STDEV('Taxon EQRs'!G4:AM4)","v":0.10276921042508551},{"$f":"G7/SQRT(E7)","v":3.8843110459891826E-2},null,{"$f":"IF($D7>0.8,TDIST(ABS((0.8-$D7)/$H7),$F7,1),1-TDIST(ABS((0.8-$D7)/$H7),$F7,1))","v":0.99967344760375643},{"$f":"IF($D7>0.6,TDIST(ABS((0.6-$D7)/$H7),$F7,1),1-TDIST(ABS((0.6-$D7)/$H7),$F7,1))","v":0.88090347249239453},{"$f":"IF($D7>0.4,TDIST(ABS((0.4-$D7)/$H7),$F7,1),1-TDIST(ABS((0.4-$D7)/$H7),$F7,1))","v":4.2835876064478157E-3},{"$f":"IF($D7>0.2,TDIST(ABS((0.2-$D7)/$H7),$F7,1),1-TDIST(ABS((0.2-$D7)/$H7),$F7,1))","v":5.3030093332267254E-5},null,{"$f":"IF(D7>0.8,\"High\",IF(D7>0.6,\"Good\",IF(D7>0.4,\"Moderate\",IF(D7>0.2,\"Poor\",\"Bad\"))))","v":"Moderate"},null,{"$f":"1-J7","v":3.2655239624357346E-4},0.11876997511136189,0.87661988488594667,4.2305575131155486E-3,{"$f":"M7","v":5.3030093332267254E-5},null,{"$f":"SUM(Q7:U7)=1","v":true}]
["Cyanobacteria",{"$f":"B7","v":"2010-2012"},null,{"$f":"AVERAGE('Taxon EQRs'!G9:AM9)","v":0.48518275118653087},{"$f":"COUNT('Taxon EQRs'!G9:AM9)","v":7},{"$f":"E8-1","v":6},{"$f":"STDEV('Taxon EQRs'!G9:AM9)","v":0.10859148605519749},{"$f":"G8/SQRT(E8)","v":4.1043723800141561E-2},null,{"$f":"IF($D8>0.8,TDIST(ABS((0.8-$D8)/$H8),$F8,1),1-TDIST(ABS((0.8-$D8)/$H8),$F8,1))","v":0.9998716018829571},{"$f":"IF($D8>0.6,TDIST(ABS((0.6-$D8)/$H8),$F8,1),1-TDIST(ABS((0.6-$D8)/$H8),$F8,1))","v":0.98436531336469524},{"$f":"IF($D8>0.4,TDIST(ABS((0.4-$D8)/$H8),$F8,1),1-TDIST(ABS((0.4-$D8)/$H8),$F8,1))","v":4.1630645453891529E-2},{"$f":"IF($D8>0.2,TDIST(ABS((0.2-$D8)/$H8),$F8,1),1-TDIST(ABS((0.2-$D8)/$H8),$F8,1))","v":2.2043102126572813E-4},null,{"$f":"IF(D8>0.8,\"High\",IF(D8>0.6,\"Good\",IF(D8>0.4,\"Moderate\",IF(D8>0.2,\"Poor\",\"Bad\"))))","v":"Moderate"},null,{"$f":"1-J8","v":1.2839811704290494E-4},1.5506288518261857E-2,0.94273466791080374,4.1410214432625804E-2,{"$f":"M8","v":2.2043102126572813E-4},null,{"$f":"SUM(Q8:U8)=1","v":true}]
{"$rows_left_out":12}
{"sheet":"Data for Export","index":10,"n_rows":22,"n_cols":11,"rows_kept":22,"cut":false,"hidden":false,"merged":[[21,0,21,1],[17,0,17,1],[18,0,18,1],[19,0,19,1],[20,0,20,1]]}
["Sample metric results"]
[]
[null,{"$f":"'Taxon EQRs'!G2","v":"2010-07-07"},{"$f":"'Taxon EQRs'!K2","v":"2010-08-12"},{"$f":"'Taxon EQRs'!O2","v":"2010-09-13"},{"$f":"'Taxon EQRs'!S2","v":"2011-09-27"},{"$f":"'Taxon EQRs'!W2","v":"2012-07-24"},{"$f":"'Taxon EQRs'!AA2","v":"2012-08-21"},{"$f":"'Taxon EQRs'!AE2","v":"2012-09-26"},{"$f":"'Taxon EQRs'!AI2","v":"(blank)"},{"$f":"'Taxon EQRs'!AM2","v":""}]
["PTI Class",{"$f":"'Taxon EQRs'!G3","v":"Moderate"},{"$f":"'Taxon EQRs'!K3","v":"Good"},{"$f":"'Taxon EQRs'!O3","v":"Good"},{"$f":"'Taxon EQRs'!S3","v":"Moderate"},{"$f":"'Taxon EQRs'!W3","v":"Good"},{"$f":"'Taxon EQRs'!AA3","v":"Moderate"},{"$f":"'Taxon EQRs'!AE3","v":"Good"},{"$f":"'Taxon EQRs'!AI3","v":""},{"$f":"'Taxon EQRs'!AM3","v":""}]
["PTI EQRNorm",{"$f":"'Taxon EQRs'!G4","v":0.45118686363877991},{"$f":"'Taxon EQRs'!K4","v":0.66061479537862622},{"$f":"'Taxon EQRs'!O4","v":0.62727228797134804},{"$f":"'Taxon EQRs'!S4","v":0.43480743463478566},{"$f":"'Taxon EQRs'!W4","v":0.60859559763354332},{"$f":"'Taxon EQRs'!AA4","v":0.43594796059186558},{"$f":"'Taxon EQRs'!AE4","v":0.62545266236087005},{"$f":"'Taxon EQRs'!AI4","v":""},{"$f":"'Taxon EQRs'!AM4","v":""}]
["PTI EQR",{"$f":"'Taxon EQRs'!G5","v":0.78429145565983194},{"$f":"'Taxon EQRs'!K5","v":0.89665725061653789},{"$f":"'Taxon EQRs'!O5","v":0.87982714458811562},{"$f":"'Taxon EQRs'!S5","v":0.77473567165888091},{"$f":"'Taxon EQRs'!W5","v":0.87024289641339214},{"$f":"'Taxon EQRs'!AA5","v":0.77540531934902546},{"$f":"'Taxon EQRs'!AE5","v":0.87889843960993552},{"$f":"'Taxon EQRs'!AI5","v":{"$error":"#DIV/0!"}},{"$f":"'Taxon EQRs'!AM5","v":{"$error":"#DIV/0!"}}]
["Ref PTI",{"$f":"'Taxon EQRs'!G6","v":0.45247031250351161},{"$f":"'Taxon EQRs'!K6","v":0.45247031250351161},{"$f":"'Taxon EQRs'!O6","v":0.45247031250351161},{"$f":"'Taxon EQRs'!S6","v":0.45247031250351161},{"$f":"'Taxon EQRs'!W6","v":0.45247031250351161},{"$f":"'Taxon EQRs'!AA6","v":0.45247031250351161},{"$f":"'Taxon EQRs'!AE6","v":0.45247031250351161},{"$f":"'Taxon EQRs'!AI6","v":0.45247031250351161},{"$f":"'Taxon EQRs'!AM6","v":0.45247031250351161}]
["PTI",{"$f":"'Taxon EQRs'!G7","v":0.5166500082913642},{"$f":"'Taxon EQRs'!K7","v":0.48321784843260102},{"$f":"'Taxon EQRs'!O7","v":0.48822530461977026},{"$f":"'Taxon EQRs'!S7","v":0.51949313771895111},{"$f":"'Taxon EQRs'!W7","v":0.49107690298408452},{"$f":"'Taxon EQRs'!AA7","v":0.51929389765096967},{"$f":"'Taxon EQRs'!AE7","v":0.4885016219217046},{"$f":"'Taxon EQRs'!AI7","v":{"$error":"#DIV/0!"}},{"$f":"'Taxon EQRs'!AM7","v":{"$error":"#DIV/0!"}}]
{"$rows_left_out":15}
{"sheet":"UKOptima","index":11,"n_rows":654,"n_cols":23,"rows_kept":654,"cut":false,"hidden":false,"merged":[]}
["WH_Code","on UK Counter List","GenusRecord","DAT_TaxaList2009_Taxon_Name","Mixed Taxon Optima ","Optima Genus","Substitute genus optima","Genus","Species","Optima used","Optima type","Reason use genus","Warning","Ignore","IgnoreReason","WH_Code_touse","GenusCode","Mixed Taxon Optima","MxTaxN2","TBL_GenusCodes2009_Taxon_Name","Optima Genus","GenusN2","NinDataSet"]
["01000000",true,1,"Unidentified Cyanophyte",null,0.58099999999999996,null,"Unidentified Cyanophyte",null,0.58099999999999996,"group",null,null,false,"",null,"0100",0.57399999999999995,41.14,"Unidentified Cyanophyte",0.58099999999999996,40.25,201]
["01020000",true,1,"Anabaena",null,0.56799999999999995,null,"Anabaena",null,0.56799999999999995,"genus",null,null,false,"",null,"0102",0.51500000000000001,85.14,"Anabaena",0.56799999999999995,96.64,430]
["01020040",true,"","Anabaena catenula",0.71299999999999997,null,null,null,"Anabaena catenula",0.71299999999999997,"species",null,null,false,"",null,"0102",0.71299999999999997,22.88,"Anabaena",0.56799999999999995,96.64,67]
["01020042",true,"","Anabaena catenula var. solitaria",0.70099999999999996,null,null,null,"Anabaena catenula var. solitaria",0.70099999999999996,"species",null,null,false,"",null,"0102",0.70099999999999996,9.1199999999999992,"Anabaena",0.56799999999999995,96.64,31]
["01020050",true,"","Anabaena circinalis",0.74299999999999999,null,null,null,"Anabaena circinalis",0.74299999999999999,"species",null,null,false,"",null,"0102",0.74299999999999999,14.26,"Anabaena",0.56799999999999995,96.64,34]
["01020090",true,"","Anabaena flos-aquae",0.65200000000000002,null,null,null,"Anabaena flos-aquae",0.65200000000000002,"species",null,null,false,"",null,"0102",0.65200000000000002,50.41,"Anabaena",0.56799999999999995,96.64,156]
["01020130",false,"","Anabaena planctonica",0.61799999999999999,null,null,null,"Anabaena planctonica",0.61799999999999999,"species",null,null,false,"",null,"0102",0.61799999999999999,3.84,"Anabaena",0.56799999999999995,96.64,7]
{"$rows_left_out":647}
{"sheet":"LU","index":12,"n_rows":59,"n_cols":27,"rows_kept":59,"cut":false,"hidden":false,"merged":[[0,1,0,4],[0,6,0,9]]}
[null,"Cyan Boundaries LA, MA lakes",null,null,null,null,"Cyan Boundaries HA lakes",null,null,null,null,"PTI Lake Types",null,null,"PTI Normalisation parameters",null,null,"UK Type","RefPTI median"]
["UAnch",30,"EQR","Class Wth","NormEQR",null,30,"EQR","Class Wth","NormEQR",null,"CoreType&Humic","PTI_TYPE",null,"PTI_TYPE","a","c","HAS",0.48399999999999999]
["Ref",0,0,0.13,0,null,0.01,0,0.21,0,null,"HADC",2,null,1,4.07E-2,0.15509999999999999,"HAVS",0.50049999999999994]
["PB",5.62,{"$f":"ROUND((LOG(B4+0.0001)-LOG(B$2+0.0001))/(LOG(B$3+0.0001)-LOG(B$2+0.0001)),2)","v":0.13},0.1,0.2,null,5.62,{"$f":"ROUND((LOG(G4+0.0001)-LOG(G$2+0.0001))/(LOG(G$3+0.0001)-LOG(G$2+0.0001)),2)","v":0.21},0.13000000000000003,0.2,null,"HASC",2,null,2,8.9800000000000005E-2,0.15379999999999999,"LAD",0.42]
["MP",1.58,{"$f":"ROUND((LOG(B5+0.0001)-LOG(B$2+0.0001))/(LOG(B$3+0.0001)-LOG(B$2+0.0001)),2)","v":0.23},0.09,0.4,null,2,{"$f":"ROUND((LOG(G5+0.0001)-LOG(G$2+0.0001))/(LOG(G$3+0.0001)-LOG(G$2+0.0001)),2)","v":0.34},8.9999999999999969E-2,0.4,null,"HAVSC",1,null,3,0.1389,0.1515,"LAS",0.44]
["GM",0.56000000000000005,{"$f":"ROUND((LOG(B6+0.0001)-LOG(B$2+0.0001))/(LOG(B$3+0.0001)-LOG(B$2+0.0001)),2)","v":0.32},0.15,0.6,null,1,{"$f":"ROUND((LOG(G6+0.0001)-LOG(G$2+0.0001))/(LOG(G$3+0.0001)-LOG(G$2+0.0001)),2)","v":0.43},0.2,0.6,null,"HASH",2,null,4,0.1512,0.15079999999999999,"LAVS",0.46]
["HG",0.08,{"$f":"ROUND((LOG(B7+0.0001)-LOG(B$2+0.0001))/(LOG(B$3+0.0001)-LOG(B$2+0.0001)),2)","v":0.47},0.53,0.8,null,0.2,{"$f":"ROUND((LOG(G7+0.0001)-LOG(G$2+0.0001))/(LOG(G$3+0.0001)-LOG(G$2+0.0001)),2)","v":0.63},0.37,0.8,null,"HAVSH",1,null,5,0.20039999999999999,0.14699999999999999,"MAD",0.4425]
[null,null,null,null,null,null,null,null,null,null,null,"LADC",5,null,null,null,null,"MarlS",0.48899999999999999]
{"$rows_left_out":51}